{"text_format":"1","workbook":"xlsx","n_sheets":18,"sheets":["Instructions","Preferences","Scores","Results","Itinerary Chart","Program Chart","Itinerary Details","Itinerary Xref Chart","Tables","Detail Informaton","itineraryCamps","ItineraryPrograms","Descriptions","Calculator","Itineraries","Programs","Camp Programs","Camp Elevations"],"not_rendered":{"charts":8,"images":4,"macros":1,"external_links":0,"defined_names":165,"comments":2,"pivot_tables":0},"unopened":[{"sheet":"Itinerary Chart","index":4,"reason":"not_a_worksheet"},{"sheet":"Program Chart","index":5,"reason":"not_a_worksheet"}],"bounds":{"document_bytes":16777216,"sheet_cells":100000,"rows_first":2000,"rows_last":500,"rows_between":2000,"halvings":0,"cell_chars":16384,"cell_head_chars":4096},"cells_cut":0,"cells_raw":0,"read":"whole","date_system":"1900"}

{"sheet":"Instructions","index":0,"n_rows":8,"n_cols":6,"rows_kept":8,"cut":false,"hidden":false,"merged":[[5,1,5,16],[0,2,0,15],[3,1,3,15]]}
[null,null,"Philmont 2025 Itineraries - 12 Day Treks"]
[]
[]
[null,"Questions or suggestions regarding this spreadsheet may be e-mailed to the author Sid Covington at sid_c@swbell.net"]
[]
[null,{"$f":"\"Updated \"&getlastsavedate()&\" - Revision \" & getSpreadsheetProperty(\"Revision\")","v":"Updated 12/28/2024 6:53PM - Revision 2025_1-0"}]
[null,"     Revision History:",null,null,null,"Note:  Use Ctrl-F1 to show/hide the Excel ribbon"]
[null,null,"2025_1-0","Original 2025 Update"]

{"sheet":"Preferences","index":1,"n_rows":37,"n_cols":7,"rows_kept":37,"cut":false,"hidden":false,"merged":[[0,0,0,7],[3,4,5,7],[12,4,16,7],[9,6,9,7],[8,6,8,7],[7,6,7,7],[29,0,30,2],[24,0,25,2],[26,0,26,2],[17,0,17,2],[10,0,10,2],[21,0,21,2],[19,0,20,2]]}
["Set Crew preferences below"]
[]
["Philmont is divided into four areas.  Is it important to you",null,null,null,"Altitude Factors:"]
["which area you go to?","y",{"$f":"IF(UPPER(B4)=\"Y\",\"\",IF(UPPER(B4)=\"N\",\"\",\"ERROR-Must be Y or N\"))","v":""},null,"Altitude factors may be included or excluded from the calculations.  There are three different factors in the calculation that relate to altitude."]
["If it is important, rank your preference in 1, 2, 3, 4 order with"]
["  1 being the most preferred, 4 being least."]
["    South Country",3,{"$f":"IF(B7<1,\"ERROR-Must be in 1-4 range\",IF(B7>4,\"ERROR-Must be in 1-4 range\",\"\"))","v":""},null,"   Factor:","Include?"]
["    Central Country",4,{"$f":"IF(B8<1,\"ERROR-Must be in 1-4 range\",IF(B8>4,\"ERROR-Must be in 1-4 range\",\"\"))","v":""},null,"     Highest camp elevation:","n",{"$f":"IF(UPPER(F8)=\"Y\",\"\",IF(UPPER(F8)=\"N\",\"\",\"ERROR-enter a 'y' or 'n'\"))","v":""}]
["    North Country",1,{"$f":"IF(B9<1,\"ERROR-Must be in 1-4 range\",IF(B9>4,\"ERROR-Must be in 1-4 range\",\"\"))","v":""},null,"     Trek camp elevation change:","n",{"$f":"IF(UPPER(F9)=\"Y\",\"\",IF(UPPER(F9)=\"N\",\"\",\"ERROR-enter a 'y' or 'n'\"))","v":""}]
["    Valle Vidal",2,{"$f":"IF(B10<1,\"ERROR-Must be in 1-4 range\",IF(B10>4,\"ERROR-Must be in 1-4 range\",\"\"))","v":""},null,"     Average daily change:","y",{"$f":"IF(UPPER(F10)=\"Y\",\"\",IF(UPPER(F10)=\"N\",\"\",\"ERROR-enter a 'y' or 'n'\"))","v":""}]
[{"$f":"IF(LOWER(areaImportant)=\"y\",(IF(validAreaRanking(),\"\",\"ERROR—rank preferences 1 to 4\")),\"\")","v":""}]
[]
["Rate the capability of your crew on a scale of 1 to 10 with",null,null,null,"How much more important are programs than the other factors such as distance, country, altitude, Tooth of Time, etc. in your selection of an itinerary?  Enter y if programs are more important, n if should be treated as lower priority than other factors."]
["1 indicating a young crew with little backpacking experience"]
["and 10 indicating an older crew with a lot of experience."]
[]
["    Capability",6]
[{"$f":"IF(B17>0,IF(B17<11,\"\",\"ERROR-must be less than 10\"),\"ERROR-must be greater than 0\")","v":""},null,null,null,"  Programs more important?","y"]
[]
["Many itineraries return to Base Camp via bus but some hike in (not necessarily over the Tooth of Time)."]
[null,null,null,null,"Include Itineraries with an Itinerary Rating of:"]
["Is it important to hike into Base Camp?",null,null,null,null,null,"Include?"]
[null,"n",null,null,"Challenging","C","y"]
[null,null,null,null,"Rugged","R","y"]
["Most itineraries depart Base Camp to the trailhead by bus.  There are some that hike out of Base Camp to the first camp.",null,null,null,"Strenuous","S","y"]
[null,null,null,null,"Super Strenuous","SS","y"]
["Is it important to hike out of Base Camp?"]
[null,"n"]
[]
["A key part of a Philmont Trek is climbing peaks.  Is it important to you to climb the following peaks?"]
[]
["Baldy Peak","y"]
["Mount Phillips","y"]
["Tooth of Time","y"]
["Inspiration Point","y"]
["Trail Peak","n"]
["Others (Mountaineering)","n"]

{"sheet":"Scores","index":2,"n_rows":57,"n_cols":13,"rows_kept":57,"cut":false,"hidden":false,"merged":[]}
["Program:","Crewmember 1","Crewmember 2","Crewmember 3","Crewmember 4","Crewmember 5","Crewmember 6","Crewmember 7","Crewmember 8","Crewmember 9","Crewmember 10","Crewmember 11","Crewmember 12"]
[{"$f":"INDEX(program_table,ROW()-1)","v":"Climbing: Bouldering Gym"},15,15,15,15,15,15,15,15,15,15,2,0]
[{"$f":"INDEX(program_table,ROW()-1)","v":"Climbing: Climbing Wall/Tower"},20,20,20,20,20,20,20,19,18,17,16,15]
[{"$f":"INDEX(program_table,ROW()-1)","v":"Climbing: Crate Stacking"},2,13,10,2,0,7,13,10,2,0,7,10]
[{"$f":"INDEX(program_table,ROW()-1)","v":"Climbing: Rock Climbing"},18,18,18,18,18,18,18,18,18,18,5,3]
[{"$f":"INDEX(program_table,ROW()-1)","v":"COPE: High Challenge Course"},2,0,15,0,18,20,0,15,0,18,20,0]
[{"$f":"INDEX(program_table,ROW()-1)","v":"COPE: Initiative Games"},2,20,0,14,6,10,20,0,14,6,10,9]
[{"$f":"INDEX(program_table,ROW()-1)","v":"COPE: Low Challenge Course"},2,20,0,14,6,10,20,0,14,6,10,9]
[{"$f":"INDEX(program_table,ROW()-1)","v":"Ecology: Demonstration Forest"},2,5,15,0,20,7,5,15,0,0,7,8]
[{"$f":"INDEX(program_table,ROW()-1)","v":"Ecology: Self-Guided Fishing"},2,19,0,0,9,9,19,0,0,9,9,11]
[{"$f":"INDEX(program_table,ROW()-1)","v":"Evening: Abreu Family Dinner"},2,10,5,0,0,7,10,5,0,null,7,15]
[{"$f":"INDEX(program_table,ROW()-1)","v":"Evening: Advisor Coffee"},2,20,5,0,0,5,20,5,0,null,5,11]
[{"$f":"INDEX(program_table,ROW()-1)","v":"Evening: Campfire Show"},2,11,null,13,null,4,10,null,15,0,null,18]
[{"$f":"INDEX(program_table,ROW()-1)","v":"Evening: Chuckwagon Dinner"},2,10,0,13,0,4,10,0,13,0,4,18]
[{"$f":"INDEX(program_table,ROW()-1)","v":"Historical: Adobe Brick-Making"},2,13,10,2,null,7,13,10,2,0,7,10]
[{"$f":"INDEX(program_table,ROW()-1)","v":"Historical: Blacksmithing"},2,12,5,3,null,10,12,5,3,0,10,20]
[{"$f":"INDEX(program_table,ROW()-1)","v":"Historical: Cabin Restoration"},2,8,0,16,5,8,0,8,16,8,3,10]
[{"$f":"INDEX(program_table,ROW()-1)","v":"Historical: Cabin/House Tour"},2,1,1,17,6,4,1,1,17,6,4,11]
[{"$f":"INDEX(program_table,ROW()-1)","v":"Historical: Crafting"},2,10,6,15,10,5,10,0,null,1,20,18]
[{"$f":"INDEX(program_table,ROW()-1)","v":"Historical: Crosscut & Tie Making"},2,3,5,0,0,5,20,5,0,0,7,15]
[{"$f":"INDEX(program_table,ROW()-1)","v":"Historical: Flint Knapping"},2,2,15,18,0,10,2,15,18,0,10,12]
[{"$f":"INDEX(program_table,ROW()-1)","v":"Historical: Fur Trapper Rendezvous"},2,19,0,6,0,12,19,0,6,0,12,0]
[{"$f":"INDEX(program_table,ROW()-1)","v":"Historical: Gold Panning"},15,2,0,12,0,12,2,10,8,0,20,5]
[{"$f":"INDEX(program_table,ROW()-1)","v":"Historical: Mine Tour"},2,6,5,8,9,10,7,7,3,2,1,9]
[{"$f":"INDEX(program_table,ROW()-1)","v":"Historical: Petroglyph Tour"},2,null,15,null,18,20,0,15,0,18,20]
[{"$f":"INDEX(program_table,ROW()-1)","v":"Historical: Pump Car Rides"},2,16,10,15,0,20,16,10,15,0,20,10]
[{"$f":"INDEX(program_table,ROW()-1)","v":"Historical: Railroad Construction"},2,null,10,5,10,null,10,20,5,15,2,18]
[{"$f":"INDEX(program_table,ROW()-1)","v":"Historical: Spar Pole Climbing"},2,0,15,null,17,12,0,15,0,17,12,10]
[{"$f":"INDEX(program_table,ROW()-1)","v":"Landmarks: Baldy Mountain"},15,0,15,null,19,12,0,15,0,19,12,10]
[{"$f":"INDEX(program_table,ROW()-1)","v":"Landmarks: Inspiration Point"},15,0,15,null,12,12,0,15,null,12,12,10]
[{"$f":"INDEX(program_table,ROW()-1)","v":"Landmarks: Mount Phillips"},15,0,15,null,11,12,10,15,15,11,12,10]
[{"$f":"INDEX(program_table,ROW()-1)","v":"Landmarks: Mountaineering"},18,17,6,null,12,13,5,16,3,13,14,18]
[{"$f":"INDEX(program_table,ROW()-1)","v":"Landmarks: Tooth of Time"},10,0,5,null,16,9,0,5,0,16,null,0]
[{"$f":"INDEX(program_table,ROW()-1)","v":"Landmarks: Trail Peak"},19,20,null,14,7,10,20,null,14,7,2,8]
[{"$f":"INDEX(program_table,ROW()-1)","v":"Livestock: Animal Husbandry"},19,20,0,14,7,10,20,18,14,7,10,8]
[{"$f":"INDEX(program_table,ROW()-1)","v":"Livestock: Burro Packing"},18,5,10,5,19,20,null,10,15,5,14,19]
[{"$f":"INDEX(program_table,ROW()-1)","v":"Livestock: Chicken Tending"},20,5,16,20,20,1,15,15,null,18,20,20]
[{"$f":"INDEX(program_table,ROW()-1)","v":"Livestock: Horse Rides"},14,15,10,17,20,4,20,15,17,null,5,20]
[{"$f":"INDEX(program_table,ROW()-1)","v":"Low Impact Camping"},19,20,null,14,7,10,20,null,14,7,10,8]
[{"$f":"INDEX(program_table,ROW()-1)","v":"Range Sports: 3D Archery"},8,2,10,20,0,12,2,10,15,0,12,10]
[{"$f":"INDEX(program_table,ROW()-1)","v":"Range Sports: Aerial Archery"},10,5,5,7,4,12,5,5,7,4,12,15]
[{"$f":"INDEX(program_table,ROW()-1)","v":"Range Sports: Atlatl Throwing"},18,17,6,null,12,13,5,16,3,13,14,18]
[{"$f":"INDEX(program_table,ROW()-1)","v":"Range Sports: Cartridge Reloading"},15,10,20,15,12,20,10,6,10,5," ",15]
[{"$f":"INDEX(program_table,ROW()-1)","v":"Range Sports: Cowboy Action Shooting"},10,0,5,null,16,9,0,5,0,16,null,0]
[{"$f":"INDEX(program_table,ROW()-1)","v":"Range Sports: Field Archery"},19,20,null,14,7,10,20,null,14,7,2,8]
[{"$f":"INDEX(program_table,ROW()-1)","v":"Range Sports: Muzzleloader Shooting"},19,20,0,14,7,10,20,18,14,7,10,8]
[{"$f":"INDEX(program_table,ROW()-1)","v":"Range Sports: Rifle Shooting"},18,5,10,5,19,20,null,10,15,5,14,19]
[{"$f":"INDEX(program_table,ROW()-1)","v":"Range Sports: Shotgun Shooting"},20,5,16,20,20,1,15,15,null,18,20,20]
[{"$f":"INDEX(program_table,ROW()-1)","v":"Range Sports: Shotshell Reloading"},14,15,10,17,20,4,20,15,17,null,5,20]
[{"$f":"INDEX(program_table,ROW()-1)","v":"Range Sports: Tomahawk Throwing"},15,10,20,15,12,20,10,6,10,5," ",15]
[{"$f":"INDEX(program_table,ROW()-1)","v":"STEM: Archeology"},15,10,20,15,12,20,10,6,10,5," ",15]
[{"$f":"INDEX(program_table,ROW()-1)","v":"STEM: Astronomy"},10,0,5,null,16,9,0,5,0,16,null,0]
[{"$f":"INDEX(program_table,ROW()-1)","v":"STEM: Geology"},11,18,20,15,null,10,20,null,15,18,10,20]
[{"$f":"INDEX(program_table,ROW()-1)","v":"Western Lore: Branding"},11,18,null,0,null,10,20,null,0,null,10,20]
[{"$f":"INDEX(program_table,ROW()-1)","v":"Western Lore: Cantina"},20,14,16,20,20,null,15,15,12,18,20,20]
[{"$f":"INDEX(program_table,ROW()-1)","v":"Western Lore: Roping"},11,5,null,null,null,10,20,null,null,0,10,20]
[{"$f":"INDEX(program_table,ROW()-1)","v":"Wheeled: Mountain Biking"},15,10," ",10,8,5,8," ",14,8,5,10]

{"sheet":"Results","index":3,"n_rows":63,"n_cols":16,"rows_kept":63,"cut":false,"hidden":false,"merged":[[16,4,16,5],[1,10,1,15],[0,0,0,15],[1,8,2,8],[1,9,2,9],[1,4,2,4],[1,5,2,5]]}
["Philmont Trek Itinerary Selection"]
[null,null,null,null,"Choice",null,null,null,"# X's","Pgm Index","Top Itinerary/Program Cross Reference"]
["Itinerary","Classification","Distance",{"$f":"IF(meanMedian=\"Mean\",\"Average\",meanMedian) & \" Score\"","v":"Total Score"},null,null,"Program (by Popularity)","Value",null,null,"12-23","12-24","12-21","12-19","12-14","12-17"]
["12-23","Super Strenuous",76,17079.8,"#1",null,"Climbing: Climbing Wall/Tower",225,{"$f":"COUNTIF(K4:P4,\"X\")","v":3},2,{"$f":"IF($G4=0,\"\",IF(INDEX(itineraryPrograms,numericItinerary(K$3),$J4)=\"y\",\"X\",\"\"))","v":"X"},{"$f":"IF($G4=0,\"\",IF(INDEX(itineraryPrograms,numericItinerary(L$3),$J4)=\"y\",\"X\",\"\"))","v":""},{"$f":"IF($G4=0,\"\",IF(INDEX(itineraryPrograms,numericItinerary(M$3),$J4)=\"y\",\"X\",\"\"))","v":"X"},{"$f":"IF($G4=0,\"\",IF(INDEX(itineraryPrograms,numericItinerary(N$3),$J4)=\"y\",\"X\",\"\"))","v":""},{"$f":"IF($G4=0,\"\",IF(INDEX(itineraryPrograms,numericItinerary(O$3),$J4)=\"y\",\"X\",\"\"))","v":""},{"$f":"IF($G4=0,\"\",IF(INDEX(itineraryPrograms,numericItinerary(P$3),$J4)=\"y\",\"X\",\"\"))","v":"X"}]
["12-24","Super Strenuous",77,16854.3,"#2",null,"Western Lore: Cantina",190,2,54,{"$f":"IF($G5=0,\"\",IF(INDEX(itineraryPrograms,numericItinerary(K$3),$J5)=\"y\",\"X\",\"\"))","v":""},{"$f":"IF($G5=0,\"\",IF(INDEX(itineraryPrograms,numericItinerary(L$3),$J5)=\"y\",\"X\",\"\"))","v":"X"},{"$f":"IF($G5=0,\"\",IF(INDEX(itineraryPrograms,numericItinerary(M$3),$J5)=\"y\",\"X\",\"\"))","v":"X"},{"$f":"IF($G5=0,\"\",IF(INDEX(itineraryPrograms,numericItinerary(N$3),$J5)=\"y\",\"X\",\"\"))","v":""},{"$f":"IF($G5=0,\"\",IF(INDEX(itineraryPrograms,numericItinerary(O$3),$J5)=\"y\",\"X\",\"\"))","v":""},{"$f":"IF($G5=0,\"\",IF(INDEX(itineraryPrograms,numericItinerary(P$3),$J5)=\"y\",\"X\",\"\"))","v":""}]
["12-21","Super Strenuous",70,16361.3,"#3",null,"Climbing: Rock Climbing",188,5,4,{"$f":"IF($G6=0,\"\",IF(INDEX(itineraryPrograms,numericItinerary(K$3),$J6)=\"y\",\"X\",\"\"))","v":"X"},{"$f":"IF($G6=0,\"\",IF(INDEX(itineraryPrograms,numericItinerary(L$3),$J6)=\"y\",\"X\",\"\"))","v":"X"},{"$f":"IF($G6=0,\"\",IF(INDEX(itineraryPrograms,numericItinerary(M$3),$J6)=\"y\",\"X\",\"\"))","v":"X"},{"$f":"IF($G6=0,\"\",IF(INDEX(itineraryPrograms,numericItinerary(N$3),$J6)=\"y\",\"X\",\"\"))","v":""},{"$f":"IF($G6=0,\"\",IF(INDEX(itineraryPrograms,numericItinerary(O$3),$J6)=\"y\",\"X\",\"\"))","v":"X"},{"$f":"IF($G6=0,\"\",IF(INDEX(itineraryPrograms,numericItinerary(P$3),$J6)=\"y\",\"X\",\"\"))","v":"X"}]
["12-19","Strenuous",69,15945.8,"#4",null,"Range Sports: Cartridge Reloading",170,2,42,{"$f":"IF($G7=0,\"\",IF(INDEX(itineraryPrograms,numericItinerary(K$3),$J7)=\"y\",\"X\",\"\"))","v":""},{"$f":"IF($G7=0,\"\",IF(INDEX(itineraryPrograms,numericItinerary(L$3),$J7)=\"y\",\"X\",\"\"))","v":"X"},{"$f":"IF($G7=0,\"\",IF(INDEX(itineraryPrograms,numericItinerary(M$3),$J7)=\"y\",\"X\",\"\"))","v":""},{"$f":"IF($G7=0,\"\",IF(INDEX(itineraryPrograms,numericItinerary(N$3),$J7)=\"y\",\"X\",\"\"))","v":"X"},{"$f":"IF($G7=0,\"\",IF(INDEX(itineraryPrograms,numericItinerary(O$3),$J7)=\"y\",\"X\",\"\"))","v":""},{"$f":"IF($G7=0,\"\",IF(INDEX(itineraryPrograms,numericItinerary(P$3),$J7)=\"y\",\"X\",\"\"))","v":""}]
["12-14","Strenuous",78,15900.3,"#5",null,"Livestock: Chicken Tending",170,4,36,{"$f":"IF($G8=0,\"\",IF(INDEX(itineraryPrograms,numericItinerary(K$3),$J8)=\"y\",\"X\",\"\"))","v":""},{"$f":"IF($G8=0,\"\",IF(INDEX(itineraryPrograms,numericItinerary(L$3),$J8)=\"y\",\"X\",\"\"))","v":""},{"$f":"IF($G8=0,\"\",IF(INDEX(itineraryPrograms,numericItinerary(M$3),$J8)=\"y\",\"X\",\"\"))","v":"X"},{"$f":"IF($G8=0,\"\",IF(INDEX(itineraryPrograms,numericItinerary(N$3),$J8)=\"y\",\"X\",\"\"))","v":"X"},{"$f":"IF($G8=0,\"\",IF(INDEX(itineraryPrograms,numericItinerary(O$3),$J8)=\"y\",\"X\",\"\"))","v":"X"},{"$f":"IF($G8=0,\"\",IF(INDEX(itineraryPrograms,numericItinerary(P$3),$J8)=\"y\",\"X\",\"\"))","v":"X"}]
["12-17","Strenuous",61,15861.1,"#6",null,"Range Sports: Cowboy Action Shooting",157,0,43,{"$f":"IF($G9=0,\"\",IF(INDEX(itineraryPrograms,numericItinerary(K$3),$J9)=\"y\",\"X\",\"\"))","v":""},{"$f":"IF($G9=0,\"\",IF(INDEX(itineraryPrograms,numericItinerary(L$3),$J9)=\"y\",\"X\",\"\"))","v":""},{"$f":"IF($G9=0,\"\",IF(INDEX(itineraryPrograms,numericItinerary(M$3),$J9)=\"y\",\"X\",\"\"))","v":""},{"$f":"IF($G9=0,\"\",IF(INDEX(itineraryPrograms,numericItinerary(N$3),$J9)=\"y\",\"X\",\"\"))","v":""},{"$f":"IF($G9=0,\"\",IF(INDEX(itineraryPrograms,numericItinerary(O$3),$J9)=\"y\",\"X\",\"\"))","v":""},{"$f":"IF($G9=0,\"\",IF(INDEX(itineraryPrograms,numericItinerary(P$3),$J9)=\"y\",\"X\",\"\"))","v":""}]
["12-20","Super Strenuous",76,15650,null,null,"STEM: Geology",157,3,52,{"$f":"IF($G10=0,\"\",IF(INDEX(itineraryPrograms,numericItinerary(K$3),$J10)=\"y\",\"X\",\"\"))","v":""},{"$f":"IF($G10=0,\"\",IF(INDEX(itineraryPrograms,numericItinerary(L$3),$J10)=\"y\",\"X\",\"\"))","v":"X"},{"$f":"IF($G10=0,\"\",IF(INDEX(itineraryPrograms,numericItinerary(M$3),$J10)=\"y\",\"X\",\"\"))","v":"X"},{"$f":"IF($G10=0,\"\",IF(INDEX(itineraryPrograms,numericItinerary(N$3),$J10)=\"y\",\"X\",\"\"))","v":""},{"$f":"IF($G10=0,\"\",IF(INDEX(itineraryPrograms,numericItinerary(O$3),$J10)=\"y\",\"X\",\"\"))","v":""},{"$f":"IF($G10=0,\"\",IF(INDEX(itineraryPrograms,numericItinerary(P$3),$J10)=\"y\",\"X\",\"\"))","v":"X"}]
["12-22","Super Strenuous",68,15604.5,null,null,"Livestock: Horse Rides",157,2,37,{"$f":"IF($G11=0,\"\",IF(INDEX(itineraryPrograms,numericItinerary(K$3),$J11)=\"y\",\"X\",\"\"))","v":"X"},{"$f":"IF($G11=0,\"\",IF(INDEX(itineraryPrograms,numericItinerary(L$3),$J11)=\"y\",\"X\",\"\"))","v":""},{"$f":"IF($G11=0,\"\",IF(INDEX(itineraryPrograms,numericItinerary(M$3),$J11)=\"y\",\"X\",\"\"))","v":""},{"$f":"IF($G11=0,\"\",IF(INDEX(itineraryPrograms,numericItinerary(N$3),$J11)=\"y\",\"X\",\"\"))","v":""},{"$f":"IF($G11=0,\"\",IF(INDEX(itineraryPrograms,numericItinerary(O$3),$J11)=\"y\",\"X\",\"\"))","v":"X"},{"$f":"IF($G11=0,\"\",IF(INDEX(itineraryPrograms,numericItinerary(P$3),$J11)=\"y\",\"X\",\"\"))","v":""}]
["12-16","Strenuous",65,15386.1,null,null,"Climbing: Bouldering Gym",152,6,1,{"$f":"IF($G12=0,\"\",IF(INDEX(itineraryPrograms,numericItinerary(K$3),$J12)=\"y\",\"X\",\"\"))","v":"X"},{"$f":"IF($G12=0,\"\",IF(INDEX(itineraryPrograms,numericItinerary(L$3),$J12)=\"y\",\"X\",\"\"))","v":"X"},{"$f":"IF($G12=0,\"\",IF(INDEX(itineraryPrograms,numericItinerary(M$3),$J12)=\"y\",\"X\",\"\"))","v":"X"},{"$f":"IF($G12=0,\"\",IF(INDEX(itineraryPrograms,numericItinerary(N$3),$J12)=\"y\",\"X\",\"\"))","v":"X"},{"$f":"IF($G12=0,\"\",IF(INDEX(itineraryPrograms,numericItinerary(O$3),$J12)=\"y\",\"X\",\"\"))","v":"X"},{"$f":"IF($G12=0,\"\",IF(INDEX(itineraryPrograms,numericItinerary(P$3),$J12)=\"y\",\"X\",\"\"))","v":"X"}]
["12-15","Strenuous",63,15383.1,null,null,"Livestock: Animal Husbandry",147,4,34,{"$f":"IF($G13=0,\"\",IF(INDEX(itineraryPrograms,numericItinerary(K$3),$J13)=\"y\",\"X\",\"\"))","v":""},{"$f":"IF($G13=0,\"\",IF(INDEX(itineraryPrograms,numericItinerary(L$3),$J13)=\"y\",\"X\",\"\"))","v":""},{"$f":"IF($G13=0,\"\",IF(INDEX(itineraryPrograms,numericItinerary(M$3),$J13)=\"y\",\"X\",\"\"))","v":"X"},{"$f":"IF($G13=0,\"\",IF(INDEX(itineraryPrograms,numericItinerary(N$3),$J13)=\"y\",\"X\",\"\"))","v":"X"},{"$f":"IF($G13=0,\"\",IF(INDEX(itineraryPrograms,numericItinerary(O$3),$J13)=\"y\",\"X\",\"\"))","v":"X"},{"$f":"IF($G13=0,\"\",IF(INDEX(itineraryPrograms,numericItinerary(P$3),$J13)=\"y\",\"X\",\"\"))","v":"X"}]
["12-9","Rugged",61,15206.9,null,null,"Range Sports: Aerial Archery",147,null,40]
["12-12","Rugged",61,14965.9,null,null,"Livestock: Burro Packing",140,null,35]
["12-7","Rugged",69,14690.2,null,null,"Range Sports: Atlatl Throwing",140,0,41,{"$f":"IF($G16=0,\"\",IF(INDEX(itineraryPrograms,numericItinerary(K$3),$J16)=\"y\",\"X\",\"\"))","v":""},{"$f":"IF($G16=0,\"\",IF(INDEX(itineraryPrograms,numericItinerary(L$3),$J16)=\"y\",\"X\",\"\"))","v":""},{"$f":"IF($G16=0,\"\",IF(INDEX(itineraryPrograms,numericItinerary(M$3),$J16)=\"y\",\"X\",\"\"))","v":""},{"$f":"IF($G16=0,\"\",IF(INDEX(itineraryPrograms,numericItinerary(N$3),$J16)=\"y\",\"X\",\"\"))","v":""},{"$f":"IF($G16=0,\"\",IF(INDEX(itineraryPrograms,numericItinerary(O$3),$J16)=\"y\",\"X\",\"\"))","v":""},{"$f":"IF($G16=0,\"\",IF(INDEX(itineraryPrograms,numericItinerary(P$3),$J16)=\"y\",\"X\",\"\"))","v":""}]
["12-10","Rugged",53,14348.7,{"$f":"meanMedian & \" Score Selected\"","v":"Total Score Selected"},null,"STEM: Archeology",138,0,50,{"$f":"IF($G17=0,\"\",IF(INDEX(itineraryPrograms,numericItinerary(K$3),$J17)=\"y\",\"X\",\"\"))","v":""},{"$f":"IF($G17=0,\"\",IF(INDEX(itineraryPrograms,numericItinerary(L$3),$J17)=\"y\",\"X\",\"\"))","v":""},{"$f":"IF($G17=0,\"\",IF(INDEX(itineraryPrograms,numericItinerary(M$3),$J17)=\"y\",\"X\",\"\"))","v":""},{"$f":"IF($G17=0,\"\",IF(INDEX(itineraryPrograms,numericItinerary(N$3),$J17)=\"y\",\"X\",\"\"))","v":""},{"$f":"IF($G17=0,\"\",IF(INDEX(itineraryPrograms,numericItinerary(O$3),$J17)=\"y\",\"X\",\"\"))","v":""},{"$f":"IF($G17=0,\"\",IF(INDEX(itineraryPrograms,numericItinerary(P$3),$J17)=\"y\",\"X\",\"\"))","v":""}]
["12-18","Strenuous",64,14218.8,null,null,"Range Sports: Shotshell Reloading",138,1,48,{"$f":"IF($G18=0,\"\",IF(INDEX(itineraryPrograms,numericItinerary(K$3),$J18)=\"y\",\"X\",\"\"))","v":""},{"$f":"IF($G18=0,\"\",IF(INDEX(itineraryPrograms,numericItinerary(L$3),$J18)=\"y\",\"X\",\"\"))","v":""},{"$f":"IF($G18=0,\"\",IF(INDEX(itineraryPrograms,numericItinerary(M$3),$J18)=\"y\",\"X\",\"\"))","v":""},{"$f":"IF($G18=0,\"\",IF(INDEX(itineraryPrograms,numericItinerary(N$3),$J18)=\"y\",\"X\",\"\"))","v":""},{"$f":"IF($G18=0,\"\",IF(INDEX(itineraryPrograms,numericItinerary(O$3),$J18)=\"y\",\"X\",\"\"))","v":"X"},{"$f":"IF($G18=0,\"\",IF(INDEX(itineraryPrograms,numericItinerary(P$3),$J18)=\"y\",\"X\",\"\"))","v":""}]
["12-3","Rugged",71,14094.7,null,null,"Range Sports: Tomahawk Throwing",138,5,49,{"$f":"IF($G19=0,\"\",IF(INDEX(itineraryPrograms,numericItinerary(K$3),$J19)=\"y\",\"X\",\"\"))","v":"X"},{"$f":"IF($G19=0,\"\",IF(INDEX(itineraryPrograms,numericItinerary(L$3),$J19)=\"y\",\"X\",\"\"))","v":"X"},{"$f":"IF($G19=0,\"\",IF(INDEX(itineraryPrograms,numericItinerary(M$3),$J19)=\"y\",\"X\",\"\"))","v":"X"},{"$f":"IF($G19=0,\"\",IF(INDEX(itineraryPrograms,numericItinerary(N$3),$J19)=\"y\",\"X\",\"\"))","v":"X"},{"$f":"IF($G19=0,\"\",IF(INDEX(itineraryPrograms,numericItinerary(O$3),$J19)=\"y\",\"X\",\"\"))","v":""},{"$f":"IF($G19=0,\"\",IF(INDEX(itineraryPrograms,numericItinerary(P$3),$J19)=\"y\",\"X\",\"\"))","v":"X"}]
["12-13","Rugged",59,13910.9,null,null,"Range Sports: Shotgun Shooting",135,1,47,{"$f":"IF($G20=0,\"\",IF(INDEX(itineraryPrograms,numericItinerary(K$3),$J20)=\"y\",\"X\",\"\"))","v":""},{"$f":"IF($G20=0,\"\",IF(INDEX(itineraryPrograms,numericItinerary(L$3),$J20)=\"y\",\"X\",\"\"))","v":""},{"$f":"IF($G20=0,\"\",IF(INDEX(itineraryPrograms,numericItinerary(M$3),$J20)=\"y\",\"X\",\"\"))","v":""},{"$f":"IF($G20=0,\"\",IF(INDEX(itineraryPrograms,numericItinerary(N$3),$J20)=\"y\",\"X\",\"\"))","v":""},{"$f":"IF($G20=0,\"\",IF(INDEX(itineraryPrograms,numericItinerary(O$3),$J20)=\"y\",\"X\",\"\"))","v":"X"},{"$f":"IF($G20=0,\"\",IF(INDEX(itineraryPrograms,numericItinerary(P$3),$J20)=\"y\",\"X\",\"\"))","v":""}]
["12-11","Rugged",64,13800.9,null,null,"Landmarks: Mountaineering",135,5,31,{"$f":"IF($G21=0,\"\",IF(INDEX(itineraryPrograms,numericItinerary(K$3),$J21)=\"y\",\"X\",\"\"))","v":"X"},{"$f":"IF($G21=0,\"\",IF(INDEX(itineraryPrograms,numericItinerary(L$3),$J21)=\"y\",\"X\",\"\"))","v":"X"},{"$f":"IF($G21=0,\"\",IF(INDEX(itineraryPrograms,numericItinerary(M$3),$J21)=\"y\",\"X\",\"\"))","v":"X"},{"$f":"IF($G21=0,\"\",IF(INDEX(itineraryPrograms,numericItinerary(N$3),$J21)=\"y\",\"X\",\"\"))","v":"X"},{"$f":"IF($G21=0,\"\",IF(INDEX(itineraryPrograms,numericItinerary(O$3),$J21)=\"y\",\"X\",\"\"))","v":""},{"$f":"IF($G21=0,\"\",IF(INDEX(itineraryPrograms,numericItinerary(P$3),$J21)=\"y\",\"X\",\"\"))","v":"X"}]
["12-4","Challenging",58,13324.5,null,null,"Historical: Pump Car Rides",134,0,25,{"$f":"IF($G22=0,\"\",IF(INDEX(itineraryPrograms,numericItinerary(K$3),$J22)=\"y\",\"X\",\"\"))","v":""},{"$f":"IF($G22=0,\"\",IF(INDEX(itineraryPrograms,numericItinerary(L$3),$J22)=\"y\",\"X\",\"\"))","v":""},{"$f":"IF($G22=0,\"\",IF(INDEX(itineraryPrograms,numericItinerary(M$3),$J22)=\"y\",\"X\",\"\"))","v":""},{"$f":"IF($G22=0,\"\",IF(INDEX(itineraryPrograms,numericItinerary(N$3),$J22)=\"y\",\"X\",\"\"))","v":""},{"$f":"IF($G22=0,\"\",IF(INDEX(itineraryPrograms,numericItinerary(O$3),$J22)=\"y\",\"X\",\"\"))","v":""},{"$f":"IF($G22=0,\"\",IF(INDEX(itineraryPrograms,numericItinerary(P$3),$J22)=\"y\",\"X\",\"\"))","v":""}]
["12-8","Rugged",55,13309.2,null,null,"Low Impact Camping",129,2,38,{"$f":"IF($G23=0,\"\",IF(INDEX(itineraryPrograms,numericItinerary(K$3),$J23)=\"y\",\"X\",\"\"))","v":""},{"$f":"IF($G23=0,\"\",IF(INDEX(itineraryPrograms,numericItinerary(L$3),$J23)=\"y\",\"X\",\"\"))","v":""},{"$f":"IF($G23=0,\"\",IF(INDEX(itineraryPrograms,numericItinerary(M$3),$J23)=\"y\",\"X\",\"\"))","v":""},{"$f":"IF($G23=0,\"\",IF(INDEX(itineraryPrograms,numericItinerary(N$3),$J23)=\"y\",\"X\",\"\"))","v":""},{"$f":"IF($G23=0,\"\",IF(INDEX(itineraryPrograms,numericItinerary(O$3),$J23)=\"y\",\"X\",\"\"))","v":"X"},{"$f":"IF($G23=0,\"\",IF(INDEX(itineraryPrograms,numericItinerary(P$3),$J23)=\"y\",\"X\",\"\"))","v":"X"}]
["12-6","Rugged",53,13109.2,null,null,"Range Sports: Field Archery",129,2,44,{"$f":"IF($G24=0,\"\",IF(INDEX(itineraryPrograms,numericItinerary(K$3),$J24)=\"y\",\"X\",\"\"))","v":"X"},{"$f":"IF($G24=0,\"\",IF(INDEX(itineraryPrograms,numericItinerary(L$3),$J24)=\"y\",\"X\",\"\"))","v":""},{"$f":"IF($G24=0,\"\",IF(INDEX(itineraryPrograms,numericItinerary(M$3),$J24)=\"y\",\"X\",\"\"))","v":""},{"$f":"IF($G24=0,\"\",IF(INDEX(itineraryPrograms,numericItinerary(N$3),$J24)=\"y\",\"X\",\"\"))","v":""},{"$f":"IF($G24=0,\"\",IF(INDEX(itineraryPrograms,numericItinerary(O$3),$J24)=\"y\",\"X\",\"\"))","v":""},{"$f":"IF($G24=0,\"\",IF(INDEX(itineraryPrograms,numericItinerary(P$3),$J24)=\"y\",\"X\",\"\"))","v":"X"}]
["12-2","Challenging",58,12887,null,null,"Landmarks: Mount Phillips",126,3,30,{"$f":"IF($G25=0,\"\",IF(INDEX(itineraryPrograms,numericItinerary(K$3),$J25)=\"y\",\"X\",\"\"))","v":""},{"$f":"IF($G25=0,\"\",IF(INDEX(itineraryPrograms,numericItinerary(L$3),$J25)=\"y\",\"X\",\"\"))","v":""},{"$f":"IF($G25=0,\"\",IF(INDEX(itineraryPrograms,numericItinerary(M$3),$J25)=\"y\",\"X\",\"\"))","v":"X"},{"$f":"IF($G25=0,\"\",IF(INDEX(itineraryPrograms,numericItinerary(N$3),$J25)=\"y\",\"X\",\"\"))","v":"X"},{"$f":"IF($G25=0,\"\",IF(INDEX(itineraryPrograms,numericItinerary(O$3),$J25)=\"y\",\"X\",\"\"))","v":""},{"$f":"IF($G25=0,\"\",IF(INDEX(itineraryPrograms,numericItinerary(P$3),$J25)=\"y\",\"X\",\"\"))","v":"X"}]
["12-5","Challenging",54,12493,null,null,"Landmarks: Trail Peak",121,1,33,{"$f":"IF($G26=0,\"\",IF(INDEX(itineraryPrograms,numericItinerary(K$3),$J26)=\"y\",\"X\",\"\"))","v":""},{"$f":"IF($G26=0,\"\",IF(INDEX(itineraryPrograms,numericItinerary(L$3),$J26)=\"y\",\"X\",\"\"))","v":""},{"$f":"IF($G26=0,\"\",IF(INDEX(itineraryPrograms,numericItinerary(M$3),$J26)=\"y\",\"X\",\"\"))","v":""},{"$f":"IF($G26=0,\"\",IF(INDEX(itineraryPrograms,numericItinerary(N$3),$J26)=\"y\",\"X\",\"\"))","v":""},{"$f":"IF($G26=0,\"\",IF(INDEX(itineraryPrograms,numericItinerary(O$3),$J26)=\"y\",\"X\",\"\"))","v":""},{"$f":"IF($G26=0,\"\",IF(INDEX(itineraryPrograms,numericItinerary(P$3),$J26)=\"y\",\"X\",\"\"))","v":"X"}]
["12-1","Challenging",46,11826.5,null,null,"Landmarks: Baldy Mountain",117,2,28,{"$f":"IF($G27=0,\"\",IF(INDEX(itineraryPrograms,numericItinerary(K$3),$J27)=\"y\",\"X\",\"\"))","v":"X"},{"$f":"IF($G27=0,\"\",IF(INDEX(itineraryPrograms,numericItinerary(L$3),$J27)=\"y\",\"X\",\"\"))","v":"X"},{"$f":"IF($G27=0,\"\",IF(INDEX(itineraryPrograms,numericItinerary(M$3),$J27)=\"y\",\"X\",\"\"))","v":""},{"$f":"IF($G27=0,\"\",IF(INDEX(itineraryPrograms,numericItinerary(N$3),$J27)=\"y\",\"X\",\"\"))","v":""},{"$f":"IF($G27=0,\"\",IF(INDEX(itineraryPrograms,numericItinerary(O$3),$J27)=\"y\",\"X\",\"\"))","v":""},{"$f":"IF($G27=0,\"\",IF(INDEX(itineraryPrograms,numericItinerary(P$3),$J27)=\"y\",\"X\",\"\"))","v":""}]
["PREFERENCES:",null,null,null,null,null,"COPE: Initiative Games",111,4,6,{"$f":"IF($G28=0,\"\",IF(INDEX(itineraryPrograms,numericItinerary(K$3),$J28)=\"y\",\"X\",\"\"))","v":"X"},{"$f":"IF($G28=0,\"\",IF(INDEX(itineraryPrograms,numericItinerary(L$3),$J28)=\"y\",\"X\",\"\"))","v":"X"},{"$f":"IF($G28=0,\"\",IF(INDEX(itineraryPrograms,numericItinerary(M$3),$J28)=\"y\",\"X\",\"\"))","v":""},{"$f":"IF($G28=0,\"\",IF(INDEX(itineraryPrograms,numericItinerary(N$3),$J28)=\"y\",\"X\",\"\"))","v":"X"},{"$f":"IF($G28=0,\"\",IF(INDEX(itineraryPrograms,numericItinerary(O$3),$J28)=\"y\",\"X\",\"\"))","v":"X"},{"$f":"IF($G28=0,\"\",IF(INDEX(itineraryPrograms,numericItinerary(P$3),$J28)=\"y\",\"X\",\"\"))","v":""}]
["Area Important?",{"$f":"UPPER(areaImportant)","v":"Y"},null,null,null,null,"COPE: Low Challenge Course",111,4,7,{"$f":"IF($G29=0,\"\",IF(INDEX(itineraryPrograms,numericItinerary(K$3),$J29)=\"y\",\"X\",\"\"))","v":"X"},{"$f":"IF($G29=0,\"\",IF(INDEX(itineraryPrograms,numericItinerary(L$3),$J29)=\"y\",\"X\",\"\"))","v":"X"},{"$f":"IF($G29=0,\"\",IF(INDEX(itineraryPrograms,numericItinerary(M$3),$J29)=\"y\",\"X\",\"\"))","v":""},{"$f":"IF($G29=0,\"\",IF(INDEX(itineraryPrograms,numericItinerary(N$3),$J29)=\"y\",\"X\",\"\"))","v":"X"},{"$f":"IF($G29=0,\"\",IF(INDEX(itineraryPrograms,numericItinerary(O$3),$J29)=\"y\",\"X\",\"\"))","v":"X"},{"$f":"IF($G29=0,\"\",IF(INDEX(itineraryPrograms,numericItinerary(P$3),$J29)=\"y\",\"X\",\"\"))","v":""}]
["      South:",{"$f":"IF(UPPER(areaImportant)=\"Y\",Preferences!B7,\"\")","v":3},null,null,null,null,"Historical: Petroglyph Tour",108,0,24,{"$f":"IF($G30=0,\"\",IF(INDEX(itineraryPrograms,numericItinerary(K$3),$J30)=\"y\",\"X\",\"\"))","v":""},{"$f":"IF($G30=0,\"\",IF(INDEX(itineraryPrograms,numericItinerary(L$3),$J30)=\"y\",\"X\",\"\"))","v":""},{"$f":"IF($G30=0,\"\",IF(INDEX(itineraryPrograms,numericItinerary(M$3),$J30)=\"y\",\"X\",\"\"))","v":""},{"$f":"IF($G30=0,\"\",IF(INDEX(itineraryPrograms,numericItinerary(N$3),$J30)=\"y\",\"X\",\"\"))","v":""},{"$f":"IF($G30=0,\"\",IF(INDEX(itineraryPrograms,numericItinerary(O$3),$J30)=\"y\",\"X\",\"\"))","v":""},{"$f":"IF($G30=0,\"\",IF(INDEX(itineraryPrograms,numericItinerary(P$3),$J30)=\"y\",\"X\",\"\"))","v":""}]
["      Central:",{"$f":"IF(UPPER(areaImportant)=\"Y\",Preferences!B8,\"\")","v":4},null,null,null,null,"COPE: High Challenge Course",108,null,5]
["      North:",{"$f":"IF(UPPER(areaImportant)=\"Y\",Preferences!B9,\"\")","v":1},null,null,null,null,"Historical: Flint Knapping",104,null,20]
["      Valle Vidal:",{"$f":"IF(UPPER(areaImportant)=\"Y\",Preferences!B10,\"\")","v":2},null,null,null,null,"Landmarks: Inspiration Point",103,null,29]
["Capability:",{"$f":"skillLevel","v":6},null,null,null,null,"Range Sports: 3D Archery",101,null,39]
["Hike Out?",{"$f":"UPPER(hikeOut)","v":"N"},null,null,null,null,"Range Sports: Muzzleloader Shooting",101,null,45]
["Hike In/Tooth?",{"$f":"UPPER(hikeIn)","v":"N"},null,null,null,null,"Historical: Spar Pole Climbing",100,null,27]
["Max Altitude?",{"$f":"UPPER(altitudeMax)","v":"N"},null,null,null,null,"Historical: Crafting",97,null,18]
["Total elevation?",{"$f":"UPPER(altitudeChange)","v":"N"},null,null,null,null,"Historical: Railroad Construction",97,null,26]
["Daily change?",{"$f":"UPPER(altitudeDaily)","v":"Y"},null,null,null,null,"Wheeled: Mountain Biking",93,1,56,{"$f":"IF($G39=0,\"\",IF(INDEX(itineraryPrograms,numericItinerary(K$3),$J39)=\"y\",\"X\",\"\"))","v":""},{"$f":"IF($G39=0,\"\",IF(INDEX(itineraryPrograms,numericItinerary(L$3),$J39)=\"y\",\"X\",\"\"))","v":""},{"$f":"IF($G39=0,\"\",IF(INDEX(itineraryPrograms,numericItinerary(M$3),$J39)=\"y\",\"X\",\"\"))","v":""},{"$f":"IF($G39=0,\"\",IF(INDEX(itineraryPrograms,numericItinerary(N$3),$J39)=\"y\",\"X\",\"\"))","v":""},{"$f":"IF($G39=0,\"\",IF(INDEX(itineraryPrograms,numericItinerary(O$3),$J39)=\"y\",\"X\",\"\"))","v":"X"},{"$f":"IF($G39=0,\"\",IF(INDEX(itineraryPrograms,numericItinerary(P$3),$J39)=\"y\",\"X\",\"\"))","v":""}]
["Programs?",{"$f":"UPPER(programsImportant)","v":"Y"},null,null,null,null,"Range Sports: Rifle Shooting",91,2,46,{"$f":"IF($G40=0,\"\",IF(INDEX(itineraryPrograms,numericItinerary(K$3),$J40)=\"y\",\"X\",\"\"))","v":""},{"$f":"IF($G40=0,\"\",IF(INDEX(itineraryPrograms,numericItinerary(L$3),$J40)=\"y\",\"X\",\"\"))","v":"X"},{"$f":"IF($G40=0,\"\",IF(INDEX(itineraryPrograms,numericItinerary(M$3),$J40)=\"y\",\"X\",\"\"))","v":""},{"$f":"IF($G40=0,\"\",IF(INDEX(itineraryPrograms,numericItinerary(N$3),$J40)=\"y\",\"X\",\"\"))","v":"X"},{"$f":"IF($G40=0,\"\",IF(INDEX(itineraryPrograms,numericItinerary(O$3),$J40)=\"y\",\"X\",\"\"))","v":""},{"$f":"IF($G40=0,\"\",IF(INDEX(itineraryPrograms,numericItinerary(P$3),$J40)=\"y\",\"X\",\"\"))","v":""}]
[null,null,null,null,null,null,"Western Lore: Branding",89,6,53,{"$f":"IF($G41=0,\"\",IF(INDEX(itineraryPrograms,numericItinerary(K$3),$J41)=\"y\",\"X\",\"\"))","v":"X"},{"$f":"IF($G41=0,\"\",IF(INDEX(itineraryPrograms,numericItinerary(L$3),$J41)=\"y\",\"X\",\"\"))","v":"X"},{"$f":"IF($G41=0,\"\",IF(INDEX(itineraryPrograms,numericItinerary(M$3),$J41)=\"y\",\"X\",\"\"))","v":"X"},{"$f":"IF($G41=0,\"\",IF(INDEX(itineraryPrograms,numericItinerary(N$3),$J41)=\"y\",\"X\",\"\"))","v":"X"},{"$f":"IF($G41=0,\"\",IF(INDEX(itineraryPrograms,numericItinerary(O$3),$J41)=\"y\",\"X\",\"\"))","v":"X"},{"$f":"IF($G41=0,\"\",IF(INDEX(itineraryPrograms,numericItinerary(P$3),$J41)=\"y\",\"X\",\"\"))","v":"X"}]
[null,null,null,null,null,null,"Ecology: Self-Guided Fishing",87,3,9,{"$f":"IF($G42=0,\"\",IF(INDEX(itineraryPrograms,numericItinerary(K$3),$J42)=\"y\",\"X\",\"\"))","v":""},{"$f":"IF($G42=0,\"\",IF(INDEX(itineraryPrograms,numericItinerary(L$3),$J42)=\"y\",\"X\",\"\"))","v":""},{"$f":"IF($G42=0,\"\",IF(INDEX(itineraryPrograms,numericItinerary(M$3),$J42)=\"y\",\"X\",\"\"))","v":"X"},{"$f":"IF($G42=0,\"\",IF(INDEX(itineraryPrograms,numericItinerary(N$3),$J42)=\"y\",\"X\",\"\"))","v":""},{"$f":"IF($G42=0,\"\",IF(INDEX(itineraryPrograms,numericItinerary(O$3),$J42)=\"y\",\"X\",\"\"))","v":"X"},{"$f":"IF($G42=0,\"\",IF(INDEX(itineraryPrograms,numericItinerary(P$3),$J42)=\"y\",\"X\",\"\"))","v":"X"}]
[null,null,null,{"$f":"MIN(rankedScore)","v":11826.5},null,null,"Historical: Gold Panning",86,3,22,{"$f":"IF($G43=0,\"\",IF(INDEX(itineraryPrograms,numericItinerary(K$3),$J43)=\"y\",\"X\",\"\"))","v":""},{"$f":"IF($G43=0,\"\",IF(INDEX(itineraryPrograms,numericItinerary(L$3),$J43)=\"y\",\"X\",\"\"))","v":"X"},{"$f":"IF($G43=0,\"\",IF(INDEX(itineraryPrograms,numericItinerary(M$3),$J43)=\"y\",\"X\",\"\"))","v":"X"},{"$f":"IF($G43=0,\"\",IF(INDEX(itineraryPrograms,numericItinerary(N$3),$J43)=\"y\",\"X\",\"\"))","v":""},{"$f":"IF($G43=0,\"\",IF(INDEX(itineraryPrograms,numericItinerary(O$3),$J43)=\"y\",\"X\",\"\"))","v":""},{"$f":"IF($G43=0,\"\",IF(INDEX(itineraryPrograms,numericItinerary(P$3),$J43)=\"y\",\"X\",\"\"))","v":"X"}]
[null,null,null,{"$f":"MAX(rankedScore)","v":17079.8},null,null,"Historical: Cabin Restoration",84,null,16,{"$f":"IF($G44=0,\"\",IF(INDEX(itineraryPrograms,numericItinerary(K$3),$J44)=\"y\",\"X\",\"\"))","v":""},{"$f":"IF($G44=0,\"\",IF(INDEX(itineraryPrograms,numericItinerary(L$3),$J44)=\"y\",\"X\",\"\"))","v":""},{"$f":"IF($G44=0,\"\",IF(INDEX(itineraryPrograms,numericItinerary(M$3),$J44)=\"y\",\"X\",\"\"))","v":"X"},{"$f":"IF($G44=0,\"\",IF(INDEX(itineraryPrograms,numericItinerary(N$3),$J44)=\"y\",\"X\",\"\"))","v":""},{"$f":"IF($G44=0,\"\",IF(INDEX(itineraryPrograms,numericItinerary(O$3),$J44)=\"y\",\"X\",\"\"))","v":""},{"$f":"IF($G44=0,\"\",IF(INDEX(itineraryPrograms,numericItinerary(P$3),$J44)=\"y\",\"X\",\"\"))","v":""}]
[null,null,null,null,null,null,"Ecology: Demonstration Forest",84,null,8,{"$f":"IF($G45=0,\"\",IF(INDEX(itineraryPrograms,numericItinerary(K$3),$J45)=\"y\",\"X\",\"\"))","v":""},{"$f":"IF($G45=0,\"\",IF(INDEX(itineraryPrograms,numericItinerary(L$3),$J45)=\"y\",\"X\",\"\"))","v":"X"},{"$f":"IF($G45=0,\"\",IF(INDEX(itineraryPrograms,numericItinerary(M$3),$J45)=\"y\",\"X\",\"\"))","v":"X"},{"$f":"IF($G45=0,\"\",IF(INDEX(itineraryPrograms,numericItinerary(N$3),$J45)=\"y\",\"X\",\"\"))","v":""},{"$f":"IF($G45=0,\"\",IF(INDEX(itineraryPrograms,numericItinerary(O$3),$J45)=\"y\",\"X\",\"\"))","v":"X"},{"$f":"IF($G45=0,\"\",IF(INDEX(itineraryPrograms,numericItinerary(P$3),$J45)=\"y\",\"X\",\"\"))","v":""}]
[null,null,null,null,null,null,"Historical: Blacksmithing",82,null,15,{"$f":"IF($G46=0,\"\",IF(INDEX(itineraryPrograms,numericItinerary(K$3),$J46)=\"y\",\"X\",\"\"))","v":""},{"$f":"IF($G46=0,\"\",IF(INDEX(itineraryPrograms,numericItinerary(L$3),$J46)=\"y\",\"X\",\"\"))","v":"X"},{"$f":"IF($G46=0,\"\",IF(INDEX(itineraryPrograms,numericItinerary(M$3),$J46)=\"y\",\"X\",\"\"))","v":"X"},{"$f":"IF($G46=0,\"\",IF(INDEX(itineraryPrograms,numericItinerary(N$3),$J46)=\"y\",\"X\",\"\"))","v":""},{"$f":"IF($G46=0,\"\",IF(INDEX(itineraryPrograms,numericItinerary(O$3),$J46)=\"y\",\"X\",\"\"))","v":""},{"$f":"IF($G46=0,\"\",IF(INDEX(itineraryPrograms,numericItinerary(P$3),$J46)=\"y\",\"X\",\"\"))","v":"X"}]
[null,null,null,null,null,null,"Historical: Adobe Brick-Making",76,null,14,{"$f":"IF($G47=0,\"\",IF(INDEX(itineraryPrograms,numericItinerary(K$3),$J47)=\"y\",\"X\",\"\"))","v":""},{"$f":"IF($G47=0,\"\",IF(INDEX(itineraryPrograms,numericItinerary(L$3),$J47)=\"y\",\"X\",\"\"))","v":""},{"$f":"IF($G47=0,\"\",IF(INDEX(itineraryPrograms,numericItinerary(M$3),$J47)=\"y\",\"X\",\"\"))","v":"X"},{"$f":"IF($G47=0,\"\",IF(INDEX(itineraryPrograms,numericItinerary(N$3),$J47)=\"y\",\"X\",\"\"))","v":""},{"$f":"IF($G47=0,\"\",IF(INDEX(itineraryPrograms,numericItinerary(O$3),$J47)=\"y\",\"X\",\"\"))","v":""},{"$f":"IF($G47=0,\"\",IF(INDEX(itineraryPrograms,numericItinerary(P$3),$J47)=\"y\",\"X\",\"\"))","v":""}]
[null,null,null,null,null,null,"Historical: Fur Trapper Rendezvous",76,null,21,{"$f":"IF($G48=0,\"\",IF(INDEX(itineraryPrograms,numericItinerary(K$3),$J48)=\"y\",\"X\",\"\"))","v":"X"},{"$f":"IF($G48=0,\"\",IF(INDEX(itineraryPrograms,numericItinerary(L$3),$J48)=\"y\",\"X\",\"\"))","v":"X"},{"$f":"IF($G48=0,\"\",IF(INDEX(itineraryPrograms,numericItinerary(M$3),$J48)=\"y\",\"X\",\"\"))","v":""},{"$f":"IF($G48=0,\"\",IF(INDEX(itineraryPrograms,numericItinerary(N$3),$J48)=\"y\",\"X\",\"\"))","v":""},{"$f":"IF($G48=0,\"\",IF(INDEX(itineraryPrograms,numericItinerary(O$3),$J48)=\"y\",\"X\",\"\"))","v":""},{"$f":"IF($G48=0,\"\",IF(INDEX(itineraryPrograms,numericItinerary(P$3),$J48)=\"y\",\"X\",\"\"))","v":""}]
[null,null,null,null,null,null,"Western Lore: Roping",76,null,55,{"$f":"IF($G49=0,\"\",IF(INDEX(itineraryPrograms,numericItinerary(K$3),$J49)=\"y\",\"X\",\"\"))","v":"X"},{"$f":"IF($G49=0,\"\",IF(INDEX(itineraryPrograms,numericItinerary(L$3),$J49)=\"y\",\"X\",\"\"))","v":"X"},{"$f":"IF($G49=0,\"\",IF(INDEX(itineraryPrograms,numericItinerary(M$3),$J49)=\"y\",\"X\",\"\"))","v":"X"},{"$f":"IF($G49=0,\"\",IF(INDEX(itineraryPrograms,numericItinerary(N$3),$J49)=\"y\",\"X\",\"\"))","v":"X"},{"$f":"IF($G49=0,\"\",IF(INDEX(itineraryPrograms,numericItinerary(O$3),$J49)=\"y\",\"X\",\"\"))","v":""},{"$f":"IF($G49=0,\"\",IF(INDEX(itineraryPrograms,numericItinerary(P$3),$J49)=\"y\",\"X\",\"\"))","v":"X"}]
[null,null,null,null,null,null,"Climbing: Crate Stacking",76,null,3]
[null,null,null,null,null,null,"Evening: Chuckwagon Dinner",74,null,13]
[null,null,null,null,null,null,"Evening: Campfire Show",73,null,12,{"$f":"IF($G52=0,\"\",IF(INDEX(itineraryPrograms,numericItinerary(K$3),$J52)=\"y\",\"X\",\"\"))","v":"X"},{"$f":"IF($G52=0,\"\",IF(INDEX(itineraryPrograms,numericItinerary(L$3),$J52)=\"y\",\"X\",\"\"))","v":"X"},{"$f":"IF($G52=0,\"\",IF(INDEX(itineraryPrograms,numericItinerary(M$3),$J52)=\"y\",\"X\",\"\"))","v":"X"},{"$f":"IF($G52=0,\"\",IF(INDEX(itineraryPrograms,numericItinerary(N$3),$J52)=\"y\",\"X\",\"\"))","v":"X"},{"$f":"IF($G52=0,\"\",IF(INDEX(itineraryPrograms,numericItinerary(O$3),$J52)=\"y\",\"X\",\"\"))","v":"X"},{"$f":"IF($G52=0,\"\",IF(INDEX(itineraryPrograms,numericItinerary(P$3),$J52)=\"y\",\"X\",\"\"))","v":"X"}]
[null,null,null,null,null,null,"Evening: Advisor Coffee",73,null,11,{"$f":"IF($G53=0,\"\",IF(INDEX(itineraryPrograms,numericItinerary(K$3),$J53)=\"y\",\"X\",\"\"))","v":"X"},{"$f":"IF($G53=0,\"\",IF(INDEX(itineraryPrograms,numericItinerary(L$3),$J53)=\"y\",\"X\",\"\"))","v":"X"},{"$f":"IF($G53=0,\"\",IF(INDEX(itineraryPrograms,numericItinerary(M$3),$J53)=\"y\",\"X\",\"\"))","v":"X"},{"$f":"IF($G53=0,\"\",IF(INDEX(itineraryPrograms,numericItinerary(N$3),$J53)=\"y\",\"X\",\"\"))","v":"X"},{"$f":"IF($G53=0,\"\",IF(INDEX(itineraryPrograms,numericItinerary(O$3),$J53)=\"y\",\"X\",\"\"))","v":"X"},{"$f":"IF($G53=0,\"\",IF(INDEX(itineraryPrograms,numericItinerary(P$3),$J53)=\"y\",\"X\",\"\"))","v":"X"}]
[null,null,null,null,null,null,"Historical: Cabin/House Tour",71,null,17,{"$f":"IF($G54=0,\"\",IF(INDEX(itineraryPrograms,numericItinerary(K$3),$J54)=\"y\",\"X\",\"\"))","v":""},{"$f":"IF($G54=0,\"\",IF(INDEX(itineraryPrograms,numericItinerary(L$3),$J54)=\"y\",\"X\",\"\"))","v":""},{"$f":"IF($G54=0,\"\",IF(INDEX(itineraryPrograms,numericItinerary(M$3),$J54)=\"y\",\"X\",\"\"))","v":"X"},{"$f":"IF($G54=0,\"\",IF(INDEX(itineraryPrograms,numericItinerary(N$3),$J54)=\"y\",\"X\",\"\"))","v":"X"},{"$f":"IF($G54=0,\"\",IF(INDEX(itineraryPrograms,numericItinerary(O$3),$J54)=\"y\",\"X\",\"\"))","v":"X"},{"$f":"IF($G54=0,\"\",IF(INDEX(itineraryPrograms,numericItinerary(P$3),$J54)=\"y\",\"X\",\"\"))","v":"X"}]
[null,null,null,null,null,null,"Historical: Mine Tour",69,null,23,{"$f":"IF($G55=0,\"\",IF(INDEX(itineraryPrograms,numericItinerary(K$3),$J55)=\"y\",\"X\",\"\"))","v":""},{"$f":"IF($G55=0,\"\",IF(INDEX(itineraryPrograms,numericItinerary(L$3),$J55)=\"y\",\"X\",\"\"))","v":"X"},{"$f":"IF($G55=0,\"\",IF(INDEX(itineraryPrograms,numericItinerary(M$3),$J55)=\"y\",\"X\",\"\"))","v":"X"},{"$f":"IF($G55=0,\"\",IF(INDEX(itineraryPrograms,numericItinerary(N$3),$J55)=\"y\",\"X\",\"\"))","v":""},{"$f":"IF($G55=0,\"\",IF(INDEX(itineraryPrograms,numericItinerary(O$3),$J55)=\"y\",\"X\",\"\"))","v":""},{"$f":"IF($G55=0,\"\",IF(INDEX(itineraryPrograms,numericItinerary(P$3),$J55)=\"y\",\"X\",\"\"))","v":"X"}]
[null,null,null,null,null,null,"Historical: Crosscut & Tie Making",62,null,19,{"$f":"IF($G56=0,\"\",IF(INDEX(itineraryPrograms,numericItinerary(K$3),$J56)=\"y\",\"X\",\"\"))","v":"X"},{"$f":"IF($G56=0,\"\",IF(INDEX(itineraryPrograms,numericItinerary(L$3),$J56)=\"y\",\"X\",\"\"))","v":"X"},{"$f":"IF($G56=0,\"\",IF(INDEX(itineraryPrograms,numericItinerary(M$3),$J56)=\"y\",\"X\",\"\"))","v":"X"},{"$f":"IF($G56=0,\"\",IF(INDEX(itineraryPrograms,numericItinerary(N$3),$J56)=\"y\",\"X\",\"\"))","v":""},{"$f":"IF($G56=0,\"\",IF(INDEX(itineraryPrograms,numericItinerary(O$3),$J56)=\"y\",\"X\",\"\"))","v":"X"},{"$f":"IF($G56=0,\"\",IF(INDEX(itineraryPrograms,numericItinerary(P$3),$J56)=\"y\",\"X\",\"\"))","v":"X"}]
[null,null,null,null,null,null,"STEM: Astronomy",61,null,51,{"$f":"IF($G57=0,\"\",IF(INDEX(itineraryPrograms,numericItinerary(K$3),$J57)=\"y\",\"X\",\"\"))","v":""},{"$f":"IF($G57=0,\"\",IF(INDEX(itineraryPrograms,numericItinerary(L$3),$J57)=\"y\",\"X\",\"\"))","v":""},{"$f":"IF($G57=0,\"\",IF(INDEX(itineraryPrograms,numericItinerary(M$3),$J57)=\"y\",\"X\",\"\"))","v":""},{"$f":"IF($G57=0,\"\",IF(INDEX(itineraryPrograms,numericItinerary(N$3),$J57)=\"y\",\"X\",\"\"))","v":""},{"$f":"IF($G57=0,\"\",IF(INDEX(itineraryPrograms,numericItinerary(O$3),$J57)=\"y\",\"X\",\"\"))","v":"X"},{"$f":"IF($G57=0,\"\",IF(INDEX(itineraryPrograms,numericItinerary(P$3),$J57)=\"y\",\"X\",\"\"))","v":""}]
[null,null,null,null,null,null,"Evening: Abreu Family Dinner",61,{"$f":"COUNTIF(K58:P58,\"X\")","v":1},10,{"$f":"IF($G58=0,\"\",IF(INDEX(itineraryPrograms,numericItinerary(K$3),$J58)=\"y\",\"X\",\"\"))","v":""},{"$f":"IF($G58=0,\"\",IF(INDEX(itineraryPrograms,numericItinerary(L$3),$J58)=\"y\",\"X\",\"\"))","v":""},{"$f":"IF($G58=0,\"\",IF(INDEX(itineraryPrograms,numericItinerary(M$3),$J58)=\"y\",\"X\",\"\"))","v":"X"},{"$f":"IF($G58=0,\"\",IF(INDEX(itineraryPrograms,numericItinerary(N$3),$J58)=\"y\",\"X\",\"\"))","v":""},{"$f":"IF($G58=0,\"\",IF(INDEX(itineraryPrograms,numericItinerary(O$3),$J58)=\"y\",\"X\",\"\"))","v":""},{"$f":"IF($G58=0,\"\",IF(INDEX(itineraryPrograms,numericItinerary(P$3),$J58)=\"y\",\"X\",\"\"))","v":""}]
[null,null,null,null,null,null,"Landmarks: Tooth of Time",61,{"$f":"COUNTIF(K59:P59,\"X\")","v":5},32,{"$f":"IF($G59=0,\"\",IF(INDEX(itineraryPrograms,numericItinerary(K$3),$J59)=\"y\",\"X\",\"\"))","v":"X"},{"$f":"IF($G59=0,\"\",IF(INDEX(itineraryPrograms,numericItinerary(L$3),$J59)=\"y\",\"X\",\"\"))","v":"X"},{"$f":"IF($G59=0,\"\",IF(INDEX(itineraryPrograms,numericItinerary(M$3),$J59)=\"y\",\"X\",\"\"))","v":"X"},{"$f":"IF($G59=0,\"\",IF(INDEX(itineraryPrograms,numericItinerary(N$3),$J59)=\"y\",\"X\",\"\"))","v":"X"},{"$f":"IF($G59=0,\"\",IF(INDEX(itineraryPrograms,numericItinerary(O$3),$J59)=\"y\",\"X\",\"\"))","v":""},{"$f":"IF($G59=0,\"\",IF(INDEX(itineraryPrograms,numericItinerary(P$3),$J59)=\"y\",\"X\",\"\"))","v":"X"}]
[null,null,null,null,null,null,null,93,null,49,{"$f":"COUNTIF(K3:K58,\"X\")","v":16},21,24,15,19,22]
[null,null,null,null,null,null,null,0,null,50,{"$f":"K3","v":"12-23"},"12-24","12-21","12-19","12-14","12-17"]
[null,null,null,null,null,null,null,{"$f":"MIN(H4:H59)","v":61},"Min"]
[null,null,null,null,null,null,null,{"$f":"MAX(H4:H59)","v":225},"Max"]

{"sheet":"Itinerary Details","index":6,"n_rows":29,"n_cols":34,"rows_kept":29,"cut":false,"hidden":false,"merged":[[21,1,21,2],[21,4,21,9],[21,12,21,13],[21,15,21,17],[27,11,27,13],[24,12,24,13],[25,12,25,13],[26,12,26,13],[26,1,26,2],[26,4,26,9],[24,4,24,9],[25,4,25,9],[24,1,24,2],[25,1,25,2],[22,12,22,13],[23,12,23,13],[0,0,0,18],[15,4,15,9],[16,4,16,9],[5,0,5,1],[6,0,6,1],[7,0,7,1],[8,0,8,1],[9,0,9,1],[10,0,10,1],[4,4,4,5],[5,4,5,5],[14,4,14,8],[1,3,1,18],[6,4,6,5],[9,3,10,6],[4,10,4,11],[22,4,22,9],[23,4,23,9],[15,1,15,2],[16,1,16,2],[16,12,16,13],[22,1,22,2],[23,1,23,2],[15,12,15,13],[17,1,17,2],[17,4,17,9],[17,12,17,13],[18,1,18,2],[18,4,18,9],[18,12,18,13],[20,1,20,2],[20,4,20,9],[5,10,5,11],[4,14,4,16],[5,14,5,16],[14,15,14,17],[11,1,11,18],[12,1,12,18],[7,4,7,5],[8,4,8,5],[14,12,14,13],[13,10,13,13],[7,10,7,14],[23,15,23,17],[24,15,24,17],[25,15,25,17],[26,15,26,17],[15,15,15,17],[16,15,16,17],[22,15,22,17],[17,15,17,17],[18,15,18,17],[20,12,20,13],[20,15,20,17],[19,1,19,2],[19,4,19,9],[19,12,19,13],[19,15,19,17]]}
["Itinerary Information"]
["Itinerary Number:",null,"12-1"]
["Expedition Number:",null,"608-A"]
[null,null," "]
["Classification:",null,{"$f":"VLOOKUP(INDEX(classification,numericItinerary(itineraryNumber)),difficultyTable,2)","v":"Challenging"},null,"Staffed Camps:",null,{"$f":"getNcamps(\"Staff\",itineraryNumber)","v":"5"},null,null,"Area(s):",{"$f":"getCountry(numericItinerary(itineraryNumber))","v":"South"},null,null,"Starting:",{"$f":"AA28","v":"Zastrow Trailhead"}]
["Distance:",null,{"$f":"INDEX(distance,numericItinerary(itineraryNumber))","v":46},null,"Trail Camps:",null,{"$f":"getNcamps(\"Trail\",itineraryNumber)","v":"5"},null,null,"Map(s):",{"$f":"getMaps(numericItinerary(itineraryNumber))","v":"South"},null,null,"Ending:",{"$f":"AB28","v":"Hike In"}]
["Initial/Max Days Food:",null,{"$f":"getFoodDays(itineraryNumber)","v":"3/3"},null,"Layovers:",null,{"$f":"getNcamps(\"Layover\",itineraryNumber)","v":"1"}]
["Return via Tooth:",null,{"$f":"IF(INDEX(viaTooth,numericItinerary(itineraryNumber))=\"y\",\"Yes\",\"No\")","v":"Yes"},null,"Dry Camps",null,{"$f":"getNcamps(\"Dry\",itineraryNumber)","v":"1"},null,null,"Peaks:",{"$f":"getPeakS(numericItinerary(itineraryNumber))","v":"Baldy Mountain"}]
["Min/Max Altitude:",null,{"$f":"getAltitude(\"Min\",itineraryNumber) & \"/\" & getAltitude(\"Max\",itineraryNumber)","v":"7,217/9,409"},null,"Showers",null,{"$f":"COUNTIF(nShowers,\"y\")","v":1}]
["Total Altitude Change:",null,{"$f":"getAltitude(\"Chg\",itineraryNumber)","v":"2,192"},"Elevation information shown here is based on beginning/ending campsite altitudes, not any peaks or side hikes."]
["Daily Altitude Change:",null,{"$f":"getAltitude(\"Avg\",itineraryNumber)","v":"548"}]
["Description:",{"$f":"INDEX(descriptions,numericItinerary(itineraryNumber))","v":"Introduce yourself to much of Philmont's South Country in this twelve day program-focused expedition. You'll have plenty of opportunity to take advantage of a mix of high adventure and living history programs while taking in beautiful views of rivers, meadows, mesas, and peaks. Starting at the Zastrow Trailhead you'll head up in elevation and make your way to Stonewall pass with views into the plains. From there you'll continue into the mountains reaching the beautiful Beaubien Meadow and traverse the canyons to Philmont's Southwest region. Follow the Rayado river back east and head and over Urraca Mesa to enjoy scenic views of the Tooth of Time from the Lover's Leap region. If the crew is up to it, you'll have the opportunity to hike to the very top of this iconic rock formation before heading back to base camp!"}]
["Programs:",{"$f":"getPrograms(numericItinerary(itineraryNumber))","v":"Climbing: Climbing Wall/Tower, COPE: High Challenge Course, COPE: Initiative Games, COPE: Low Challenge Course, Ecology: Self-Guided Fishing, Evening: Abreu Family Dinner, Evening: Advisor Coffee, Evening: Campfire Show, Historical: Adobe Brick-Making, Historical: Cabin/House Tour, Historical: Crafting, Historical: Crosscut & Tie Making, Historical: Flint Knapping, Historical: Spar Pole Climbing, Landmarks: Inspiration Point, Landmarks: Tooth of Time, Livestock: Animal Husbandry, Livestock: Chicken Tending, Range Sports: 3D Archery, Range Sports: Aerial Archery, Western Lore: Branding, Western Lore: Cantina, Western Lore: Roping"}]
[null,null,null,null,null,null,null,null,null,null,"UTM Coordinates"]
[null,"Date:",null,"Day","Campsite",null,null,null,null,null,"Elevation","Easting","Northing",null,"Food Pickup","Cross US-64",null,null,null,null,null,null,null,"Elevation","Change","Date","Day","CAMP","Type","Dry","Showers","Commissary","Trading Post","Map"]
[null,{"$f":"AA16 & \" (\" & TEXT(Z16,\"m/d/yyyy\") & \")\"","v":"Sunday (6/8/2025)"},null,1,"Camping HQ",null,null,null,null,null,{"$f":"TEXT(INDEX(campLocation,MATCH(AB16,camps,0),5),\"##,##0\")","v":"6,696"},{"$f":"INDEX(campInfo,MATCH(AB16,camps),3)","v":503848},{"$f":"INDEX(campInfo,MATCH(AB16,camps),4)","v":4034364},null,null,{"$f":"getUS64crossingdirection(itineraryNumber,D16)","v":""},null,null,null,null,null,null,null,{"$f":"INT(K16)","v":6696},0,{"$f":"expeditionStartDate(itinExpeditionNo)","v":"2025-06-08"},{"$f":"INDEX({\"Sunday\",\"Monday\",\"Tuesday\",\"Wednesday\",\"Thursday\",\"Friday\",\"Saturday\"},WEEKDAY(Z16))","v":"Sunday"},"Camping HQ",null,{"$f":"INDEX(campInfo,MATCH($AB16,camps),10)","v":""},{"$f":"INDEX(campInfo,MATCH($AB16,camps),11)","v":""},{"$f":"INDEX(campInfo,MATCH($AB16,camps),6)","v":""},{"$f":"INDEX(campInfo,MATCH($AB16,camps),7)","v":""},{"$f":"VLOOKUP($AB16,campInfo,12)","v":"South"}]
[null,{"$f":"AA17 & \" (\" & TEXT(Z17,\"m/d/yyyy\") & \")\"","v":"Monday (6/9/2025)"},null,{"$f":"D16+1","v":2},{"$f":"getCampWithInfo(AB17,AC17,AD17,AE17,AF17,AG17)","v":"Toothache Springs"},null,null,null,null,null,"7,870",500750,4028216,null,{"$f":"INDEX(foodPickups,numericItinerary(itineraryNumber),D17-1)","v":"Camping HQ"},{"$f":"getUS64crossingdirection(itineraryNumber,D17)","v":""},null,null,null,null,null,null,null,7870,{"$f":"X17-X16","v":1174},{"$f":"Z16+1","v":"2025-06-09"},{"$f":"INDEX({\"Sunday\",\"Monday\",\"Tuesday\",\"Wednesday\",\"Thursday\",\"Friday\",\"Saturday\"},WEEKDAY(Z17))","v":"Monday"},"Toothache Springs",{"$f":"IF(VLOOKUP($AB17,campInfo,8)=\"Y\",\"Staff\",\"Trail\")","v":"Trail"},{"$f":"VLOOKUP($AB17,campInfo,10)","v":""},{"$f":"VLOOKUP($AB17,campInfo,11)","v":""},{"$f":"VLOOKUP($AB17,campInfo,6)","v":""},{"$f":"VLOOKUP($AB17,campInfo,7)","v":""},"South"]
[null,{"$f":"AA18 & \" (\" & TEXT(Z18,\"m/d/yyyy\") & \")\"","v":"Tuesday (6/10/2025)"},null,{"$f":"D17+1","v":3},{"$f":"getCampWithInfo(AB18,AC18,AD18,AE18,AF18,AG18)","v":"CRATER LAKE"},null,null,null,null,null,{"$f":"TEXT(INDEX(campLocation,MATCH(AB18,camps,0),5),\"##,##0\")","v":"8,398"},495609,4028935,null,{"$f":"INDEX(foodPickups,numericItinerary(itineraryNumber),D18-1)","v":0},{"$f":"getUS64crossingdirection(itineraryNumber,D18)","v":""},null,null,null,null,null,null,null,{"$f":"INT(K18)","v":8398},{"$f":"X18-X17","v":528},{"$f":"Z17+1","v":"2025-06-10"},{"$f":"INDEX({\"Sunday\",\"Monday\",\"Tuesday\",\"Wednesday\",\"Thursday\",\"Friday\",\"Saturday\"},WEEKDAY(Z18))","v":"Tuesday"},"Crater Lake","Staff","","","","","South"]
[null,{"$f":"AA19 & \" (\" & TEXT(Z19,\"m/d/yyyy\") & \")\"","v":"Wednesday (6/11/2025)"},null,4,{"$f":"getCampWithInfo(AB19,AC19,AD19,AE19,AF19,AG19)","v":"Lower Bonito"},null,null,null,null,null,{"$f":"TEXT(INDEX(campLocation,MATCH(AB19,camps,0),5),\"##,##0\")","v":"8,962"},493583,4027520,null,{"$f":"INDEX(foodPickups,numericItinerary(itineraryNumber),D19-1)","v":0},{"$f":"getUS64crossingdirection(itineraryNumber,D19)","v":""},null,null,null,null,null,null,null,{"$f":"INT(K19)","v":8962},564,"2025-06-11",{"$f":"INDEX({\"Sunday\",\"Monday\",\"Tuesday\",\"Wednesday\",\"Thursday\",\"Friday\",\"Saturday\"},WEEKDAY(Z19))","v":"Wednesday"},"Lower Bonito","Trail","","","","","South"]
[null,{"$f":"AA20 & \" (\" & TEXT(Z20,\"m/d/yyyy\") & \")\"","v":"Thursday (6/12/2025)"},null,5,{"$f":"getCampWithInfo(AB20,AC20,AD20,AE20,AF20,AG20)","v":"Buck Creek"},null,null,null,null,null,{"$f":"TEXT(INDEX(campLocation,MATCH(AB20,camps,0),5),\"##,##0\")","v":"9,131"},488296,4029577,null,{"$f":"INDEX(foodPickups,numericItinerary(itineraryNumber),D20-1)","v":"Phillips Junction"},{"$f":"getUS64crossingdirection(itineraryNumber,D20)","v":""},null,null,null,null,null,null,null,{"$f":"INT(K20)","v":9131},169,"2025-06-12",{"$f":"INDEX({\"Sunday\",\"Monday\",\"Tuesday\",\"Wednesday\",\"Thursday\",\"Friday\",\"Saturday\"},WEEKDAY(Z20))","v":"Thursday"},"Buck Creek","Trail","","","","","South"]
[null,{"$f":"AA21 & \" (\" & TEXT(Z21,\"m/d/yyyy\") & \")\"","v":"Friday (6/13/2025)"},null,6,{"$f":"getCampWithInfo(AB21,AC21,AD21,AE21,AF21,AG21)","v":"APACHE SPRINGS (Commissary)"},null,null,null,null,null,{"$f":"TEXT(INDEX(campLocation,MATCH(AB21,camps,0),5),\"##,##0\")","v":"9,409"},487072,4026937,null,{"$f":"INDEX(foodPickups,numericItinerary(itineraryNumber),D21-1)","v":0},{"$f":"getUS64crossingdirection(itineraryNumber,D21)","v":""},null,null,null,null,null,null,null,{"$f":"INT(K21)","v":9409},278,"2025-06-13",{"$f":"INDEX({\"Sunday\",\"Monday\",\"Tuesday\",\"Wednesday\",\"Thursday\",\"Friday\",\"Saturday\"},WEEKDAY(Z21))","v":"Friday"},"Apache Springs","Staff","","","Y","","South"]
[null,{"$f":"AA22 & \" (\" & TEXT(Z22,\"m/d/yyyy\") & \")\"","v":"Saturday (6/14/2025)"},null,7,{"$f":"getCampWithInfo(AB22,AC22,AD22,AE22,AF22,AG22)","v":"APACHE SPRINGS (Commissary)"},null,null,null,null,null,{"$f":"TEXT(INDEX(campLocation,MATCH(AB22,camps,0),5),\"##,##0\")","v":"9,409"},487072,4026937,null,{"$f":"INDEX(foodPickups,numericItinerary(itineraryNumber),D22-1)","v":"Apache Springs"},{"$f":"getUS64crossingdirection(itineraryNumber,D22)","v":""},null,null,null,null,null,null,null,{"$f":"INT(K22)","v":9409},0,"2025-06-14",{"$f":"INDEX({\"Sunday\",\"Monday\",\"Tuesday\",\"Wednesday\",\"Thursday\",\"Friday\",\"Saturday\"},WEEKDAY(Z22))","v":"Saturday"},"Apache Springs","Staff","","","Y","","South"]
[null,"Sunday (6/15/2025)",null,8,{"$f":"getCampWithInfo(AB23,AC23,AD23,AE23,AF23,AG23)","v":"Fish Camp"},null,null,null,null,null,"8,564",490787,4026964,null,{"$f":"INDEX(foodPickups,numericItinerary(itineraryNumber),D23-1)","v":0},{"$f":"getUS64crossingdirection(itineraryNumber,D23)","v":""},null,null,null,null,null,null,null,8564,-845,"2025-06-15",{"$f":"INDEX({\"Sunday\",\"Monday\",\"Tuesday\",\"Wednesday\",\"Thursday\",\"Friday\",\"Saturday\"},WEEKDAY(Z23))","v":"Sunday"},"Fish Camp","Trail","","","","","South"]
[null,"Monday (6/16/2025)",null,9,{"$f":"getCampWithInfo(AB24,AC24,AD24,AE24,AF24,AG24)","v":"ABREU (Showers)"},null,null,null,null,null,"7,217",498586,4025999,null,{"$f":"INDEX(foodPickups,numericItinerary(itineraryNumber),D24-1)","v":0},{"$f":"getUS64crossingdirection(itineraryNumber,D24)","v":""},null,null,null,null,null,null,null,7217,-1347,"2025-06-16",{"$f":"INDEX({\"Sunday\",\"Monday\",\"Tuesday\",\"Wednesday\",\"Thursday\",\"Friday\",\"Saturday\"},WEEKDAY(Z24))","v":"Monday"},"Abreu","Staff","","Y","","","South"]
[null,"Tuesday (6/17/2025)",null,10,{"$f":"getCampWithInfo(AB25,AC25,AD25,AE25,AF25,AG25)","v":"URRACA"},null,null,null,null,null,"7,968",500851,4029314,null,{"$f":"INDEX(foodPickups,numericItinerary(itineraryNumber),D25-1)","v":0},{"$f":"getUS64crossingdirection(itineraryNumber,D25)","v":""},null,null,null,null,null,null,null,7968,751,"2025-06-17",{"$f":"INDEX({\"Sunday\",\"Monday\",\"Tuesday\",\"Wednesday\",\"Thursday\",\"Friday\",\"Saturday\"},WEEKDAY(Z25))","v":"Tuesday"},"Urraca","Staff","","","","","South"]
[null,"Wednesday (6/18/2025)",null,11,{"$f":"getCampWithInfo(AB26,AC26,AD26,AE26,AF26,AG26)","v":"Stockade Ridge (Dry)"},null,null,null,null,null,"7,519",499296,4032487,null,{"$f":"INDEX(foodPickups,numericItinerary(itineraryNumber),D26-1)","v":0},{"$f":"getUS64crossingdirection(itineraryNumber,D26)","v":""},null,null,null,null,null,null,null,7519,-449,"2025-06-18",{"$f":"INDEX({\"Sunday\",\"Monday\",\"Tuesday\",\"Wednesday\",\"Thursday\",\"Friday\",\"Saturday\"},WEEKDAY(Z26))","v":"Wednesday"},"Stockade Ridge","Trail","Y","","","","South"]
[null,"Thursday (6/19/2025)",null,12,"Camping HQ",null,null,null,null,null,"6,696",503848,4034364,null,null,{"$f":"getUS64crossingdirection(itineraryNumber,D27)","v":""},null,null,null,null,null,null,null,6696,-823,"2025-06-19",{"$f":"INDEX({\"Sunday\",\"Monday\",\"Tuesday\",\"Wednesday\",\"Thursday\",\"Friday\",\"Saturday\"},WEEKDAY(Z27))","v":"Thursday"},"Camping HQ",null,{"$f":"INDEX(campInfo,MATCH($AB27,camps),10)","v":""},{"$f":"INDEX(campInfo,MATCH($AB27,camps),11)","v":""},{"$f":"INDEX(campInfo,MATCH($AB27,camps),6)","v":""},{"$f":"INDEX(campInfo,MATCH($AB27,camps),7)","v":""},"South"]
[null,null,null,null,null,null,null,null,null,null,null,"NAD 3/Zone 13\n* Estimated coordinates",null,null,null,null,null,null,null,null,null,null,null,null,null,null,{"$f":"getstartendinfo(\"S\",itineraryNumber)","v":"Zastrow Trailhead"},"Hike In"]
[null,null,null,null,null,null,null,null,null,null,null,null,null,null,null,null,null,null,null,null,null,null,null,null,null,null,null,"BASE"]

{"sheet":"Itinerary Xref Chart","index":7,"n_rows":65,"n_cols":28,"rows_kept":65,"cut":false,"hidden":false,"merged":[[0,1,4,1],[61,0,61,1]]}
["ITINERARY NUMBERS:","# times in \nItineraries",{"$f":"INDEX(itineraryNumbers,COLUMN()-2)","v":"12-1"},{"$f":"INDEX(itineraryNumbers,COLUMN()-2)","v":"12-2"},{"$f":"INDEX(itineraryNumbers,COLUMN()-2)","v":"12-3"},{"$f":"INDEX(itineraryNumbers,COLUMN()-2)","v":"12-4"},{"$f":"INDEX(itineraryNumbers,COLUMN()-2)","v":"12-5"},{"$f":"INDEX(itineraryNumbers,COLUMN()-2)","v":"12-6"},{"$f":"INDEX(itineraryNumbers,COLUMN()-2)","v":"12-7"},{"$f":"INDEX(itineraryNumbers,COLUMN()-2)","v":"12-8"},{"$f":"INDEX(itineraryNumbers,COLUMN()-2)","v":"12-9"},{"$f":"INDEX(itineraryNumbers,COLUMN()-2)","v":"12-10"},{"$f":"INDEX(itineraryNumbers,COLUMN()-2)","v":"12-11"},{"$f":"INDEX(itineraryNumbers,COLUMN()-2)","v":"12-12"},{"$f":"INDEX(itineraryNumbers,COLUMN()-2)","v":"12-13"},{"$f":"INDEX(itineraryNumbers,COLUMN()-2)","v":"12-14"},{"$f":"INDEX(itineraryNumbers,COLUMN()-2)","v":"12-15"},{"$f":"INDEX(itineraryNumbers,COLUMN()-2)","v":"12-16"},{"$f":"INDEX(itineraryNumbers,COLUMN()-2)","v":"12-17"},{"$f":"INDEX(itineraryNumbers,COLUMN()-2)","v":"12-18"},{"$f":"INDEX(itineraryNumbers,COLUMN()-2)","v":"12-19"},{"$f":"INDEX(itineraryNumbers,COLUMN()-2)","v":"12-20"},{"$f":"INDEX(itineraryNumbers,COLUMN()-2)","v":"12-21"},{"$f":"INDEX(itineraryNumbers,COLUMN()-2)","v":"12-22"},{"$f":"INDEX(itineraryNumbers,COLUMN()-2)","v":"12-23"},{"$f":"INDEX(itineraryNumbers,COLUMN()-2)","v":"12-24"},null,"Check"]
["Hiking Difficulty",null,{"$f":"INDEX(classification,numericItinerary(C1))","v":"C"},{"$f":"INDEX(classification,numericItinerary(D1))","v":"C"},{"$f":"INDEX(classification,numericItinerary(E1))","v":"R"},{"$f":"INDEX(classification,numericItinerary(F1))","v":"C"},{"$f":"INDEX(classification,numericItinerary(G1))","v":"C"},{"$f":"INDEX(classification,numericItinerary(H1))","v":"R"},{"$f":"INDEX(classification,numericItinerary(I1))","v":"R"},{"$f":"INDEX(classification,numericItinerary(J1))","v":"R"},{"$f":"INDEX(classification,numericItinerary(K1))","v":"R"},{"$f":"INDEX(classification,numericItinerary(L1))","v":"R"},{"$f":"INDEX(classification,numericItinerary(M1))","v":"R"},{"$f":"INDEX(classification,numericItinerary(N1))","v":"R"},{"$f":"INDEX(classification,numericItinerary(O1))","v":"R"},{"$f":"INDEX(classification,numericItinerary(P1))","v":"S"},{"$f":"INDEX(classification,numericItinerary(Q1))","v":"S"},{"$f":"INDEX(classification,numericItinerary(R1))","v":"S"},{"$f":"INDEX(classification,numericItinerary(S1))","v":"S"},{"$f":"INDEX(classification,numericItinerary(T1))","v":"S"},{"$f":"INDEX(classification,numericItinerary(U1))","v":"S"},{"$f":"INDEX(classification,numericItinerary(V1))","v":"SS"},{"$f":"INDEX(classification,numericItinerary(W1))","v":"SS"},{"$f":"INDEX(classification,numericItinerary(X1))","v":"SS"},{"$f":"INDEX(classification,numericItinerary(Y1))","v":"SS"},{"$f":"INDEX(classification,numericItinerary(Z1))","v":"SS"}]
["Distance (Approximately)",null,{"$f":"INDEX(distance,numericItinerary(C1))","v":46},{"$f":"INDEX(distance,numericItinerary(D1))","v":58},{"$f":"INDEX(distance,numericItinerary(E1))","v":71},{"$f":"INDEX(distance,numericItinerary(F1))","v":58},{"$f":"INDEX(distance,numericItinerary(G1))","v":54},{"$f":"INDEX(distance,numericItinerary(H1))","v":53},{"$f":"INDEX(distance,numericItinerary(I1))","v":69},{"$f":"INDEX(distance,numericItinerary(J1))","v":55},{"$f":"INDEX(distance,numericItinerary(K1))","v":61},{"$f":"INDEX(distance,numericItinerary(L1))","v":53},{"$f":"INDEX(distance,numericItinerary(M1))","v":64},{"$f":"INDEX(distance,numericItinerary(N1))","v":61},{"$f":"INDEX(distance,numericItinerary(O1))","v":59},{"$f":"INDEX(distance,numericItinerary(P1))","v":78},{"$f":"INDEX(distance,numericItinerary(Q1))","v":63},{"$f":"INDEX(distance,numericItinerary(R1))","v":65},{"$f":"INDEX(distance,numericItinerary(S1))","v":61},{"$f":"INDEX(distance,numericItinerary(T1))","v":64},{"$f":"INDEX(distance,numericItinerary(U1))","v":69},{"$f":"INDEX(distance,numericItinerary(V1))","v":76},{"$f":"INDEX(distance,numericItinerary(W1))","v":70},{"$f":"INDEX(distance,numericItinerary(X1))","v":68},{"$f":"INDEX(distance,numericItinerary(Y1))","v":76},{"$f":"INDEX(distance,numericItinerary(Z1))","v":77},null,{"$f":"SUM(C3:Z3)","v":1529}]
["Trail Camps",null,{"$f":"countcamps(itineraryTrail,numericItinerary(C$1))","v":5},{"$f":"countcamps(itineraryTrail,numericItinerary(D$1))","v":7},{"$f":"countcamps(itineraryTrail,numericItinerary(E$1))","v":5},{"$f":"countcamps(itineraryTrail,numericItinerary(F$1))","v":5},{"$f":"countcamps(itineraryTrail,numericItinerary(G$1))","v":6},{"$f":"countcamps(itineraryTrail,numericItinerary(H$1))","v":5},{"$f":"countcamps(itineraryTrail,numericItinerary(I$1))","v":6},{"$f":"countcamps(itineraryTrail,numericItinerary(J$1))","v":7},{"$f":"countcamps(itineraryTrail,numericItinerary(K$1))","v":4},{"$f":"countcamps(itineraryTrail,numericItinerary(L$1))","v":6},{"$f":"countcamps(itineraryTrail,numericItinerary(M$1))","v":4},{"$f":"countcamps(itineraryTrail,numericItinerary(N$1))","v":6},{"$f":"countcamps(itineraryTrail,numericItinerary(O$1))","v":5},{"$f":"countcamps(itineraryTrail,numericItinerary(P$1))","v":4},{"$f":"countcamps(itineraryTrail,numericItinerary(Q$1))","v":4},{"$f":"countcamps(itineraryTrail,numericItinerary(R$1))","v":6},{"$f":"countcamps(itineraryTrail,numericItinerary(S$1))","v":4},{"$f":"countcamps(itineraryTrail,numericItinerary(T$1))","v":5},{"$f":"countcamps(itineraryTrail,numericItinerary(U$1))","v":6},{"$f":"countcamps(itineraryTrail,numericItinerary(V$1))","v":5},{"$f":"countcamps(itineraryTrail,numericItinerary(W$1))","v":3},{"$f":"countcamps(itineraryTrail,numericItinerary(X$1))","v":4},{"$f":"countcamps(itineraryTrail,numericItinerary(Y$1))","v":5},{"$f":"countcamps(itineraryTrail,numericItinerary(Z$1))","v":6},null,{"$f":"SUM(C4:Z4)","v":123}]
["Dry Camps",null,{"$f":"countcamps(itineraryStaff,numericItinerary(C$1))","v":5},{"$f":"countcamps(itineraryStaff,numericItinerary(D$1))","v":3},{"$f":"countcamps(itineraryStaff,numericItinerary(E$1))","v":5},{"$f":"countcamps(itineraryStaff,numericItinerary(F$1))","v":5},{"$f":"countcamps(itineraryStaff,numericItinerary(G$1))","v":4},{"$f":"countcamps(itineraryStaff,numericItinerary(H$1))","v":5},{"$f":"countcamps(itineraryStaff,numericItinerary(I$1))","v":4},{"$f":"countcamps(itineraryStaff,numericItinerary(J$1))","v":3},{"$f":"countcamps(itineraryStaff,numericItinerary(K$1))","v":6},{"$f":"countcamps(itineraryStaff,numericItinerary(L$1))","v":4},{"$f":"countcamps(itineraryStaff,numericItinerary(M$1))","v":6},{"$f":"countcamps(itineraryStaff,numericItinerary(N$1))","v":4},{"$f":"countcamps(itineraryStaff,numericItinerary(O$1))","v":5},{"$f":"countcamps(itineraryStaff,numericItinerary(P$1))","v":6},{"$f":"countcamps(itineraryStaff,numericItinerary(Q$1))","v":6},{"$f":"countcamps(itineraryStaff,numericItinerary(R$1))","v":4},{"$f":"countcamps(itineraryStaff,numericItinerary(S$1))","v":6},{"$f":"countcamps(itineraryStaff,numericItinerary(T$1))","v":5},{"$f":"countcamps(itineraryStaff,numericItinerary(U$1))","v":4},{"$f":"countcamps(itineraryStaff,numericItinerary(V$1))","v":5},{"$f":"countcamps(itineraryStaff,numericItinerary(W$1))","v":7},{"$f":"countcamps(itineraryStaff,numericItinerary(X$1))","v":6},{"$f":"countcamps(itineraryStaff,numericItinerary(Y$1))","v":5},{"$f":"countcamps(itineraryStaff,numericItinerary(Z$1))","v":4},null,{"$f":"SUM(C5:Z5)","v":117}]
[{"$f":"INDEX(program_table,ROW()-5)","v":"Climbing: Bouldering Gym"},{"$f":"COUNTIF(C6:Z6,\"X\")","v":13},{"$f":"getProgramXref($A6,numericItinerary(C$1))","v":""},{"$f":"getProgramXref($A6,numericItinerary(D$1))","v":""},{"$f":"getProgramXref($A6,numericItinerary(E$1))","v":""},{"$f":"getProgramXref($A6,numericItinerary(F$1))","v":""},{"$f":"getProgramXref($A6,numericItinerary(G$1))","v":""},{"$f":"getProgramXref($A6,numericItinerary(H$1))","v":"x"},{"$f":"getProgramXref($A6,numericItinerary(I$1))","v":""},{"$f":"getProgramXref($A6,numericItinerary(J$1))","v":""},{"$f":"getProgramXref($A6,numericItinerary(K$1))","v":"x"},{"$f":"getProgramXref($A6,numericItinerary(L$1))","v":""},{"$f":"getProgramXref($A6,numericItinerary(M$1))","v":"x"},{"$f":"getProgramXref($A6,numericItinerary(N$1))","v":"x"},{"$f":"getProgramXref($A6,numericItinerary(O$1))","v":"x"},{"$f":"getProgramXref($A6,numericItinerary(P$1))","v":"x"},{"$f":"getProgramXref($A6,numericItinerary(Q$1))","v":"x"},{"$f":"getProgramXref($A6,numericItinerary(R$1))","v":"x"},{"$f":"getProgramXref($A6,numericItinerary(S$1))","v":"x"},{"$f":"getProgramXref($A6,numericItinerary(T$1))","v":""},{"$f":"getProgramXref($A6,numericItinerary(U$1))","v":"x"},{"$f":"getProgramXref($A6,numericItinerary(V$1))","v":""},{"$f":"getProgramXref($A6,numericItinerary(W$1))","v":"x"},{"$f":"getProgramXref($A6,numericItinerary(X$1))","v":""},{"$f":"getProgramXref($A6,numericItinerary(Y$1))","v":"x"},{"$f":"getProgramXref($A6,numericItinerary(Z$1))","v":"x"},null,{"$f":"COUNTIF(C6:Z6,\"X\")","v":13}]
[{"$f":"INDEX(program_table,ROW()-5)","v":"Climbing: Climbing Wall/Tower"},9,{"$f":"getProgramXref($A7,numericItinerary(C$1))","v":"x"},{"$f":"getProgramXref($A7,numericItinerary(D$1))","v":""},{"$f":"getProgramXref($A7,numericItinerary(E$1))","v":""},{"$f":"getProgramXref($A7,numericItinerary(F$1))","v":""},{"$f":"getProgramXref($A7,numericItinerary(G$1))","v":""},{"$f":"getProgramXref($A7,numericItinerary(H$1))","v":"x"},{"$f":"getProgramXref($A7,numericItinerary(I$1))","v":""},{"$f":"getProgramXref($A7,numericItinerary(J$1))","v":""},{"$f":"getProgramXref($A7,numericItinerary(K$1))","v":""},{"$f":"getProgramXref($A7,numericItinerary(L$1))","v":""},{"$f":"getProgramXref($A7,numericItinerary(M$1))","v":""},{"$f":"getProgramXref($A7,numericItinerary(N$1))","v":"x"},{"$f":"getProgramXref($A7,numericItinerary(O$1))","v":"x"},{"$f":"getProgramXref($A7,numericItinerary(P$1))","v":""},{"$f":"getProgramXref($A7,numericItinerary(Q$1))","v":"x"},{"$f":"getProgramXref($A7,numericItinerary(R$1))","v":"x"},{"$f":"getProgramXref($A7,numericItinerary(S$1))","v":"x"},{"$f":"getProgramXref($A7,numericItinerary(T$1))","v":""},{"$f":"getProgramXref($A7,numericItinerary(U$1))","v":""},{"$f":"getProgramXref($A7,numericItinerary(V$1))","v":""},{"$f":"getProgramXref($A7,numericItinerary(W$1))","v":"x"},{"$f":"getProgramXref($A7,numericItinerary(X$1))","v":""},{"$f":"getProgramXref($A7,numericItinerary(Y$1))","v":"x"},{"$f":"getProgramXref($A7,numericItinerary(Z$1))","v":""},null,9]
[{"$f":"INDEX(program_table,ROW()-5)","v":"Climbing: Crate Stacking"},8,{"$f":"getProgramXref($A8,numericItinerary(C$1))","v":""},{"$f":"getProgramXref($A8,numericItinerary(D$1))","v":""},{"$f":"getProgramXref($A8,numericItinerary(E$1))","v":""},{"$f":"getProgramXref($A8,numericItinerary(F$1))","v":""},{"$f":"getProgramXref($A8,numericItinerary(G$1))","v":""},{"$f":"getProgramXref($A8,numericItinerary(H$1))","v":"x"},{"$f":"getProgramXref($A8,numericItinerary(I$1))","v":""},{"$f":"getProgramXref($A8,numericItinerary(J$1))","v":""},{"$f":"getProgramXref($A8,numericItinerary(K$1))","v":""},{"$f":"getProgramXref($A8,numericItinerary(L$1))","v":""},{"$f":"getProgramXref($A8,numericItinerary(M$1))","v":""},{"$f":"getProgramXref($A8,numericItinerary(N$1))","v":"x"},{"$f":"getProgramXref($A8,numericItinerary(O$1))","v":"x"},{"$f":"getProgramXref($A8,numericItinerary(P$1))","v":""},{"$f":"getProgramXref($A8,numericItinerary(Q$1))","v":"x"},{"$f":"getProgramXref($A8,numericItinerary(R$1))","v":"x"},{"$f":"getProgramXref($A8,numericItinerary(S$1))","v":"x"},{"$f":"getProgramXref($A8,numericItinerary(T$1))","v":""},{"$f":"getProgramXref($A8,numericItinerary(U$1))","v":""},{"$f":"getProgramXref($A8,numericItinerary(V$1))","v":""},{"$f":"getProgramXref($A8,numericItinerary(W$1))","v":"x"},{"$f":"getProgramXref($A8,numericItinerary(X$1))","v":""},{"$f":"getProgramXref($A8,numericItinerary(Y$1))","v":"x"},{"$f":"getProgramXref($A8,numericItinerary(Z$1))","v":""},null,8]
[{"$f":"INDEX(program_table,ROW()-5)","v":"Climbing: Rock Climbing"},13,{"$f":"getProgramXref($A9,numericItinerary(C$1))","v":""},{"$f":"getProgramXref($A9,numericItinerary(D$1))","v":"x"},{"$f":"getProgramXref($A9,numericItinerary(E$1))","v":""},{"$f":"getProgramXref($A9,numericItinerary(F$1))","v":""},{"$f":"getProgramXref($A9,numericItinerary(G$1))","v":""},{"$f":"getProgramXref($A9,numericItinerary(H$1))","v":"x"},{"$f":"getProgramXref($A9,numericItinerary(I$1))","v":""},{"$f":"getProgramXref($A9,numericItinerary(J$1))","v":""},{"$f":"getProgramXref($A9,numericItinerary(K$1))","v":"x"},{"$f":"getProgramXref($A9,numericItinerary(L$1))","v":""},{"$f":"getProgramXref($A9,numericItinerary(M$1))","v":""},{"$f":"getProgramXref($A9,numericItinerary(N$1))","v":"x"},{"$f":"getProgramXref($A9,numericItinerary(O$1))","v":"x"},{"$f":"getProgramXref($A9,numericItinerary(P$1))","v":"x"},{"$f":"getProgramXref($A9,numericItinerary(Q$1))","v":"x"},{"$f":"getProgramXref($A9,numericItinerary(R$1))","v":"x"},{"$f":"getProgramXref($A9,numericItinerary(S$1))","v":"x"},{"$f":"getProgramXref($A9,numericItinerary(T$1))","v":""},{"$f":"getProgramXref($A9,numericItinerary(U$1))","v":""},{"$f":"getProgramXref($A9,numericItinerary(V$1))","v":""},{"$f":"getProgramXref($A9,numericItinerary(W$1))","v":"x"},{"$f":"getProgramXref($A9,numericItinerary(X$1))","v":"x"},{"$f":"getProgramXref($A9,numericItinerary(Y$1))","v":"x"},{"$f":"getProgramXref($A9,numericItinerary(Z$1))","v":"x"},null,13]
[{"$f":"INDEX(program_table,ROW()-5)","v":"COPE: High Challenge Course"},3,{"$f":"getProgramXref($A10,numericItinerary(C$1))","v":"x"},{"$f":"getProgramXref($A10,numericItinerary(D$1))","v":""},{"$f":"getProgramXref($A10,numericItinerary(E$1))","v":""},{"$f":"getProgramXref($A10,numericItinerary(F$1))","v":""},{"$f":"getProgramXref($A10,numericItinerary(G$1))","v":""},{"$f":"getProgramXref($A10,numericItinerary(H$1))","v":"x"},{"$f":"getProgramXref($A10,numericItinerary(I$1))","v":""},{"$f":"getProgramXref($A10,numericItinerary(J$1))","v":""},{"$f":"getProgramXref($A10,numericItinerary(K$1))","v":""},{"$f":"getProgramXref($A10,numericItinerary(L$1))","v":""},{"$f":"getProgramXref($A10,numericItinerary(M$1))","v":""},{"$f":"getProgramXref($A10,numericItinerary(N$1))","v":""},{"$f":"getProgramXref($A10,numericItinerary(O$1))","v":""},{"$f":"getProgramXref($A10,numericItinerary(P$1))","v":""},{"$f":"getProgramXref($A10,numericItinerary(Q$1))","v":""},{"$f":"getProgramXref($A10,numericItinerary(R$1))","v":""},{"$f":"getProgramXref($A10,numericItinerary(S$1))","v":""},{"$f":"getProgramXref($A10,numericItinerary(T$1))","v":""},{"$f":"getProgramXref($A10,numericItinerary(U$1))","v":""},{"$f":"getProgramXref($A10,numericItinerary(V$1))","v":""},{"$f":"getProgramXref($A10,numericItinerary(W$1))","v":"x"},{"$f":"getProgramXref($A10,numericItinerary(X$1))","v":""},{"$f":"getProgramXref($A10,numericItinerary(Y$1))","v":""},{"$f":"getProgramXref($A10,numericItinerary(Z$1))","v":""},null,3]
[{"$f":"INDEX(program_table,ROW()-5)","v":"COPE: Initiative Games"},16,{"$f":"getProgramXref($A11,numericItinerary(C$1))","v":"x"},{"$f":"getProgramXref($A11,numericItinerary(D$1))","v":"x"},{"$f":"getProgramXref($A11,numericItinerary(E$1))","v":"x"},{"$f":"getProgramXref($A11,numericItinerary(F$1))","v":"x"},{"$f":"getProgramXref($A11,numericItinerary(G$1))","v":""},{"$f":"getProgramXref($A11,numericItinerary(H$1))","v":""},{"$f":"getProgramXref($A11,numericItinerary(I$1))","v":"x"},{"$f":"getProgramXref($A11,numericItinerary(J$1))","v":"x"},{"$f":"getProgramXref($A11,numericItinerary(K$1))","v":"x"},{"$f":"getProgramXref($A11,numericItinerary(L$1))","v":"x"},{"$f":"getProgramXref($A11,numericItinerary(M$1))","v":""},{"$f":"getProgramXref($A11,numericItinerary(N$1))","v":""},{"$f":"getProgramXref($A11,numericItinerary(O$1))","v":"x"},{"$f":"getProgramXref($A11,numericItinerary(P$1))","v":"x"},{"$f":"getProgramXref($A11,numericItinerary(Q$1))","v":""},{"$f":"getProgramXref($A11,numericItinerary(R$1))","v":""},{"$f":"getProgramXref($A11,numericItinerary(S$1))","v":""},{"$f":"getProgramXref($A11,numericItinerary(T$1))","v":"x"},{"$f":"getProgramXref($A11,numericItinerary(U$1))","v":"x"},{"$f":"getProgramXref($A11,numericItinerary(V$1))","v":"x"},{"$f":"getProgramXref($A11,numericItinerary(W$1))","v":""},{"$f":"getProgramXref($A11,numericItinerary(X$1))","v":"x"},{"$f":"getProgramXref($A11,numericItinerary(Y$1))","v":"x"},{"$f":"getProgramXref($A11,numericItinerary(Z$1))","v":"x"},null,16]
[{"$f":"INDEX(program_table,ROW()-5)","v":"COPE: Low Challenge Course"},16,{"$f":"getProgramXref($A12,numericItinerary(C$1))","v":"x"},{"$f":"getProgramXref($A12,numericItinerary(D$1))","v":"x"},{"$f":"getProgramXref($A12,numericItinerary(E$1))","v":"x"},{"$f":"getProgramXref($A12,numericItinerary(F$1))","v":"x"},{"$f":"getProgramXref($A12,numericItinerary(G$1))","v":""},{"$f":"getProgramXref($A12,numericItinerary(H$1))","v":""},{"$f":"getProgramXref($A12,numericItinerary(I$1))","v":"x"},{"$f":"getProgramXref($A12,numericItinerary(J$1))","v":"x"},{"$f":"getProgramXref($A12,numericItinerary(K$1))","v":"x"},{"$f":"getProgramXref($A12,numericItinerary(L$1))","v":"x"},{"$f":"getProgramXref($A12,numericItinerary(M$1))","v":""},{"$f":"getProgramXref($A12,numericItinerary(N$1))","v":""},{"$f":"getProgramXref($A12,numericItinerary(O$1))","v":"x"},{"$f":"getProgramXref($A12,numericItinerary(P$1))","v":"x"},{"$f":"getProgramXref($A12,numericItinerary(Q$1))","v":""},{"$f":"getProgramXref($A12,numericItinerary(R$1))","v":""},{"$f":"getProgramXref($A12,numericItinerary(S$1))","v":""},{"$f":"getProgramXref($A12,numericItinerary(T$1))","v":"x"},{"$f":"getProgramXref($A12,numericItinerary(U$1))","v":"x"},{"$f":"getProgramXref($A12,numericItinerary(V$1))","v":"x"},{"$f":"getProgramXref($A12,numericItinerary(W$1))","v":""},{"$f":"getProgramXref($A12,numericItinerary(X$1))","v":"x"},{"$f":"getProgramXref($A12,numericItinerary(Y$1))","v":"x"},{"$f":"getProgramXref($A12,numericItinerary(Z$1))","v":"x"},null,16]
[{"$f":"INDEX(program_table,ROW()-5)","v":"Ecology: Demonstration Forest"},7,{"$f":"getProgramXref($A13,numericItinerary(C$1))","v":""},{"$f":"getProgramXref($A13,numericItinerary(D$1))","v":""},{"$f":"getProgramXref($A13,numericItinerary(E$1))","v":""},{"$f":"getProgramXref($A13,numericItinerary(F$1))","v":""},{"$f":"getProgramXref($A13,numericItinerary(G$1))","v":""},{"$f":"getProgramXref($A13,numericItinerary(H$1))","v":"x"},{"$f":"getProgramXref($A13,numericItinerary(I$1))","v":""},{"$f":"getProgramXref($A13,numericItinerary(J$1))","v":""},{"$f":"getProgramXref($A13,numericItinerary(K$1))","v":"x"},{"$f":"getProgramXref($A13,numericItinerary(L$1))","v":""},{"$f":"getProgramXref($A13,numericItinerary(M$1))","v":"x"},{"$f":"getProgramXref($A13,numericItinerary(N$1))","v":""},{"$f":"getProgramXref($A13,numericItinerary(O$1))","v":"x"},{"$f":"getProgramXref($A13,numericItinerary(P$1))","v":"x"},{"$f":"getProgramXref($A13,numericItinerary(Q$1))","v":""},{"$f":"getProgramXref($A13,numericItinerary(R$1))","v":""},{"$f":"getProgramXref($A13,numericItinerary(S$1))","v":""},{"$f":"getProgramXref($A13,numericItinerary(T$1))","v":""},{"$f":"getProgramXref($A13,numericItinerary(U$1))","v":""},{"$f":"getProgramXref($A13,numericItinerary(V$1))","v":""},{"$f":"getProgramXref($A13,numericItinerary(W$1))","v":"x"},{"$f":"getProgramXref($A13,numericItinerary(X$1))","v":""},{"$f":"getProgramXref($A13,numericItinerary(Y$1))","v":""},{"$f":"getProgramXref($A13,numericItinerary(Z$1))","v":"x"},null,7]
[{"$f":"INDEX(program_table,ROW()-5)","v":"Ecology: Self-Guided Fishing"},9,{"$f":"getProgramXref($A14,numericItinerary(C$1))","v":"x"},{"$f":"getProgramXref($A14,numericItinerary(D$1))","v":""},{"$f":"getProgramXref($A14,numericItinerary(E$1))","v":""},{"$f":"getProgramXref($A14,numericItinerary(F$1))","v":""},{"$f":"getProgramXref($A14,numericItinerary(G$1))","v":"x"},{"$f":"getProgramXref($A14,numericItinerary(H$1))","v":""},{"$f":"getProgramXref($A14,numericItinerary(I$1))","v":""},{"$f":"getProgramXref($A14,numericItinerary(J$1))","v":""},{"$f":"getProgramXref($A14,numericItinerary(K$1))","v":"x"},{"$f":"getProgramXref($A14,numericItinerary(L$1))","v":""},{"$f":"getProgramXref($A14,numericItinerary(M$1))","v":"x"},{"$f":"getProgramXref($A14,numericItinerary(N$1))","v":"x"},{"$f":"getProgramXref($A14,numericItinerary(O$1))","v":""},{"$f":"getProgramXref($A14,numericItinerary(P$1))","v":"x"},{"$f":"getProgramXref($A14,numericItinerary(Q$1))","v":""},{"$f":"getProgramXref($A14,numericItinerary(R$1))","v":"x"},{"$f":"getProgramXref($A14,numericItinerary(S$1))","v":"x"},{"$f":"getProgramXref($A14,numericItinerary(T$1))","v":""},{"$f":"getProgramXref($A14,numericItinerary(U$1))","v":""},{"$f":"getProgramXref($A14,numericItinerary(V$1))","v":""},{"$f":"getProgramXref($A14,numericItinerary(W$1))","v":"x"},{"$f":"getProgramXref($A14,numericItinerary(X$1))","v":""},{"$f":"getProgramXref($A14,numericItinerary(Y$1))","v":""},{"$f":"getProgramXref($A14,numericItinerary(Z$1))","v":""},null,9]
[{"$f":"INDEX(program_table,ROW()-5)","v":"Evening: Abreu Family Dinner"},2,{"$f":"getProgramXref($A15,numericItinerary(C$1))","v":"x"},{"$f":"getProgramXref($A15,numericItinerary(D$1))","v":""},{"$f":"getProgramXref($A15,numericItinerary(E$1))","v":""},{"$f":"getProgramXref($A15,numericItinerary(F$1))","v":""},{"$f":"getProgramXref($A15,numericItinerary(G$1))","v":""},{"$f":"getProgramXref($A15,numericItinerary(H$1))","v":""},{"$f":"getProgramXref($A15,numericItinerary(I$1))","v":""},{"$f":"getProgramXref($A15,numericItinerary(J$1))","v":""},{"$f":"getProgramXref($A15,numericItinerary(K$1))","v":""},{"$f":"getProgramXref($A15,numericItinerary(L$1))","v":""},{"$f":"getProgramXref($A15,numericItinerary(M$1))","v":""},{"$f":"getProgramXref($A15,numericItinerary(N$1))","v":""},{"$f":"getProgramXref($A15,numericItinerary(O$1))","v":""},{"$f":"getProgramXref($A15,numericItinerary(P$1))","v":""},{"$f":"getProgramXref($A15,numericItinerary(Q$1))","v":""},{"$f":"getProgramXref($A15,numericItinerary(R$1))","v":""},{"$f":"getProgramXref($A15,numericItinerary(S$1))","v":""},{"$f":"getProgramXref($A15,numericItinerary(T$1))","v":""},{"$f":"getProgramXref($A15,numericItinerary(U$1))","v":""},{"$f":"getProgramXref($A15,numericItinerary(V$1))","v":""},{"$f":"getProgramXref($A15,numericItinerary(W$1))","v":"x"},{"$f":"getProgramXref($A15,numericItinerary(X$1))","v":""},{"$f":"getProgramXref($A15,numericItinerary(Y$1))","v":""},{"$f":"getProgramXref($A15,numericItinerary(Z$1))","v":""},null,2]
[{"$f":"INDEX(program_table,ROW()-5)","v":"Evening: Advisor Coffee"},24,{"$f":"getProgramXref($A16,numericItinerary(C$1))","v":"x"},{"$f":"getProgramXref($A16,numericItinerary(D$1))","v":"x"},{"$f":"getProgramXref($A16,numericItinerary(E$1))","v":"x"},{"$f":"getProgramXref($A16,numericItinerary(F$1))","v":"x"},{"$f":"getProgramXref($A16,numericItinerary(G$1))","v":"x"},{"$f":"getProgramXref($A16,numericItinerary(H$1))","v":"x"},{"$f":"getProgramXref($A16,numericItinerary(I$1))","v":"x"},{"$f":"getProgramXref($A16,numericItinerary(J$1))","v":"x"},{"$f":"getProgramXref($A16,numericItinerary(K$1))","v":"x"},{"$f":"getProgramXref($A16,numericItinerary(L$1))","v":"x"},{"$f":"getProgramXref($A16,numericItinerary(M$1))","v":"x"},{"$f":"getProgramXref($A16,numericItinerary(N$1))","v":"x"},{"$f":"getProgramXref($A16,numericItinerary(O$1))","v":"x"},{"$f":"getProgramXref($A16,numericItinerary(P$1))","v":"x"},{"$f":"getProgramXref($A16,numericItinerary(Q$1))","v":"x"},{"$f":"getProgramXref($A16,numericItinerary(R$1))","v":"x"},{"$f":"getProgramXref($A16,numericItinerary(S$1))","v":"x"},{"$f":"getProgramXref($A16,numericItinerary(T$1))","v":"x"},{"$f":"getProgramXref($A16,numericItinerary(U$1))","v":"x"},{"$f":"getProgramXref($A16,numericItinerary(V$1))","v":"x"},{"$f":"getProgramXref($A16,numericItinerary(W$1))","v":"x"},{"$f":"getProgramXref($A16,numericItinerary(X$1))","v":"x"},{"$f":"getProgramXref($A16,numericItinerary(Y$1))","v":"x"},{"$f":"getProgramXref($A16,numericItinerary(Z$1))","v":"x"},null,24]
[{"$f":"INDEX(program_table,ROW()-5)","v":"Evening: Campfire Show"},22,{"$f":"getProgramXref($A17,numericItinerary(C$1))","v":"x"},{"$f":"getProgramXref($A17,numericItinerary(D$1))","v":"x"},{"$f":"getProgramXref($A17,numericItinerary(E$1))","v":"x"},{"$f":"getProgramXref($A17,numericItinerary(F$1))","v":"x"},{"$f":"getProgramXref($A17,numericItinerary(G$1))","v":""},{"$f":"getProgramXref($A17,numericItinerary(H$1))","v":""},{"$f":"getProgramXref($A17,numericItinerary(I$1))","v":"x"},{"$f":"getProgramXref($A17,numericItinerary(J$1))","v":"x"},{"$f":"getProgramXref($A17,numericItinerary(K$1))","v":"x"},{"$f":"getProgramXref($A17,numericItinerary(L$1))","v":"x"},{"$f":"getProgramXref($A17,numericItinerary(M$1))","v":"x"},{"$f":"getProgramXref($A17,numericItinerary(N$1))","v":"x"},{"$f":"getProgramXref($A17,numericItinerary(O$1))","v":"x"},{"$f":"getProgramXref($A17,numericItinerary(P$1))","v":"x"},{"$f":"getProgramXref($A17,numericItinerary(Q$1))","v":"x"},{"$f":"getProgramXref($A17,numericItinerary(R$1))","v":"x"},{"$f":"getProgramXref($A17,numericItinerary(S$1))","v":"x"},{"$f":"getProgramXref($A17,numericItinerary(T$1))","v":"x"},{"$f":"getProgramXref($A17,numericItinerary(U$1))","v":"x"},{"$f":"getProgramXref($A17,numericItinerary(V$1))","v":"x"},{"$f":"getProgramXref($A17,numericItinerary(W$1))","v":"x"},{"$f":"getProgramXref($A17,numericItinerary(X$1))","v":"x"},{"$f":"getProgramXref($A17,numericItinerary(Y$1))","v":"x"},{"$f":"getProgramXref($A17,numericItinerary(Z$1))","v":"x"},null,22]
[{"$f":"INDEX(program_table,ROW()-5)","v":"Evening: Chuckwagon Dinner"},13,{"$f":"getProgramXref($A18,numericItinerary(C$1))","v":""},{"$f":"getProgramXref($A18,numericItinerary(D$1))","v":""},{"$f":"getProgramXref($A18,numericItinerary(E$1))","v":""},{"$f":"getProgramXref($A18,numericItinerary(F$1))","v":"x"},{"$f":"getProgramXref($A18,numericItinerary(G$1))","v":""},{"$f":"getProgramXref($A18,numericItinerary(H$1))","v":""},{"$f":"getProgramXref($A18,numericItinerary(I$1))","v":""},{"$f":"getProgramXref($A18,numericItinerary(J$1))","v":""},{"$f":"getProgramXref($A18,numericItinerary(K$1))","v":"x"},{"$f":"getProgramXref($A18,numericItinerary(L$1))","v":"x"},{"$f":"getProgramXref($A18,numericItinerary(M$1))","v":"x"},{"$f":"getProgramXref($A18,numericItinerary(N$1))","v":"x"},{"$f":"getProgramXref($A18,numericItinerary(O$1))","v":"x"},{"$f":"getProgramXref($A18,numericItinerary(P$1))","v":""},{"$f":"getProgramXref($A18,numericItinerary(Q$1))","v":"x"},{"$f":"getProgramXref($A18,numericItinerary(R$1))","v":"x"},{"$f":"getProgramXref($A18,numericItinerary(S$1))","v":""},{"$f":"getProgramXref($A18,numericItinerary(T$1))","v":"x"},{"$f":"getProgramXref($A18,numericItinerary(U$1))","v":"x"},{"$f":"getProgramXref($A18,numericItinerary(V$1))","v":"x"},{"$f":"getProgramXref($A18,numericItinerary(W$1))","v":""},{"$f":"getProgramXref($A18,numericItinerary(X$1))","v":"x"},{"$f":"getProgramXref($A18,numericItinerary(Y$1))","v":"x"},{"$f":"getProgramXref($A18,numericItinerary(Z$1))","v":""},null,13]
[{"$f":"INDEX(program_table,ROW()-5)","v":"Historical: Adobe Brick-Making"},6,{"$f":"getProgramXref($A19,numericItinerary(C$1))","v":"x"},{"$f":"getProgramXref($A19,numericItinerary(D$1))","v":""},{"$f":"getProgramXref($A19,numericItinerary(E$1))","v":""},{"$f":"getProgramXref($A19,numericItinerary(F$1))","v":""},{"$f":"getProgramXref($A19,numericItinerary(G$1))","v":"x"},{"$f":"getProgramXref($A19,numericItinerary(H$1))","v":""},{"$f":"getProgramXref($A19,numericItinerary(I$1))","v":""},{"$f":"getProgramXref($A19,numericItinerary(J$1))","v":""},{"$f":"getProgramXref($A19,numericItinerary(K$1))","v":""},{"$f":"getProgramXref($A19,numericItinerary(L$1))","v":""},{"$f":"getProgramXref($A19,numericItinerary(M$1))","v":"x"},{"$f":"getProgramXref($A19,numericItinerary(N$1))","v":"x"},{"$f":"getProgramXref($A19,numericItinerary(O$1))","v":""},{"$f":"getProgramXref($A19,numericItinerary(P$1))","v":""},{"$f":"getProgramXref($A19,numericItinerary(Q$1))","v":""},{"$f":"getProgramXref($A19,numericItinerary(R$1))","v":"x"},{"$f":"getProgramXref($A19,numericItinerary(S$1))","v":""},{"$f":"getProgramXref($A19,numericItinerary(T$1))","v":""},{"$f":"getProgramXref($A19,numericItinerary(U$1))","v":""},{"$f":"getProgramXref($A19,numericItinerary(V$1))","v":""},{"$f":"getProgramXref($A19,numericItinerary(W$1))","v":"x"},{"$f":"getProgramXref($A19,numericItinerary(X$1))","v":""},{"$f":"getProgramXref($A19,numericItinerary(Y$1))","v":""},{"$f":"getProgramXref($A19,numericItinerary(Z$1))","v":""},null,6]
[{"$f":"INDEX(program_table,ROW()-5)","v":"Historical: Blacksmithing"},14,{"$f":"getProgramXref($A20,numericItinerary(C$1))","v":""},{"$f":"getProgramXref($A20,numericItinerary(D$1))","v":"x"},{"$f":"getProgramXref($A20,numericItinerary(E$1))","v":"x"},{"$f":"getProgramXref($A20,numericItinerary(F$1))","v":"x"},{"$f":"getProgramXref($A20,numericItinerary(G$1))","v":""},{"$f":"getProgramXref($A20,numericItinerary(H$1))","v":""},{"$f":"getProgramXref($A20,numericItinerary(I$1))","v":"x"},{"$f":"getProgramXref($A20,numericItinerary(J$1))","v":"x"},{"$f":"getProgramXref($A20,numericItinerary(K$1))","v":""},{"$f":"getProgramXref($A20,numericItinerary(L$1))","v":"x"},{"$f":"getProgramXref($A20,numericItinerary(M$1))","v":""},{"$f":"getProgramXref($A20,numericItinerary(N$1))","v":""},{"$f":"getProgramXref($A20,numericItinerary(O$1))","v":"x"},{"$f":"getProgramXref($A20,numericItinerary(P$1))","v":""},{"$f":"getProgramXref($A20,numericItinerary(Q$1))","v":"x"},{"$f":"getProgramXref($A20,numericItinerary(R$1))","v":"x"},{"$f":"getProgramXref($A20,numericItinerary(S$1))","v":"x"},{"$f":"getProgramXref($A20,numericItinerary(T$1))","v":"x"},{"$f":"getProgramXref($A20,numericItinerary(U$1))","v":""},{"$f":"getProgramXref($A20,numericItinerary(V$1))","v":""},{"$f":"getProgramXref($A20,numericItinerary(W$1))","v":"x"},{"$f":"getProgramXref($A20,numericItinerary(X$1))","v":"x"},{"$f":"getProgramXref($A20,numericItinerary(Y$1))","v":""},{"$f":"getProgramXref($A20,numericItinerary(Z$1))","v":"x"},null,14]
[{"$f":"INDEX(program_table,ROW()-5)","v":"Historical: Cabin Restoration"},4,{"$f":"getProgramXref($A21,numericItinerary(C$1))","v":""},{"$f":"getProgramXref($A21,numericItinerary(D$1))","v":""},{"$f":"getProgramXref($A21,numericItinerary(E$1))","v":""},{"$f":"getProgramXref($A21,numericItinerary(F$1))","v":""},{"$f":"getProgramXref($A21,numericItinerary(G$1))","v":"x"},{"$f":"getProgramXref($A21,numericItinerary(H$1))","v":""},{"$f":"getProgramXref($A21,numericItinerary(I$1))","v":""},{"$f":"getProgramXref($A21,numericItinerary(J$1))","v":""},{"$f":"getProgramXref($A21,numericItinerary(K$1))","v":""},{"$f":"getProgramXref($A21,numericItinerary(L$1))","v":""},{"$f":"getProgramXref($A21,numericItinerary(M$1))","v":"x"},{"$f":"getProgramXref($A21,numericItinerary(N$1))","v":"x"},{"$f":"getProgramXref($A21,numericItinerary(O$1))","v":""},{"$f":"getProgramXref($A21,numericItinerary(P$1))","v":""},{"$f":"getProgramXref($A21,numericItinerary(Q$1))","v":""},{"$f":"getProgramXref($A21,numericItinerary(R$1))","v":""},{"$f":"getProgramXref($A21,numericItinerary(S$1))","v":""},{"$f":"getProgramXref($A21,numericItinerary(T$1))","v":""},{"$f":"getProgramXref($A21,numericItinerary(U$1))","v":""},{"$f":"getProgramXref($A21,numericItinerary(V$1))","v":""},{"$f":"getProgramXref($A21,numericItinerary(W$1))","v":"x"},{"$f":"getProgramXref($A21,numericItinerary(X$1))","v":""},{"$f":"getProgramXref($A21,numericItinerary(Y$1))","v":""},{"$f":"getProgramXref($A21,numericItinerary(Z$1))","v":""},null,4]
[{"$f":"INDEX(program_table,ROW()-5)","v":"Historical: Cabin/House Tour"},13,{"$f":"getProgramXref($A22,numericItinerary(C$1))","v":"x"},{"$f":"getProgramXref($A22,numericItinerary(D$1))","v":""},{"$f":"getProgramXref($A22,numericItinerary(E$1))","v":"x"},{"$f":"getProgramXref($A22,numericItinerary(F$1))","v":""},{"$f":"getProgramXref($A22,numericItinerary(G$1))","v":"x"},{"$f":"getProgramXref($A22,numericItinerary(H$1))","v":""},{"$f":"getProgramXref($A22,numericItinerary(I$1))","v":"x"},{"$f":"getProgramXref($A22,numericItinerary(J$1))","v":""},{"$f":"getProgramXref($A22,numericItinerary(K$1))","v":""},{"$f":"getProgramXref($A22,numericItinerary(L$1))","v":"x"},{"$f":"getProgramXref($A22,numericItinerary(M$1))","v":"x"},{"$f":"getProgramXref($A22,numericItinerary(N$1))","v":"x"},{"$f":"getProgramXref($A22,numericItinerary(O$1))","v":""},{"$f":"getProgramXref($A22,numericItinerary(P$1))","v":"x"},{"$f":"getProgramXref($A22,numericItinerary(Q$1))","v":"x"},{"$f":"getProgramXref($A22,numericItinerary(R$1))","v":"x"},{"$f":"getProgramXref($A22,numericItinerary(S$1))","v":"x"},{"$f":"getProgramXref($A22,numericItinerary(T$1))","v":""},{"$f":"getProgramXref($A22,numericItinerary(U$1))","v":"x"},{"$f":"getProgramXref($A22,numericItinerary(V$1))","v":""},{"$f":"getProgramXref($A22,numericItinerary(W$1))","v":"x"},{"$f":"getProgramXref($A22,numericItinerary(X$1))","v":""},{"$f":"getProgramXref($A22,numericItinerary(Y$1))","v":""},{"$f":"getProgramXref($A22,numericItinerary(Z$1))","v":""},null,13]
[{"$f":"INDEX(program_table,ROW()-5)","v":"Historical: Crafting"},6,{"$f":"getProgramXref($A23,numericItinerary(C$1))","v":"x"},{"$f":"getProgramXref($A23,numericItinerary(D$1))","v":""},{"$f":"getProgramXref($A23,numericItinerary(E$1))","v":""},{"$f":"getProgramXref($A23,numericItinerary(F$1))","v":""},{"$f":"getProgramXref($A23,numericItinerary(G$1))","v":"x"},{"$f":"getProgramXref($A23,numericItinerary(H$1))","v":""},{"$f":"getProgramXref($A23,numericItinerary(I$1))","v":""},{"$f":"getProgramXref($A23,numericItinerary(J$1))","v":""},{"$f":"getProgramXref($A23,numericItinerary(K$1))","v":""},{"$f":"getProgramXref($A23,numericItinerary(L$1))","v":""},{"$f":"getProgramXref($A23,numericItinerary(M$1))","v":"x"},{"$f":"getProgramXref($A23,numericItinerary(N$1))","v":"x"},{"$f":"getProgramXref($A23,numericItinerary(O$1))","v":""},{"$f":"getProgramXref($A23,numericItinerary(P$1))","v":""},{"$f":"getProgramXref($A23,numericItinerary(Q$1))","v":""},{"$f":"getProgramXref($A23,numericItinerary(R$1))","v":"x"},{"$f":"getProgramXref($A23,numericItinerary(S$1))","v":""},{"$f":"getProgramXref($A23,numericItinerary(T$1))","v":""},{"$f":"getProgramXref($A23,numericItinerary(U$1))","v":""},{"$f":"getProgramXref($A23,numericItinerary(V$1))","v":""},{"$f":"getProgramXref($A23,numericItinerary(W$1))","v":"x"},{"$f":"getProgramXref($A23,numericItinerary(X$1))","v":""},{"$f":"getProgramXref($A23,numericItinerary(Y$1))","v":""},{"$f":"getProgramXref($A23,numericItinerary(Z$1))","v":""},null,6]
[{"$f":"INDEX(program_table,ROW()-5)","v":"Historical: Crosscut & Tie Making"},17,{"$f":"getProgramXref($A24,numericItinerary(C$1))","v":"x"},{"$f":"getProgramXref($A24,numericItinerary(D$1))","v":"x"},{"$f":"getProgramXref($A24,numericItinerary(E$1))","v":""},{"$f":"getProgramXref($A24,numericItinerary(F$1))","v":"x"},{"$f":"getProgramXref($A24,numericItinerary(G$1))","v":"x"},{"$f":"getProgramXref($A24,numericItinerary(H$1))","v":""},{"$f":"getProgramXref($A24,numericItinerary(I$1))","v":""},{"$f":"getProgramXref($A24,numericItinerary(J$1))","v":"x"},{"$f":"getProgramXref($A24,numericItinerary(K$1))","v":"x"},{"$f":"getProgramXref($A24,numericItinerary(L$1))","v":"x"},{"$f":"getProgramXref($A24,numericItinerary(M$1))","v":"x"},{"$f":"getProgramXref($A24,numericItinerary(N$1))","v":"x"},{"$f":"getProgramXref($A24,numericItinerary(O$1))","v":""},{"$f":"getProgramXref($A24,numericItinerary(P$1))","v":"x"},{"$f":"getProgramXref($A24,numericItinerary(Q$1))","v":"x"},{"$f":"getProgramXref($A24,numericItinerary(R$1))","v":""},{"$f":"getProgramXref($A24,numericItinerary(S$1))","v":"x"},{"$f":"getProgramXref($A24,numericItinerary(T$1))","v":"x"},{"$f":"getProgramXref($A24,numericItinerary(U$1))","v":""},{"$f":"getProgramXref($A24,numericItinerary(V$1))","v":""},{"$f":"getProgramXref($A24,numericItinerary(W$1))","v":"x"},{"$f":"getProgramXref($A24,numericItinerary(X$1))","v":"x"},{"$f":"getProgramXref($A24,numericItinerary(Y$1))","v":"x"},{"$f":"getProgramXref($A24,numericItinerary(Z$1))","v":"x"},null,17]
[{"$f":"INDEX(program_table,ROW()-5)","v":"Historical: Flint Knapping"},5,{"$f":"getProgramXref($A25,numericItinerary(C$1))","v":"x"},{"$f":"getProgramXref($A25,numericItinerary(D$1))","v":""},{"$f":"getProgramXref($A25,numericItinerary(E$1))","v":""},{"$f":"getProgramXref($A25,numericItinerary(F$1))","v":""},{"$f":"getProgramXref($A25,numericItinerary(G$1))","v":"x"},{"$f":"getProgramXref($A25,numericItinerary(H$1))","v":""},{"$f":"getProgramXref($A25,numericItinerary(I$1))","v":""},{"$f":"getProgramXref($A25,numericItinerary(J$1))","v":""},{"$f":"getProgramXref($A25,numericItinerary(K$1))","v":""},{"$f":"getProgramXref($A25,numericItinerary(L$1))","v":""},{"$f":"getProgramXref($A25,numericItinerary(M$1))","v":""},{"$f":"getProgramXref($A25,numericItinerary(N$1))","v":""},{"$f":"getProgramXref($A25,numericItinerary(O$1))","v":""},{"$f":"getProgramXref($A25,numericItinerary(P$1))","v":""},{"$f":"getProgramXref($A25,numericItinerary(Q$1))","v":""},{"$f":"getProgramXref($A25,numericItinerary(R$1))","v":"x"},{"$f":"getProgramXref($A25,numericItinerary(S$1))","v":"x"},{"$f":"getProgramXref($A25,numericItinerary(T$1))","v":""},{"$f":"getProgramXref($A25,numericItinerary(U$1))","v":"x"},{"$f":"getProgramXref($A25,numericItinerary(V$1))","v":""},{"$f":"getProgramXref($A25,numericItinerary(W$1))","v":""},{"$f":"getProgramXref($A25,numericItinerary(X$1))","v":""},{"$f":"getProgramXref($A25,numericItinerary(Y$1))","v":""},{"$f":"getProgramXref($A25,numericItinerary(Z$1))","v":""},null,5]
[{"$f":"INDEX(program_table,ROW()-5)","v":"Historical: Fur Trapper Rendezvous"},10,{"$f":"getProgramXref($A26,numericItinerary(C$1))","v":""},{"$f":"getProgramXref($A26,numericItinerary(D$1))","v":"x"},{"$f":"getProgramXref($A26,numericItinerary(E$1))","v":""},{"$f":"getProgramXref($A26,numericItinerary(F$1))","v":"x"},{"$f":"getProgramXref($A26,numericItinerary(G$1))","v":""},{"$f":"getProgramXref($A26,numericItinerary(H$1))","v":"x"},{"$f":"getProgramXref($A26,numericItinerary(I$1))","v":"x"},{"$f":"getProgramXref($A26,numericItinerary(J$1))","v":""},{"$f":"getProgramXref($A26,numericItinerary(K$1))","v":"x"},{"$f":"getProgramXref($A26,numericItinerary(L$1))","v":"x"},{"$f":"getProgramXref($A26,numericItinerary(M$1))","v":""},{"$f":"getProgramXref($A26,numericItinerary(N$1))","v":""},{"$f":"getProgramXref($A26,numericItinerary(O$1))","v":""},{"$f":"getProgramXref($A26,numericItinerary(P$1))","v":""},{"$f":"getProgramXref($A26,numericItinerary(Q$1))","v":""},{"$f":"getProgramXref($A26,numericItinerary(R$1))","v":""},{"$f":"getProgramXref($A26,numericItinerary(S$1))","v":""},{"$f":"getProgramXref($A26,numericItinerary(T$1))","v":""},{"$f":"getProgramXref($A26,numericItinerary(U$1))","v":""},{"$f":"getProgramXref($A26,numericItinerary(V$1))","v":"x"},{"$f":"getProgramXref($A26,numericItinerary(W$1))","v":""},{"$f":"getProgramXref($A26,numericItinerary(X$1))","v":"x"},{"$f":"getProgramXref($A26,numericItinerary(Y$1))","v":"x"},{"$f":"getProgramXref($A26,numericItinerary(Z$1))","v":"x"},null,10]
[{"$f":"INDEX(program_table,ROW()-5)","v":"Historical: Gold Panning"},14,{"$f":"getProgramXref($A27,numericItinerary(C$1))","v":""},{"$f":"getProgramXref($A27,numericItinerary(D$1))","v":"x"},{"$f":"getProgramXref($A27,numericItinerary(E$1))","v":""},{"$f":"getProgramXref($A27,numericItinerary(F$1))","v":"x"},{"$f":"getProgramXref($A27,numericItinerary(G$1))","v":""},{"$f":"getProgramXref($A27,numericItinerary(H$1))","v":"x"},{"$f":"getProgramXref($A27,numericItinerary(I$1))","v":"x"},{"$f":"getProgramXref($A27,numericItinerary(J$1))","v":"x"},{"$f":"getProgramXref($A27,numericItinerary(K$1))","v":""},{"$f":"getProgramXref($A27,numericItinerary(L$1))","v":"x"},{"$f":"getProgramXref($A27,numericItinerary(M$1))","v":""},{"$f":"getProgramXref($A27,numericItinerary(N$1))","v":""},{"$f":"getProgramXref($A27,numericItinerary(O$1))","v":"x"},{"$f":"getProgramXref($A27,numericItinerary(P$1))","v":""},{"$f":"getProgramXref($A27,numericItinerary(Q$1))","v":"x"},{"$f":"getProgramXref($A27,numericItinerary(R$1))","v":""},{"$f":"getProgramXref($A27,numericItinerary(S$1))","v":"x"},{"$f":"getProgramXref($A27,numericItinerary(T$1))","v":"x"},{"$f":"getProgramXref($A27,numericItinerary(U$1))","v":""},{"$f":"getProgramXref($A27,numericItinerary(V$1))","v":"x"},{"$f":"getProgramXref($A27,numericItinerary(W$1))","v":"x"},{"$f":"getProgramXref($A27,numericItinerary(X$1))","v":"x"},{"$f":"getProgramXref($A27,numericItinerary(Y$1))","v":""},{"$f":"getProgramXref($A27,numericItinerary(Z$1))","v":"x"},null,14]
[{"$f":"INDEX(program_table,ROW()-5)","v":"Historical: Mine Tour"},5,{"$f":"getProgramXref($A28,numericItinerary(C$1))","v":""},{"$f":"getProgramXref($A28,numericItinerary(D$1))","v":""},{"$f":"getProgramXref($A28,numericItinerary(E$1))","v":""},{"$f":"getProgramXref($A28,numericItinerary(F$1))","v":""},{"$f":"getProgramXref($A28,numericItinerary(G$1))","v":""},{"$f":"getProgramXref($A28,numericItinerary(H$1))","v":""},{"$f":"getProgramXref($A28,numericItinerary(I$1))","v":""},{"$f":"getProgramXref($A28,numericItinerary(J$1))","v":""},{"$f":"getProgramXref($A28,numericItinerary(K$1))","v":""},{"$f":"getProgramXref($A28,numericItinerary(L$1))","v":""},{"$f":"getProgramXref($A28,numericItinerary(M$1))","v":""},{"$f":"getProgramXref($A28,numericItinerary(N$1))","v":""},{"$f":"getProgramXref($A28,numericItinerary(O$1))","v":"x"},{"$f":"getProgramXref($A28,numericItinerary(P$1))","v":""},{"$f":"getProgramXref($A28,numericItinerary(Q$1))","v":"x"},{"$f":"getProgramXref($A28,numericItinerary(R$1))","v":""},{"$f":"getProgramXref($A28,numericItinerary(S$1))","v":"x"},{"$f":"getProgramXref($A28,numericItinerary(T$1))","v":""},{"$f":"getProgramXref($A28,numericItinerary(U$1))","v":""},{"$f":"getProgramXref($A28,numericItinerary(V$1))","v":""},{"$f":"getProgramXref($A28,numericItinerary(W$1))","v":"x"},{"$f":"getProgramXref($A28,numericItinerary(X$1))","v":""},{"$f":"getProgramXref($A28,numericItinerary(Y$1))","v":""},{"$f":"getProgramXref($A28,numericItinerary(Z$1))","v":"x"},null,5]
[{"$f":"INDEX(program_table,ROW()-5)","v":"Historical: Petroglyph Tour"},2,{"$f":"getProgramXref($A29,numericItinerary(C$1))","v":""},{"$f":"getProgramXref($A29,numericItinerary(D$1))","v":""},{"$f":"getProgramXref($A29,numericItinerary(E$1))","v":"x"},{"$f":"getProgramXref($A29,numericItinerary(F$1))","v":""},{"$f":"getProgramXref($A29,numericItinerary(G$1))","v":""},{"$f":"getProgramXref($A29,numericItinerary(H$1))","v":""},{"$f":"getProgramXref($A29,numericItinerary(I$1))","v":""},{"$f":"getProgramXref($A29,numericItinerary(J$1))","v":"x"},{"$f":"getProgramXref($A29,numericItinerary(K$1))","v":""},{"$f":"getProgramXref($A29,numericItinerary(L$1))","v":""},{"$f":"getProgramXref($A29,numericItinerary(M$1))","v":""},{"$f":"getProgramXref($A29,numericItinerary(N$1))","v":""},{"$f":"getProgramXref($A29,numericItinerary(O$1))","v":""},{"$f":"getProgramXref($A29,numericItinerary(P$1))","v":""},{"$f":"getProgramXref($A29,numericItinerary(Q$1))","v":""},{"$f":"getProgramXref($A29,numericItinerary(R$1))","v":""},{"$f":"getProgramXref($A29,numericItinerary(S$1))","v":""},{"$f":"getProgramXref($A29,numericItinerary(T$1))","v":""},{"$f":"getProgramXref($A29,numericItinerary(U$1))","v":""},{"$f":"getProgramXref($A29,numericItinerary(V$1))","v":""},{"$f":"getProgramXref($A29,numericItinerary(W$1))","v":""},{"$f":"getProgramXref($A29,numericItinerary(X$1))","v":""},{"$f":"getProgramXref($A29,numericItinerary(Y$1))","v":""},{"$f":"getProgramXref($A29,numericItinerary(Z$1))","v":""},null,2]
[{"$f":"INDEX(program_table,ROW()-5)","v":"Historical: Pump Car Rides"},3,{"$f":"getProgramXref($A30,numericItinerary(C$1))","v":""},{"$f":"getProgramXref($A30,numericItinerary(D$1))","v":""},{"$f":"getProgramXref($A30,numericItinerary(E$1))","v":""},{"$f":"getProgramXref($A30,numericItinerary(F$1))","v":"x"},{"$f":"getProgramXref($A30,numericItinerary(G$1))","v":""},{"$f":"getProgramXref($A30,numericItinerary(H$1))","v":""},{"$f":"getProgramXref($A30,numericItinerary(I$1))","v":""},{"$f":"getProgramXref($A30,numericItinerary(J$1))","v":"x"},{"$f":"getProgramXref($A30,numericItinerary(K$1))","v":""},{"$f":"getProgramXref($A30,numericItinerary(L$1))","v":"x"},{"$f":"getProgramXref($A30,numericItinerary(M$1))","v":""},{"$f":"getProgramXref($A30,numericItinerary(N$1))","v":""},{"$f":"getProgramXref($A30,numericItinerary(O$1))","v":""},{"$f":"getProgramXref($A30,numericItinerary(P$1))","v":""},{"$f":"getProgramXref($A30,numericItinerary(Q$1))","v":""},{"$f":"getProgramXref($A30,numericItinerary(R$1))","v":""},{"$f":"getProgramXref($A30,numericItinerary(S$1))","v":""},{"$f":"getProgramXref($A30,numericItinerary(T$1))","v":""},{"$f":"getProgramXref($A30,numericItinerary(U$1))","v":""},{"$f":"getProgramXref($A30,numericItinerary(V$1))","v":""},{"$f":"getProgramXref($A30,numericItinerary(W$1))","v":""},{"$f":"getProgramXref($A30,numericItinerary(X$1))","v":""},{"$f":"getProgramXref($A30,numericItinerary(Y$1))","v":""},{"$f":"getProgramXref($A30,numericItinerary(Z$1))","v":""},null,3]
[{"$f":"INDEX(program_table,ROW()-5)","v":"Historical: Railroad Construction"},4,{"$f":"getProgramXref($A31,numericItinerary(C$1))","v":""},{"$f":"getProgramXref($A31,numericItinerary(D$1))","v":""},{"$f":"getProgramXref($A31,numericItinerary(E$1))","v":"x"},{"$f":"getProgramXref($A31,numericItinerary(F$1))","v":"x"},{"$f":"getProgramXref($A31,numericItinerary(G$1))","v":""},{"$f":"getProgramXref($A31,numericItinerary(H$1))","v":""},{"$f":"getProgramXref($A31,numericItinerary(I$1))","v":""},{"$f":"getProgramXref($A31,numericItinerary(J$1))","v":"x"},{"$f":"getProgramXref($A31,numericItinerary(K$1))","v":""},{"$f":"getProgramXref($A31,numericItinerary(L$1))","v":"x"},{"$f":"getProgramXref($A31,numericItinerary(M$1))","v":""},{"$f":"getProgramXref($A31,numericItinerary(N$1))","v":""},{"$f":"getProgramXref($A31,numericItinerary(O$1))","v":""},{"$f":"getProgramXref($A31,numericItinerary(P$1))","v":""},{"$f":"getProgramXref($A31,numericItinerary(Q$1))","v":""},{"$f":"getProgramXref($A31,numericItinerary(R$1))","v":""},{"$f":"getProgramXref($A31,numericItinerary(S$1))","v":""},{"$f":"getProgramXref($A31,numericItinerary(T$1))","v":""},{"$f":"getProgramXref($A31,numericItinerary(U$1))","v":""},{"$f":"getProgramXref($A31,numericItinerary(V$1))","v":""},{"$f":"getProgramXref($A31,numericItinerary(W$1))","v":""},{"$f":"getProgramXref($A31,numericItinerary(X$1))","v":""},{"$f":"getProgramXref($A31,numericItinerary(Y$1))","v":""},{"$f":"getProgramXref($A31,numericItinerary(Z$1))","v":""},null,4]
[{"$f":"INDEX(program_table,ROW()-5)","v":"Historical: Spar Pole Climbing"},9,{"$f":"getProgramXref($A32,numericItinerary(C$1))","v":"x"},{"$f":"getProgramXref($A32,numericItinerary(D$1))","v":"x"},{"$f":"getProgramXref($A32,numericItinerary(E$1))","v":""},{"$f":"getProgramXref($A32,numericItinerary(F$1))","v":""},{"$f":"getProgramXref($A32,numericItinerary(G$1))","v":""},{"$f":"getProgramXref($A32,numericItinerary(H$1))","v":""},{"$f":"getProgramXref($A32,numericItinerary(I$1))","v":""},{"$f":"getProgramXref($A32,numericItinerary(J$1))","v":"x"},{"$f":"getProgramXref($A32,numericItinerary(K$1))","v":""},{"$f":"getProgramXref($A32,numericItinerary(L$1))","v":""},{"$f":"getProgramXref($A32,numericItinerary(M$1))","v":"x"},{"$f":"getProgramXref($A32,numericItinerary(N$1))","v":""},{"$f":"getProgramXref($A32,numericItinerary(O$1))","v":""},{"$f":"getProgramXref($A32,numericItinerary(P$1))","v":""},{"$f":"getProgramXref($A32,numericItinerary(Q$1))","v":""},{"$f":"getProgramXref($A32,numericItinerary(R$1))","v":""},{"$f":"getProgramXref($A32,numericItinerary(S$1))","v":"x"},{"$f":"getProgramXref($A32,numericItinerary(T$1))","v":"x"},{"$f":"getProgramXref($A32,numericItinerary(U$1))","v":""},{"$f":"getProgramXref($A32,numericItinerary(V$1))","v":""},{"$f":"getProgramXref($A32,numericItinerary(W$1))","v":""},{"$f":"getProgramXref($A32,numericItinerary(X$1))","v":"x"},{"$f":"getProgramXref($A32,numericItinerary(Y$1))","v":"x"},{"$f":"getProgramXref($A32,numericItinerary(Z$1))","v":"x"},null,9]
[{"$f":"INDEX(program_table,ROW()-5)","v":"Landmarks: Baldy Mountain"},11,{"$f":"getProgramXref($A33,numericItinerary(C$1))","v":""},{"$f":"getProgramXref($A33,numericItinerary(D$1))","v":"x"},{"$f":"getProgramXref($A33,numericItinerary(E$1))","v":""},{"$f":"getProgramXref($A33,numericItinerary(F$1))","v":"x"},{"$f":"getProgramXref($A33,numericItinerary(G$1))","v":""},{"$f":"getProgramXref($A33,numericItinerary(H$1))","v":"x"},{"$f":"getProgramXref($A33,numericItinerary(I$1))","v":"x"},{"$f":"getProgramXref($A33,numericItinerary(J$1))","v":"x"},{"$f":"getProgramXref($A33,numericItinerary(K$1))","v":""},{"$f":"getProgramXref($A33,numericItinerary(L$1))","v":"x"},{"$f":"getProgramXref($A33,numericItinerary(M$1))","v":""},{"$f":"getProgramXref($A33,numericItinerary(N$1))","v":""},{"$f":"getProgramXref($A33,numericItinerary(O$1))","v":""},{"$f":"getProgramXref($A33,numericItinerary(P$1))","v":""},{"$f":"getProgramXref($A33,numericItinerary(Q$1))","v":""},{"$f":"getProgramXref($A33,numericItinerary(R$1))","v":""},{"$f":"getProgramXref($A33,numericItinerary(S$1))","v":""},{"$f":"getProgramXref($A33,numericItinerary(T$1))","v":"x"},{"$f":"getProgramXref($A33,numericItinerary(U$1))","v":""},{"$f":"getProgramXref($A33,numericItinerary(V$1))","v":"x"},{"$f":"getProgramXref($A33,numericItinerary(W$1))","v":""},{"$f":"getProgramXref($A33,numericItinerary(X$1))","v":"x"},{"$f":"getProgramXref($A33,numericItinerary(Y$1))","v":"x"},{"$f":"getProgramXref($A33,numericItinerary(Z$1))","v":"x"},null,11]
[{"$f":"INDEX(program_table,ROW()-5)","v":"Landmarks: Inspiration Point"},2,{"$f":"getProgramXref($A34,numericItinerary(C$1))","v":"x"},{"$f":"getProgramXref($A34,numericItinerary(D$1))","v":""},{"$f":"getProgramXref($A34,numericItinerary(E$1))","v":""},{"$f":"getProgramXref($A34,numericItinerary(F$1))","v":""},{"$f":"getProgramXref($A34,numericItinerary(G$1))","v":""},{"$f":"getProgramXref($A34,numericItinerary(H$1))","v":""},{"$f":"getProgramXref($A34,numericItinerary(I$1))","v":""},{"$f":"getProgramXref($A34,numericItinerary(J$1))","v":""},{"$f":"getProgramXref($A34,numericItinerary(K$1))","v":""},{"$f":"getProgramXref($A34,numericItinerary(L$1))","v":""},{"$f":"getProgramXref($A34,numericItinerary(M$1))","v":""},{"$f":"getProgramXref($A34,numericItinerary(N$1))","v":""},{"$f":"getProgramXref($A34,numericItinerary(O$1))","v":""},{"$f":"getProgramXref($A34,numericItinerary(P$1))","v":""},{"$f":"getProgramXref($A34,numericItinerary(Q$1))","v":""},{"$f":"getProgramXref($A34,numericItinerary(R$1))","v":""},{"$f":"getProgramXref($A34,numericItinerary(S$1))","v":""},{"$f":"getProgramXref($A34,numericItinerary(T$1))","v":""},{"$f":"getProgramXref($A34,numericItinerary(U$1))","v":"x"},{"$f":"getProgramXref($A34,numericItinerary(V$1))","v":""},{"$f":"getProgramXref($A34,numericItinerary(W$1))","v":""},{"$f":"getProgramXref($A34,numericItinerary(X$1))","v":""},{"$f":"getProgramXref($A34,numericItinerary(Y$1))","v":""},{"$f":"getProgramXref($A34,numericItinerary(Z$1))","v":""},null,2]
[{"$f":"INDEX(program_table,ROW()-5)","v":"Landmarks: Mount Phillips"},8,{"$f":"getProgramXref($A35,numericItinerary(C$1))","v":""},{"$f":"getProgramXref($A35,numericItinerary(D$1))","v":""},{"$f":"getProgramXref($A35,numericItinerary(E$1))","v":""},{"$f":"getProgramXref($A35,numericItinerary(F$1))","v":""},{"$f":"getProgramXref($A35,numericItinerary(G$1))","v":"x"},{"$f":"getProgramXref($A35,numericItinerary(H$1))","v":""},{"$f":"getProgramXref($A35,numericItinerary(I$1))","v":""},{"$f":"getProgramXref($A35,numericItinerary(J$1))","v":""},{"$f":"getProgramXref($A35,numericItinerary(K$1))","v":""},{"$f":"getProgramXref($A35,numericItinerary(L$1))","v":""},{"$f":"getProgramXref($A35,numericItinerary(M$1))","v":""},{"$f":"getProgramXref($A35,numericItinerary(N$1))","v":"x"},{"$f":"getProgramXref($A35,numericItinerary(O$1))","v":"x"},{"$f":"getProgramXref($A35,numericItinerary(P$1))","v":""},{"$f":"getProgramXref($A35,numericItinerary(Q$1))","v":"x"},{"$f":"getProgramXref($A35,numericItinerary(R$1))","v":"x"},{"$f":"getProgramXref($A35,numericItinerary(S$1))","v":"x"},{"$f":"getProgramXref($A35,numericItinerary(T$1))","v":""},{"$f":"getProgramXref($A35,numericItinerary(U$1))","v":"x"},{"$f":"getProgramXref($A35,numericItinerary(V$1))","v":""},{"$f":"getProgramXref($A35,numericItinerary(W$1))","v":"x"},{"$f":"getProgramXref($A35,numericItinerary(X$1))","v":""},{"$f":"getProgramXref($A35,numericItinerary(Y$1))","v":""},{"$f":"getProgramXref($A35,numericItinerary(Z$1))","v":""},null,8]
[{"$f":"INDEX(program_table,ROW()-5)","v":"Landmarks: Mountaineering"},15,{"$f":"getProgramXref($A36,numericItinerary(C$1))","v":""},{"$f":"getProgramXref($A36,numericItinerary(D$1))","v":""},{"$f":"getProgramXref($A36,numericItinerary(E$1))","v":""},{"$f":"getProgramXref($A36,numericItinerary(F$1))","v":""},{"$f":"getProgramXref($A36,numericItinerary(G$1))","v":"x"},{"$f":"getProgramXref($A36,numericItinerary(H$1))","v":""},{"$f":"getProgramXref($A36,numericItinerary(I$1))","v":""},{"$f":"getProgramXref($A36,numericItinerary(J$1))","v":"x"},{"$f":"getProgramXref($A36,numericItinerary(K$1))","v":"x"},{"$f":"getProgramXref($A36,numericItinerary(L$1))","v":"x"},{"$f":"getProgramXref($A36,numericItinerary(M$1))","v":"x"},{"$f":"getProgramXref($A36,numericItinerary(N$1))","v":"x"},{"$f":"getProgramXref($A36,numericItinerary(O$1))","v":"x"},{"$f":"getProgramXref($A36,numericItinerary(P$1))","v":""},{"$f":"getProgramXref($A36,numericItinerary(Q$1))","v":"x"},{"$f":"getProgramXref($A36,numericItinerary(R$1))","v":"x"},{"$f":"getProgramXref($A36,numericItinerary(S$1))","v":"x"},{"$f":"getProgramXref($A36,numericItinerary(T$1))","v":"x"},{"$f":"getProgramXref($A36,numericItinerary(U$1))","v":"x"},{"$f":"getProgramXref($A36,numericItinerary(V$1))","v":""},{"$f":"getProgramXref($A36,numericItinerary(W$1))","v":"x"},{"$f":"getProgramXref($A36,numericItinerary(X$1))","v":""},{"$f":"getProgramXref($A36,numericItinerary(Y$1))","v":"x"},{"$f":"getProgramXref($A36,numericItinerary(Z$1))","v":"x"},null,15]
[{"$f":"INDEX(program_table,ROW()-5)","v":"Landmarks: Tooth of Time"},12,{"$f":"getProgramXref($A37,numericItinerary(C$1))","v":"x"},{"$f":"getProgramXref($A37,numericItinerary(D$1))","v":""},{"$f":"getProgramXref($A37,numericItinerary(E$1))","v":""},{"$f":"getProgramXref($A37,numericItinerary(F$1))","v":""},{"$f":"getProgramXref($A37,numericItinerary(G$1))","v":""},{"$f":"getProgramXref($A37,numericItinerary(H$1))","v":""},{"$f":"getProgramXref($A37,numericItinerary(I$1))","v":""},{"$f":"getProgramXref($A37,numericItinerary(J$1))","v":""},{"$f":"getProgramXref($A37,numericItinerary(K$1))","v":"x"},{"$f":"getProgramXref($A37,numericItinerary(L$1))","v":""},{"$f":"getProgramXref($A37,numericItinerary(M$1))","v":"x"},{"$f":"getProgramXref($A37,numericItinerary(N$1))","v":"x"},{"$f":"getProgramXref($A37,numericItinerary(O$1))","v":"x"},{"$f":"getProgramXref($A37,numericItinerary(P$1))","v":""},{"$f":"getProgramXref($A37,numericItinerary(Q$1))","v":"x"},{"$f":"getProgramXref($A37,numericItinerary(R$1))","v":"x"},{"$f":"getProgramXref($A37,numericItinerary(S$1))","v":"x"},{"$f":"getProgramXref($A37,numericItinerary(T$1))","v":""},{"$f":"getProgramXref($A37,numericItinerary(U$1))","v":"x"},{"$f":"getProgramXref($A37,numericItinerary(V$1))","v":""},{"$f":"getProgramXref($A37,numericItinerary(W$1))","v":"x"},{"$f":"getProgramXref($A37,numericItinerary(X$1))","v":""},{"$f":"getProgramXref($A37,numericItinerary(Y$1))","v":"x"},{"$f":"getProgramXref($A37,numericItinerary(Z$1))","v":"x"},null,12]
[{"$f":"INDEX(program_table,ROW()-5)","v":"Landmarks: Trail Peak"},{"$f":"COUNTIF(C38:Z38,\"X\")","v":3},{"$f":"getProgramXref($A38,numericItinerary(C$1))","v":""},{"$f":"getProgramXref($A38,numericItinerary(D$1))","v":""},{"$f":"getProgramXref($A38,numericItinerary(E$1))","v":""},{"$f":"getProgramXref($A38,numericItinerary(F$1))","v":""},{"$f":"getProgramXref($A38,numericItinerary(G$1))","v":""},{"$f":"getProgramXref($A38,numericItinerary(H$1))","v":""},{"$f":"getProgramXref($A38,numericItinerary(I$1))","v":""},{"$f":"getProgramXref($A38,numericItinerary(J$1))","v":""},{"$f":"getProgramXref($A38,numericItinerary(K$1))","v":""},{"$f":"getProgramXref($A38,numericItinerary(L$1))","v":""},{"$f":"getProgramXref($A38,numericItinerary(M$1))","v":""},{"$f":"getProgramXref($A38,numericItinerary(N$1))","v":"x"},{"$f":"getProgramXref($A38,numericItinerary(O$1))","v":""},{"$f":"getProgramXref($A38,numericItinerary(P$1))","v":""},{"$f":"getProgramXref($A38,numericItinerary(Q$1))","v":"x"},{"$f":"getProgramXref($A38,numericItinerary(R$1))","v":""},{"$f":"getProgramXref($A38,numericItinerary(S$1))","v":"x"},{"$f":"getProgramXref($A38,numericItinerary(T$1))","v":""},{"$f":"getProgramXref($A38,numericItinerary(U$1))","v":""},{"$f":"getProgramXref($A38,numericItinerary(V$1))","v":""},{"$f":"getProgramXref($A38,numericItinerary(W$1))","v":""},{"$f":"getProgramXref($A38,numericItinerary(X$1))","v":""},{"$f":"getProgramXref($A38,numericItinerary(Y$1))","v":""},{"$f":"getProgramXref($A38,numericItinerary(Z$1))","v":""},null,{"$f":"COUNTIF(C38:Z38,\"X\")","v":3}]
[{"$f":"INDEX(program_table,ROW()-5)","v":"Livestock: Animal Husbandry"},14,{"$f":"getProgramXref($A39,numericItinerary(C$1))","v":"x"},{"$f":"getProgramXref($A39,numericItinerary(D$1))","v":""},{"$f":"getProgramXref($A39,numericItinerary(E$1))","v":"x"},{"$f":"getProgramXref($A39,numericItinerary(F$1))","v":""},{"$f":"getProgramXref($A39,numericItinerary(G$1))","v":"x"},{"$f":"getProgramXref($A39,numericItinerary(H$1))","v":""},{"$f":"getProgramXref($A39,numericItinerary(I$1))","v":"x"},{"$f":"getProgramXref($A39,numericItinerary(J$1))","v":""},{"$f":"getProgramXref($A39,numericItinerary(K$1))","v":""},{"$f":"getProgramXref($A39,numericItinerary(L$1))","v":"x"},{"$f":"getProgramXref($A39,numericItinerary(M$1))","v":"x"},{"$f":"getProgramXref($A39,numericItinerary(N$1))","v":"x"},{"$f":"getProgramXref($A39,numericItinerary(O$1))","v":"x"},{"$f":"getProgramXref($A39,numericItinerary(P$1))","v":"x"},{"$f":"getProgramXref($A39,numericItinerary(Q$1))","v":"x"},{"$f":"getProgramXref($A39,numericItinerary(R$1))","v":"x"},{"$f":"getProgramXref($A39,numericItinerary(S$1))","v":"x"},{"$f":"getProgramXref($A39,numericItinerary(T$1))","v":""},{"$f":"getProgramXref($A39,numericItinerary(U$1))","v":"x"},{"$f":"getProgramXref($A39,numericItinerary(V$1))","v":""},{"$f":"getProgramXref($A39,numericItinerary(W$1))","v":"x"},{"$f":"getProgramXref($A39,numericItinerary(X$1))","v":""},{"$f":"getProgramXref($A39,numericItinerary(Y$1))","v":""},{"$f":"getProgramXref($A39,numericItinerary(Z$1))","v":""},null,14]
[{"$f":"INDEX(program_table,ROW()-5)","v":"Livestock: Burro Packing"},4,{"$f":"getProgramXref($A40,numericItinerary(C$1))","v":""},{"$f":"getProgramXref($A40,numericItinerary(D$1))","v":""},{"$f":"getProgramXref($A40,numericItinerary(E$1))","v":""},{"$f":"getProgramXref($A40,numericItinerary(F$1))","v":"x"},{"$f":"getProgramXref($A40,numericItinerary(G$1))","v":""},{"$f":"getProgramXref($A40,numericItinerary(H$1))","v":""},{"$f":"getProgramXref($A40,numericItinerary(I$1))","v":""},{"$f":"getProgramXref($A40,numericItinerary(J$1))","v":""},{"$f":"getProgramXref($A40,numericItinerary(K$1))","v":"x"},{"$f":"getProgramXref($A40,numericItinerary(L$1))","v":"x"},{"$f":"getProgramXref($A40,numericItinerary(M$1))","v":""},{"$f":"getProgramXref($A40,numericItinerary(N$1))","v":""},{"$f":"getProgramXref($A40,numericItinerary(O$1))","v":""},{"$f":"getProgramXref($A40,numericItinerary(P$1))","v":""},{"$f":"getProgramXref($A40,numericItinerary(Q$1))","v":""},{"$f":"getProgramXref($A40,numericItinerary(R$1))","v":""},{"$f":"getProgramXref($A40,numericItinerary(S$1))","v":""},{"$f":"getProgramXref($A40,numericItinerary(T$1))","v":""},{"$f":"getProgramXref($A40,numericItinerary(U$1))","v":""},{"$f":"getProgramXref($A40,numericItinerary(V$1))","v":"x"},{"$f":"getProgramXref($A40,numericItinerary(W$1))","v":""},{"$f":"getProgramXref($A40,numericItinerary(X$1))","v":""},{"$f":"getProgramXref($A40,numericItinerary(Y$1))","v":""},{"$f":"getProgramXref($A40,numericItinerary(Z$1))","v":""},null,4]
[{"$f":"INDEX(program_table,ROW()-5)","v":"Livestock: Chicken Tending"},13,{"$f":"getProgramXref($A41,numericItinerary(C$1))","v":"x"},{"$f":"getProgramXref($A41,numericItinerary(D$1))","v":""},{"$f":"getProgramXref($A41,numericItinerary(E$1))","v":"x"},{"$f":"getProgramXref($A41,numericItinerary(F$1))","v":""},{"$f":"getProgramXref($A41,numericItinerary(G$1))","v":"x"},{"$f":"getProgramXref($A41,numericItinerary(H$1))","v":""},{"$f":"getProgramXref($A41,numericItinerary(I$1))","v":"x"},{"$f":"getProgramXref($A41,numericItinerary(J$1))","v":""},{"$f":"getProgramXref($A41,numericItinerary(K$1))","v":""},{"$f":"getProgramXref($A41,numericItinerary(L$1))","v":"x"},{"$f":"getProgramXref($A41,numericItinerary(M$1))","v":"x"},{"$f":"getProgramXref($A41,numericItinerary(N$1))","v":"x"},{"$f":"getProgramXref($A41,numericItinerary(O$1))","v":""},{"$f":"getProgramXref($A41,numericItinerary(P$1))","v":"x"},{"$f":"getProgramXref($A41,numericItinerary(Q$1))","v":"x"},{"$f":"getProgramXref($A41,numericItinerary(R$1))","v":"x"},{"$f":"getProgramXref($A41,numericItinerary(S$1))","v":"x"},{"$f":"getProgramXref($A41,numericItinerary(T$1))","v":""},{"$f":"getProgramXref($A41,numericItinerary(U$1))","v":"x"},{"$f":"getProgramXref($A41,numericItinerary(V$1))","v":""},{"$f":"getProgramXref($A41,numericItinerary(W$1))","v":"x"},{"$f":"getProgramXref($A41,numericItinerary(X$1))","v":""},{"$f":"getProgramXref($A41,numericItinerary(Y$1))","v":""},{"$f":"getProgramXref($A41,numericItinerary(Z$1))","v":""},null,13]
[{"$f":"INDEX(program_table,ROW()-5)","v":"Livestock: Horse Rides"},7,{"$f":"getProgramXref($A42,numericItinerary(C$1))","v":""},{"$f":"getProgramXref($A42,numericItinerary(D$1))","v":""},{"$f":"getProgramXref($A42,numericItinerary(E$1))","v":""},{"$f":"getProgramXref($A42,numericItinerary(F$1))","v":"x"},{"$f":"getProgramXref($A42,numericItinerary(G$1))","v":""},{"$f":"getProgramXref($A42,numericItinerary(H$1))","v":""},{"$f":"getProgramXref($A42,numericItinerary(I$1))","v":""},{"$f":"getProgramXref($A42,numericItinerary(J$1))","v":""},{"$f":"getProgramXref($A42,numericItinerary(K$1))","v":"x"},{"$f":"getProgramXref($A42,numericItinerary(L$1))","v":"x"},{"$f":"getProgramXref($A42,numericItinerary(M$1))","v":"x"},{"$f":"getProgramXref($A42,numericItinerary(N$1))","v":"x"},{"$f":"getProgramXref($A42,numericItinerary(O$1))","v":""},{"$f":"getProgramXref($A42,numericItinerary(P$1))","v":"x"},{"$f":"getProgramXref($A42,numericItinerary(Q$1))","v":""},{"$f":"getProgramXref($A42,numericItinerary(R$1))","v":""},{"$f":"getProgramXref($A42,numericItinerary(S$1))","v":""},{"$f":"getProgramXref($A42,numericItinerary(T$1))","v":""},{"$f":"getProgramXref($A42,numericItinerary(U$1))","v":""},{"$f":"getProgramXref($A42,numericItinerary(V$1))","v":""},{"$f":"getProgramXref($A42,numericItinerary(W$1))","v":""},{"$f":"getProgramXref($A42,numericItinerary(X$1))","v":""},{"$f":"getProgramXref($A42,numericItinerary(Y$1))","v":"x"},{"$f":"getProgramXref($A42,numericItinerary(Z$1))","v":""},null,7]
[{"$f":"INDEX(program_table,ROW()-5)","v":"Low Impact Camping"},6,{"$f":"getProgramXref($A43,numericItinerary(C$1))","v":""},{"$f":"getProgramXref($A43,numericItinerary(D$1))","v":""},{"$f":"getProgramXref($A43,numericItinerary(E$1))","v":"x"},{"$f":"getProgramXref($A43,numericItinerary(F$1))","v":""},{"$f":"getProgramXref($A43,numericItinerary(G$1))","v":"x"},{"$f":"getProgramXref($A43,numericItinerary(H$1))","v":""},{"$f":"getProgramXref($A43,numericItinerary(I$1))","v":"x"},{"$f":"getProgramXref($A43,numericItinerary(J$1))","v":""},{"$f":"getProgramXref($A43,numericItinerary(K$1))","v":""},{"$f":"getProgramXref($A43,numericItinerary(L$1))","v":""},{"$f":"getProgramXref($A43,numericItinerary(M$1))","v":""},{"$f":"getProgramXref($A43,numericItinerary(N$1))","v":""},{"$f":"getProgramXref($A43,numericItinerary(O$1))","v":""},{"$f":"getProgramXref($A43,numericItinerary(P$1))","v":"x"},{"$f":"getProgramXref($A43,numericItinerary(Q$1))","v":""},{"$f":"getProgramXref($A43,numericItinerary(R$1))","v":""},{"$f":"getProgramXref($A43,numericItinerary(S$1))","v":"x"},{"$f":"getProgramXref($A43,numericItinerary(T$1))","v":""},{"$f":"getProgramXref($A43,numericItinerary(U$1))","v":""},{"$f":"getProgramXref($A43,numericItinerary(V$1))","v":"x"},{"$f":"getProgramXref($A43,numericItinerary(W$1))","v":""},{"$f":"getProgramXref($A43,numericItinerary(X$1))","v":""},{"$f":"getProgramXref($A43,numericItinerary(Y$1))","v":""},{"$f":"getProgramXref($A43,numericItinerary(Z$1))","v":""},null,6]
[{"$f":"INDEX(program_table,ROW()-5)","v":"Range Sports: 3D Archery"},13,{"$f":"getProgramXref($A44,numericItinerary(C$1))","v":"x"},{"$f":"getProgramXref($A44,numericItinerary(D$1))","v":"x"},{"$f":"getProgramXref($A44,numericItinerary(E$1))","v":""},{"$f":"getProgramXref($A44,numericItinerary(F$1))","v":""},{"$f":"getProgramXref($A44,numericItinerary(G$1))","v":"x"},{"$f":"getProgramXref($A44,numericItinerary(H$1))","v":"x"},{"$f":"getProgramXref($A44,numericItinerary(I$1))","v":""},{"$f":"getProgramXref($A44,numericItinerary(J$1))","v":"x"},{"$f":"getProgramXref($A44,numericItinerary(K$1))","v":"x"},{"$f":"getProgramXref($A44,numericItinerary(L$1))","v":"x"},{"$f":"getProgramXref($A44,numericItinerary(M$1))","v":""},{"$f":"getProgramXref($A44,numericItinerary(N$1))","v":""},{"$f":"getProgramXref($A44,numericItinerary(O$1))","v":""},{"$f":"getProgramXref($A44,numericItinerary(P$1))","v":""},{"$f":"getProgramXref($A44,numericItinerary(Q$1))","v":""},{"$f":"getProgramXref($A44,numericItinerary(R$1))","v":"x"},{"$f":"getProgramXref($A44,numericItinerary(S$1))","v":"x"},{"$f":"getProgramXref($A44,numericItinerary(T$1))","v":"x"},{"$f":"getProgramXref($A44,numericItinerary(U$1))","v":"x"},{"$f":"getProgramXref($A44,numericItinerary(V$1))","v":""},{"$f":"getProgramXref($A44,numericItinerary(W$1))","v":""},{"$f":"getProgramXref($A44,numericItinerary(X$1))","v":"x"},{"$f":"getProgramXref($A44,numericItinerary(Y$1))","v":"x"},{"$f":"getProgramXref($A44,numericItinerary(Z$1))","v":""},null,13]
[{"$f":"INDEX(program_table,ROW()-5)","v":"Range Sports: Aerial Archery"},13,{"$f":"getProgramXref($A45,numericItinerary(C$1))","v":"x"},{"$f":"getProgramXref($A45,numericItinerary(D$1))","v":"x"},{"$f":"getProgramXref($A45,numericItinerary(E$1))","v":""},{"$f":"getProgramXref($A45,numericItinerary(F$1))","v":""},{"$f":"getProgramXref($A45,numericItinerary(G$1))","v":"x"},{"$f":"getProgramXref($A45,numericItinerary(H$1))","v":"x"},{"$f":"getProgramXref($A45,numericItinerary(I$1))","v":""},{"$f":"getProgramXref($A45,numericItinerary(J$1))","v":"x"},{"$f":"getProgramXref($A45,numericItinerary(K$1))","v":"x"},{"$f":"getProgramXref($A45,numericItinerary(L$1))","v":"x"},{"$f":"getProgramXref($A45,numericItinerary(M$1))","v":""},{"$f":"getProgramXref($A45,numericItinerary(N$1))","v":""},{"$f":"getProgramXref($A45,numericItinerary(O$1))","v":""},{"$f":"getProgramXref($A45,numericItinerary(P$1))","v":""},{"$f":"getProgramXref($A45,numericItinerary(Q$1))","v":""},{"$f":"getProgramXref($A45,numericItinerary(R$1))","v":"x"},{"$f":"getProgramXref($A45,numericItinerary(S$1))","v":"x"},{"$f":"getProgramXref($A45,numericItinerary(T$1))","v":"x"},{"$f":"getProgramXref($A45,numericItinerary(U$1))","v":"x"},{"$f":"getProgramXref($A45,numericItinerary(V$1))","v":""},{"$f":"getProgramXref($A45,numericItinerary(W$1))","v":""},{"$f":"getProgramXref($A45,numericItinerary(X$1))","v":"x"},{"$f":"getProgramXref($A45,numericItinerary(Y$1))","v":"x"},{"$f":"getProgramXref($A45,numericItinerary(Z$1))","v":""},null,13]
[{"$f":"INDEX(program_table,ROW()-5)","v":"Range Sports: Atlatl Throwing"},1,{"$f":"getProgramXref($A46,numericItinerary(C$1))","v":""},{"$f":"getProgramXref($A46,numericItinerary(D$1))","v":""},{"$f":"getProgramXref($A46,numericItinerary(E$1))","v":""},{"$f":"getProgramXref($A46,numericItinerary(F$1))","v":""},{"$f":"getProgramXref($A46,numericItinerary(G$1))","v":""},{"$f":"getProgramXref($A46,numericItinerary(H$1))","v":""},{"$f":"getProgramXref($A46,numericItinerary(I$1))","v":""},{"$f":"getProgramXref($A46,numericItinerary(J$1))","v":"x"},{"$f":"getProgramXref($A46,numericItinerary(K$1))","v":""},{"$f":"getProgramXref($A46,numericItinerary(L$1))","v":""},{"$f":"getProgramXref($A46,numericItinerary(M$1))","v":""},{"$f":"getProgramXref($A46,numericItinerary(N$1))","v":""},{"$f":"getProgramXref($A46,numericItinerary(O$1))","v":""},{"$f":"getProgramXref($A46,numericItinerary(P$1))","v":""},{"$f":"getProgramXref($A46,numericItinerary(Q$1))","v":""},{"$f":"getProgramXref($A46,numericItinerary(R$1))","v":""},{"$f":"getProgramXref($A46,numericItinerary(S$1))","v":""},{"$f":"getProgramXref($A46,numericItinerary(T$1))","v":""},{"$f":"getProgramXref($A46,numericItinerary(U$1))","v":""},{"$f":"getProgramXref($A46,numericItinerary(V$1))","v":""},{"$f":"getProgramXref($A46,numericItinerary(W$1))","v":""},{"$f":"getProgramXref($A46,numericItinerary(X$1))","v":""},{"$f":"getProgramXref($A46,numericItinerary(Y$1))","v":""},{"$f":"getProgramXref($A46,numericItinerary(Z$1))","v":""},null,1]
[{"$f":"INDEX(program_table,ROW()-5)","v":"Range Sports: Cartridge Reloading"},3,{"$f":"getProgramXref($A47,numericItinerary(C$1))","v":""},{"$f":"getProgramXref($A47,numericItinerary(D$1))","v":""},{"$f":"getProgramXref($A47,numericItinerary(E$1))","v":""},{"$f":"getProgramXref($A47,numericItinerary(F$1))","v":""},{"$f":"getProgramXref($A47,numericItinerary(G$1))","v":""},{"$f":"getProgramXref($A47,numericItinerary(H$1))","v":""},{"$f":"getProgramXref($A47,numericItinerary(I$1))","v":""},{"$f":"getProgramXref($A47,numericItinerary(J$1))","v":""},{"$f":"getProgramXref($A47,numericItinerary(K$1))","v":""},{"$f":"getProgramXref($A47,numericItinerary(L$1))","v":""},{"$f":"getProgramXref($A47,numericItinerary(M$1))","v":""},{"$f":"getProgramXref($A47,numericItinerary(N$1))","v":""},{"$f":"getProgramXref($A47,numericItinerary(O$1))","v":""},{"$f":"getProgramXref($A47,numericItinerary(P$1))","v":""},{"$f":"getProgramXref($A47,numericItinerary(Q$1))","v":"x"},{"$f":"getProgramXref($A47,numericItinerary(R$1))","v":""},{"$f":"getProgramXref($A47,numericItinerary(S$1))","v":""},{"$f":"getProgramXref($A47,numericItinerary(T$1))","v":""},{"$f":"getProgramXref($A47,numericItinerary(U$1))","v":"x"},{"$f":"getProgramXref($A47,numericItinerary(V$1))","v":""},{"$f":"getProgramXref($A47,numericItinerary(W$1))","v":""},{"$f":"getProgramXref($A47,numericItinerary(X$1))","v":""},{"$f":"getProgramXref($A47,numericItinerary(Y$1))","v":""},{"$f":"getProgramXref($A47,numericItinerary(Z$1))","v":"x"},null,3]
[{"$f":"INDEX(program_table,ROW()-5)","v":"Range Sports: Cowboy Action Shooting"},6,{"$f":"getProgramXref($A48,numericItinerary(C$1))","v":""},{"$f":"getProgramXref($A48,numericItinerary(D$1))","v":""},{"$f":"getProgramXref($A48,numericItinerary(E$1))","v":""},{"$f":"getProgramXref($A48,numericItinerary(F$1))","v":"x"},{"$f":"getProgramXref($A48,numericItinerary(G$1))","v":""},{"$f":"getProgramXref($A48,numericItinerary(H$1))","v":""},{"$f":"getProgramXref($A48,numericItinerary(I$1))","v":""},{"$f":"getProgramXref($A48,numericItinerary(J$1))","v":""},{"$f":"getProgramXref($A48,numericItinerary(K$1))","v":"x"},{"$f":"getProgramXref($A48,numericItinerary(L$1))","v":"x"},{"$f":"getProgramXref($A48,numericItinerary(M$1))","v":""},{"$f":"getProgramXref($A48,numericItinerary(N$1))","v":""},{"$f":"getProgramXref($A48,numericItinerary(O$1))","v":""},{"$f":"getProgramXref($A48,numericItinerary(P$1))","v":""},{"$f":"getProgramXref($A48,numericItinerary(Q$1))","v":""},{"$f":"getProgramXref($A48,numericItinerary(R$1))","v":""},{"$f":"getProgramXref($A48,numericItinerary(S$1))","v":""},{"$f":"getProgramXref($A48,numericItinerary(T$1))","v":"x"},{"$f":"getProgramXref($A48,numericItinerary(U$1))","v":""},{"$f":"getProgramXref($A48,numericItinerary(V$1))","v":"x"},{"$f":"getProgramXref($A48,numericItinerary(W$1))","v":""},{"$f":"getProgramXref($A48,numericItinerary(X$1))","v":"x"},{"$f":"getProgramXref($A48,numericItinerary(Y$1))","v":""},{"$f":"getProgramXref($A48,numericItinerary(Z$1))","v":""},null,6]
[{"$f":"INDEX(program_table,ROW()-5)","v":"Range Sports: Field Archery"},9,{"$f":"getProgramXref($A49,numericItinerary(C$1))","v":""},{"$f":"getProgramXref($A49,numericItinerary(D$1))","v":"x"},{"$f":"getProgramXref($A49,numericItinerary(E$1))","v":""},{"$f":"getProgramXref($A49,numericItinerary(F$1))","v":""},{"$f":"getProgramXref($A49,numericItinerary(G$1))","v":""},{"$f":"getProgramXref($A49,numericItinerary(H$1))","v":"x"},{"$f":"getProgramXref($A49,numericItinerary(I$1))","v":""},{"$f":"getProgramXref($A49,numericItinerary(J$1))","v":"x"},{"$f":"getProgramXref($A49,numericItinerary(K$1))","v":"x"},{"$f":"getProgramXref($A49,numericItinerary(L$1))","v":"x"},{"$f":"getProgramXref($A49,numericItinerary(M$1))","v":""},{"$f":"getProgramXref($A49,numericItinerary(N$1))","v":""},{"$f":"getProgramXref($A49,numericItinerary(O$1))","v":""},{"$f":"getProgramXref($A49,numericItinerary(P$1))","v":""},{"$f":"getProgramXref($A49,numericItinerary(Q$1))","v":""},{"$f":"getProgramXref($A49,numericItinerary(R$1))","v":""},{"$f":"getProgramXref($A49,numericItinerary(S$1))","v":"x"},{"$f":"getProgramXref($A49,numericItinerary(T$1))","v":"x"},{"$f":"getProgramXref($A49,numericItinerary(U$1))","v":""},{"$f":"getProgramXref($A49,numericItinerary(V$1))","v":""},{"$f":"getProgramXref($A49,numericItinerary(W$1))","v":""},{"$f":"getProgramXref($A49,numericItinerary(X$1))","v":"x"},{"$f":"getProgramXref($A49,numericItinerary(Y$1))","v":"x"},{"$f":"getProgramXref($A49,numericItinerary(Z$1))","v":""},null,9]
[{"$f":"INDEX(program_table,ROW()-5)","v":"Range Sports: Muzzleloader Shooting"},10,{"$f":"getProgramXref($A50,numericItinerary(C$1))","v":""},{"$f":"getProgramXref($A50,numericItinerary(D$1))","v":""},{"$f":"getProgramXref($A50,numericItinerary(E$1))","v":""},{"$f":"getProgramXref($A50,numericItinerary(F$1))","v":"x"},{"$f":"getProgramXref($A50,numericItinerary(G$1))","v":"x"},{"$f":"getProgramXref($A50,numericItinerary(H$1))","v":"x"},{"$f":"getProgramXref($A50,numericItinerary(I$1))","v":"x"},{"$f":"getProgramXref($A50,numericItinerary(J$1))","v":""},{"$f":"getProgramXref($A50,numericItinerary(K$1))","v":"x"},{"$f":"getProgramXref($A50,numericItinerary(L$1))","v":"x"},{"$f":"getProgramXref($A50,numericItinerary(M$1))","v":""},{"$f":"getProgramXref($A50,numericItinerary(N$1))","v":""},{"$f":"getProgramXref($A50,numericItinerary(O$1))","v":"x"},{"$f":"getProgramXref($A50,numericItinerary(P$1))","v":""},{"$f":"getProgramXref($A50,numericItinerary(Q$1))","v":""},{"$f":"getProgramXref($A50,numericItinerary(R$1))","v":""},{"$f":"getProgramXref($A50,numericItinerary(S$1))","v":""},{"$f":"getProgramXref($A50,numericItinerary(T$1))","v":""},{"$f":"getProgramXref($A50,numericItinerary(U$1))","v":""},{"$f":"getProgramXref($A50,numericItinerary(V$1))","v":"x"},{"$f":"getProgramXref($A50,numericItinerary(W$1))","v":"x"},{"$f":"getProgramXref($A50,numericItinerary(X$1))","v":"x"},{"$f":"getProgramXref($A50,numericItinerary(Y$1))","v":""},{"$f":"getProgramXref($A50,numericItinerary(Z$1))","v":""},null,10]
[{"$f":"INDEX(program_table,ROW()-5)","v":"Range Sports: Rifle Shooting"},3,{"$f":"getProgramXref($A51,numericItinerary(C$1))","v":""},{"$f":"getProgramXref($A51,numericItinerary(D$1))","v":""},{"$f":"getProgramXref($A51,numericItinerary(E$1))","v":""},{"$f":"getProgramXref($A51,numericItinerary(F$1))","v":""},{"$f":"getProgramXref($A51,numericItinerary(G$1))","v":""},{"$f":"getProgramXref($A51,numericItinerary(H$1))","v":""},{"$f":"getProgramXref($A51,numericItinerary(I$1))","v":""},{"$f":"getProgramXref($A51,numericItinerary(J$1))","v":""},{"$f":"getProgramXref($A51,numericItinerary(K$1))","v":""},{"$f":"getProgramXref($A51,numericItinerary(L$1))","v":""},{"$f":"getProgramXref($A51,numericItinerary(M$1))","v":""},{"$f":"getProgramXref($A51,numericItinerary(N$1))","v":""},{"$f":"getProgramXref($A51,numericItinerary(O$1))","v":""},{"$f":"getProgramXref($A51,numericItinerary(P$1))","v":""},{"$f":"getProgramXref($A51,numericItinerary(Q$1))","v":"x"},{"$f":"getProgramXref($A51,numericItinerary(R$1))","v":""},{"$f":"getProgramXref($A51,numericItinerary(S$1))","v":""},{"$f":"getProgramXref($A51,numericItinerary(T$1))","v":""},{"$f":"getProgramXref($A51,numericItinerary(U$1))","v":"x"},{"$f":"getProgramXref($A51,numericItinerary(V$1))","v":""},{"$f":"getProgramXref($A51,numericItinerary(W$1))","v":""},{"$f":"getProgramXref($A51,numericItinerary(X$1))","v":""},{"$f":"getProgramXref($A51,numericItinerary(Y$1))","v":""},{"$f":"getProgramXref($A51,numericItinerary(Z$1))","v":"x"},null,3]
[{"$f":"INDEX(program_table,ROW()-5)","v":"Range Sports: Shotgun Shooting"},2,{"$f":"getProgramXref($A52,numericItinerary(C$1))","v":""},{"$f":"getProgramXref($A52,numericItinerary(D$1))","v":""},{"$f":"getProgramXref($A52,numericItinerary(E$1))","v":""},{"$f":"getProgramXref($A52,numericItinerary(F$1))","v":""},{"$f":"getProgramXref($A52,numericItinerary(G$1))","v":""},{"$f":"getProgramXref($A52,numericItinerary(H$1))","v":""},{"$f":"getProgramXref($A52,numericItinerary(I$1))","v":""},{"$f":"getProgramXref($A52,numericItinerary(J$1))","v":""},{"$f":"getProgramXref($A52,numericItinerary(K$1))","v":""},{"$f":"getProgramXref($A52,numericItinerary(L$1))","v":""},{"$f":"getProgramXref($A52,numericItinerary(M$1))","v":""},{"$f":"getProgramXref($A52,numericItinerary(N$1))","v":""},{"$f":"getProgramXref($A52,numericItinerary(O$1))","v":""},{"$f":"getProgramXref($A52,numericItinerary(P$1))","v":"x"},{"$f":"getProgramXref($A52,numericItinerary(Q$1))","v":""},{"$f":"getProgramXref($A52,numericItinerary(R$1))","v":""},{"$f":"getProgramXref($A52,numericItinerary(S$1))","v":""},{"$f":"getProgramXref($A52,numericItinerary(T$1))","v":""},{"$f":"getProgramXref($A52,numericItinerary(U$1))","v":""},{"$f":"getProgramXref($A52,numericItinerary(V$1))","v":""},{"$f":"getProgramXref($A52,numericItinerary(W$1))","v":""},{"$f":"getProgramXref($A52,numericItinerary(X$1))","v":"x"},{"$f":"getProgramXref($A52,numericItinerary(Y$1))","v":""},{"$f":"getProgramXref($A52,numericItinerary(Z$1))","v":""},null,2]
[{"$f":"INDEX(program_table,ROW()-5)","v":"Range Sports: Shotshell Reloading"},2,{"$f":"getProgramXref($A53,numericItinerary(C$1))","v":""},{"$f":"getProgramXref($A53,numericItinerary(D$1))","v":""},{"$f":"getProgramXref($A53,numericItinerary(E$1))","v":""},{"$f":"getProgramXref($A53,numericItinerary(F$1))","v":""},{"$f":"getProgramXref($A53,numericItinerary(G$1))","v":""},{"$f":"getProgramXref($A53,numericItinerary(H$1))","v":""},{"$f":"getProgramXref($A53,numericItinerary(I$1))","v":""},{"$f":"getProgramXref($A53,numericItinerary(J$1))","v":""},{"$f":"getProgramXref($A53,numericItinerary(K$1))","v":""},{"$f":"getProgramXref($A53,numericItinerary(L$1))","v":""},{"$f":"getProgramXref($A53,numericItinerary(M$1))","v":""},{"$f":"getProgramXref($A53,numericItinerary(N$1))","v":""},{"$f":"getProgramXref($A53,numericItinerary(O$1))","v":""},{"$f":"getProgramXref($A53,numericItinerary(P$1))","v":"x"},{"$f":"getProgramXref($A53,numericItinerary(Q$1))","v":""},{"$f":"getProgramXref($A53,numericItinerary(R$1))","v":""},{"$f":"getProgramXref($A53,numericItinerary(S$1))","v":""},{"$f":"getProgramXref($A53,numericItinerary(T$1))","v":""},{"$f":"getProgramXref($A53,numericItinerary(U$1))","v":""},{"$f":"getProgramXref($A53,numericItinerary(V$1))","v":""},{"$f":"getProgramXref($A53,numericItinerary(W$1))","v":""},{"$f":"getProgramXref($A53,numericItinerary(X$1))","v":"x"},{"$f":"getProgramXref($A53,numericItinerary(Y$1))","v":""},{"$f":"getProgramXref($A53,numericItinerary(Z$1))","v":""},null,2]
[{"$f":"INDEX(program_table,ROW()-5)","v":"Range Sports: Tomahawk Throwing"},17,{"$f":"getProgramXref($A54,numericItinerary(C$1))","v":""},{"$f":"getProgramXref($A54,numericItinerary(D$1))","v":"x"},{"$f":"getProgramXref($A54,numericItinerary(E$1))","v":""},{"$f":"getProgramXref($A54,numericItinerary(F$1))","v":"x"},{"$f":"getProgramXref($A54,numericItinerary(G$1))","v":"x"},{"$f":"getProgramXref($A54,numericItinerary(H$1))","v":"x"},{"$f":"getProgramXref($A54,numericItinerary(I$1))","v":"x"},{"$f":"getProgramXref($A54,numericItinerary(J$1))","v":""},{"$f":"getProgramXref($A54,numericItinerary(K$1))","v":"x"},{"$f":"getProgramXref($A54,numericItinerary(L$1))","v":"x"},{"$f":"getProgramXref($A54,numericItinerary(M$1))","v":""},{"$f":"getProgramXref($A54,numericItinerary(N$1))","v":"x"},{"$f":"getProgramXref($A54,numericItinerary(O$1))","v":""},{"$f":"getProgramXref($A54,numericItinerary(P$1))","v":""},{"$f":"getProgramXref($A54,numericItinerary(Q$1))","v":"x"},{"$f":"getProgramXref($A54,numericItinerary(R$1))","v":"x"},{"$f":"getProgramXref($A54,numericItinerary(S$1))","v":"x"},{"$f":"getProgramXref($A54,numericItinerary(T$1))","v":""},{"$f":"getProgramXref($A54,numericItinerary(U$1))","v":"x"},{"$f":"getProgramXref($A54,numericItinerary(V$1))","v":"x"},{"$f":"getProgramXref($A54,numericItinerary(W$1))","v":"x"},{"$f":"getProgramXref($A54,numericItinerary(X$1))","v":"x"},{"$f":"getProgramXref($A54,numericItinerary(Y$1))","v":"x"},{"$f":"getProgramXref($A54,numericItinerary(Z$1))","v":"x"},null,17]
[{"$f":"INDEX(program_table,ROW()-5)","v":"STEM: Archeology"},2,{"$f":"getProgramXref($A55,numericItinerary(C$1))","v":""},{"$f":"getProgramXref($A55,numericItinerary(D$1))","v":""},{"$f":"getProgramXref($A55,numericItinerary(E$1))","v":"x"},{"$f":"getProgramXref($A55,numericItinerary(F$1))","v":""},{"$f":"getProgramXref($A55,numericItinerary(G$1))","v":""},{"$f":"getProgramXref($A55,numericItinerary(H$1))","v":""},{"$f":"getProgramXref($A55,numericItinerary(I$1))","v":""},{"$f":"getProgramXref($A55,numericItinerary(J$1))","v":"x"},{"$f":"getProgramXref($A55,numericItinerary(K$1))","v":""},{"$f":"getProgramXref($A55,numericItinerary(L$1))","v":""},{"$f":"getProgramXref($A55,numericItinerary(M$1))","v":""},{"$f":"getProgramXref($A55,numericItinerary(N$1))","v":""},{"$f":"getProgramXref($A55,numericItinerary(O$1))","v":""},{"$f":"getProgramXref($A55,numericItinerary(P$1))","v":""},{"$f":"getProgramXref($A55,numericItinerary(Q$1))","v":""},{"$f":"getProgramXref($A55,numericItinerary(R$1))","v":""},{"$f":"getProgramXref($A55,numericItinerary(S$1))","v":""},{"$f":"getProgramXref($A55,numericItinerary(T$1))","v":""},{"$f":"getProgramXref($A55,numericItinerary(U$1))","v":""},{"$f":"getProgramXref($A55,numericItinerary(V$1))","v":""},{"$f":"getProgramXref($A55,numericItinerary(W$1))","v":""},{"$f":"getProgramXref($A55,numericItinerary(X$1))","v":""},{"$f":"getProgramXref($A55,numericItinerary(Y$1))","v":""},{"$f":"getProgramXref($A55,numericItinerary(Z$1))","v":""}]
[{"$f":"INDEX(program_table,ROW()-5)","v":"STEM: Astronomy"},4,{"$f":"getProgramXref($A56,numericItinerary(C$1))","v":""},{"$f":"getProgramXref($A56,numericItinerary(D$1))","v":""},{"$f":"getProgramXref($A56,numericItinerary(E$1))","v":"x"},{"$f":"getProgramXref($A56,numericItinerary(F$1))","v":""},{"$f":"getProgramXref($A56,numericItinerary(G$1))","v":""},{"$f":"getProgramXref($A56,numericItinerary(H$1))","v":""},{"$f":"getProgramXref($A56,numericItinerary(I$1))","v":"x"},{"$f":"getProgramXref($A56,numericItinerary(J$1))","v":""},{"$f":"getProgramXref($A56,numericItinerary(K$1))","v":""},{"$f":"getProgramXref($A56,numericItinerary(L$1))","v":""},{"$f":"getProgramXref($A56,numericItinerary(M$1))","v":""},{"$f":"getProgramXref($A56,numericItinerary(N$1))","v":""},{"$f":"getProgramXref($A56,numericItinerary(O$1))","v":""},{"$f":"getProgramXref($A56,numericItinerary(P$1))","v":"x"},{"$f":"getProgramXref($A56,numericItinerary(Q$1))","v":""},{"$f":"getProgramXref($A56,numericItinerary(R$1))","v":""},{"$f":"getProgramXref($A56,numericItinerary(S$1))","v":""},{"$f":"getProgramXref($A56,numericItinerary(T$1))","v":""},{"$f":"getProgramXref($A56,numericItinerary(U$1))","v":""},{"$f":"getProgramXref($A56,numericItinerary(V$1))","v":"x"},{"$f":"getProgramXref($A56,numericItinerary(W$1))","v":""},{"$f":"getProgramXref($A56,numericItinerary(X$1))","v":""},{"$f":"getProgramXref($A56,numericItinerary(Y$1))","v":""},{"$f":"getProgramXref($A56,numericItinerary(Z$1))","v":""},null,{"$f":"COUNTIF(C56:Z56,\"X\")","v":4}]
[{"$f":"INDEX(program_table,ROW()-5)","v":"STEM: Geology"},13,{"$f":"getProgramXref($A57,numericItinerary(C$1))","v":""},{"$f":"getProgramXref($A57,numericItinerary(D$1))","v":"x"},{"$f":"getProgramXref($A57,numericItinerary(E$1))","v":""},{"$f":"getProgramXref($A57,numericItinerary(F$1))","v":"x"},{"$f":"getProgramXref($A57,numericItinerary(G$1))","v":""},{"$f":"getProgramXref($A57,numericItinerary(H$1))","v":"x"},{"$f":"getProgramXref($A57,numericItinerary(I$1))","v":"x"},{"$f":"getProgramXref($A57,numericItinerary(J$1))","v":"x"},{"$f":"getProgramXref($A57,numericItinerary(K$1))","v":""},{"$f":"getProgramXref($A57,numericItinerary(L$1))","v":"x"},{"$f":"getProgramXref($A57,numericItinerary(M$1))","v":""},{"$f":"getProgramXref($A57,numericItinerary(N$1))","v":""},{"$f":"getProgramXref($A57,numericItinerary(O$1))","v":""},{"$f":"getProgramXref($A57,numericItinerary(P$1))","v":""},{"$f":"getProgramXref($A57,numericItinerary(Q$1))","v":"x"},{"$f":"getProgramXref($A57,numericItinerary(R$1))","v":""},{"$f":"getProgramXref($A57,numericItinerary(S$1))","v":"x"},{"$f":"getProgramXref($A57,numericItinerary(T$1))","v":"x"},{"$f":"getProgramXref($A57,numericItinerary(U$1))","v":""},{"$f":"getProgramXref($A57,numericItinerary(V$1))","v":"x"},{"$f":"getProgramXref($A57,numericItinerary(W$1))","v":"x"},{"$f":"getProgramXref($A57,numericItinerary(X$1))","v":"x"},{"$f":"getProgramXref($A57,numericItinerary(Y$1))","v":""},{"$f":"getProgramXref($A57,numericItinerary(Z$1))","v":"x"},null,13]
[{"$f":"INDEX(program_table,ROW()-5)","v":"Western Lore: Branding"},0,{"$f":"getProgramXref($A58,numericItinerary(C$1))","v":""},{"$f":"getProgramXref($A58,numericItinerary(D$1))","v":""},{"$f":"getProgramXref($A58,numericItinerary(E$1))","v":""},{"$f":"getProgramXref($A58,numericItinerary(F$1))","v":""},{"$f":"getProgramXref($A58,numericItinerary(G$1))","v":""},{"$f":"getProgramXref($A58,numericItinerary(H$1))","v":""},{"$f":"getProgramXref($A58,numericItinerary(I$1))","v":""},{"$f":"getProgramXref($A58,numericItinerary(J$1))","v":""},{"$f":"getProgramXref($A58,numericItinerary(K$1))","v":""},{"$f":"getProgramXref($A58,numericItinerary(L$1))","v":""},{"$f":"getProgramXref($A58,numericItinerary(M$1))","v":""},{"$f":"getProgramXref($A58,numericItinerary(N$1))","v":""},{"$f":"getProgramXref($A58,numericItinerary(O$1))","v":""},{"$f":"getProgramXref($A58,numericItinerary(P$1))","v":""},{"$f":"getProgramXref($A58,numericItinerary(Q$1))","v":""},{"$f":"getProgramXref($A58,numericItinerary(R$1))","v":""},{"$f":"getProgramXref($A58,numericItinerary(S$1))","v":""},{"$f":"getProgramXref($A58,numericItinerary(T$1))","v":""},{"$f":"getProgramXref($A58,numericItinerary(U$1))","v":""},{"$f":"getProgramXref($A58,numericItinerary(V$1))","v":""},{"$f":"getProgramXref($A58,numericItinerary(W$1))","v":""},{"$f":"getProgramXref($A58,numericItinerary(X$1))","v":""},{"$f":"getProgramXref($A58,numericItinerary(Y$1))","v":""},{"$f":"getProgramXref($A58,numericItinerary(Z$1))","v":""},null,0]
[{"$f":"INDEX(program_table,ROW()-5)","v":"Western Lore: Cantina"},15,{"$f":"getProgramXref($A59,numericItinerary(C$1))","v":"x"},{"$f":"getProgramXref($A59,numericItinerary(D$1))","v":"x"},{"$f":"getProgramXref($A59,numericItinerary(E$1))","v":""},{"$f":"getProgramXref($A59,numericItinerary(F$1))","v":"x"},{"$f":"getProgramXref($A59,numericItinerary(G$1))","v":"x"},{"$f":"getProgramXref($A59,numericItinerary(H$1))","v":""},{"$f":"getProgramXref($A59,numericItinerary(I$1))","v":""},{"$f":"getProgramXref($A59,numericItinerary(J$1))","v":"x"},{"$f":"getProgramXref($A59,numericItinerary(K$1))","v":"x"},{"$f":"getProgramXref($A59,numericItinerary(L$1))","v":"x"},{"$f":"getProgramXref($A59,numericItinerary(M$1))","v":"x"},{"$f":"getProgramXref($A59,numericItinerary(N$1))","v":"x"},{"$f":"getProgramXref($A59,numericItinerary(O$1))","v":""},{"$f":"getProgramXref($A59,numericItinerary(P$1))","v":""},{"$f":"getProgramXref($A59,numericItinerary(Q$1))","v":""},{"$f":"getProgramXref($A59,numericItinerary(R$1))","v":"x"},{"$f":"getProgramXref($A59,numericItinerary(S$1))","v":""},{"$f":"getProgramXref($A59,numericItinerary(T$1))","v":"x"},{"$f":"getProgramXref($A59,numericItinerary(U$1))","v":""},{"$f":"getProgramXref($A59,numericItinerary(V$1))","v":"x"},{"$f":"getProgramXref($A59,numericItinerary(W$1))","v":"x"},{"$f":"getProgramXref($A59,numericItinerary(X$1))","v":"x"},{"$f":"getProgramXref($A59,numericItinerary(Y$1))","v":""},{"$f":"getProgramXref($A59,numericItinerary(Z$1))","v":"x"},null,15]
[{"$f":"INDEX(program_table,ROW()-5)","v":"Western Lore: Roping"},19,{"$f":"getProgramXref($A60,numericItinerary(C$1))","v":"x"},{"$f":"getProgramXref($A60,numericItinerary(D$1))","v":"x"},{"$f":"getProgramXref($A60,numericItinerary(E$1))","v":""},{"$f":"getProgramXref($A60,numericItinerary(F$1))","v":"x"},{"$f":"getProgramXref($A60,numericItinerary(G$1))","v":"x"},{"$f":"getProgramXref($A60,numericItinerary(H$1))","v":"x"},{"$f":"getProgramXref($A60,numericItinerary(I$1))","v":""},{"$f":"getProgramXref($A60,numericItinerary(J$1))","v":"x"},{"$f":"getProgramXref($A60,numericItinerary(K$1))","v":"x"},{"$f":"getProgramXref($A60,numericItinerary(L$1))","v":""},{"$f":"getProgramXref($A60,numericItinerary(M$1))","v":"x"},{"$f":"getProgramXref($A60,numericItinerary(N$1))","v":"x"},{"$f":"getProgramXref($A60,numericItinerary(O$1))","v":""},{"$f":"getProgramXref($A60,numericItinerary(P$1))","v":""},{"$f":"getProgramXref($A60,numericItinerary(Q$1))","v":"x"},{"$f":"getProgramXref($A60,numericItinerary(R$1))","v":"x"},{"$f":"getProgramXref($A60,numericItinerary(S$1))","v":"x"},{"$f":"getProgramXref($A60,numericItinerary(T$1))","v":"x"},{"$f":"getProgramXref($A60,numericItinerary(U$1))","v":"x"},{"$f":"getProgramXref($A60,numericItinerary(V$1))","v":"x"},{"$f":"getProgramXref($A60,numericItinerary(W$1))","v":"x"},{"$f":"getProgramXref($A60,numericItinerary(X$1))","v":"x"},{"$f":"getProgramXref($A60,numericItinerary(Y$1))","v":"x"},{"$f":"getProgramXref($A60,numericItinerary(Z$1))","v":"x"},null,19]
[{"$f":"INDEX(program_table,ROW()-5)","v":"Wheeled: Mountain Biking"},4,{"$f":"getProgramXref($A61,numericItinerary(C$1))","v":""},{"$f":"getProgramXref($A61,numericItinerary(D$1))","v":""},{"$f":"getProgramXref($A61,numericItinerary(E$1))","v":"x"},{"$f":"getProgramXref($A61,numericItinerary(F$1))","v":""},{"$f":"getProgramXref($A61,numericItinerary(G$1))","v":""},{"$f":"getProgramXref($A61,numericItinerary(H$1))","v":""},{"$f":"getProgramXref($A61,numericItinerary(I$1))","v":"x"},{"$f":"getProgramXref($A61,numericItinerary(J$1))","v":""},{"$f":"getProgramXref($A61,numericItinerary(K$1))","v":""},{"$f":"getProgramXref($A61,numericItinerary(L$1))","v":""},{"$f":"getProgramXref($A61,numericItinerary(M$1))","v":""},{"$f":"getProgramXref($A61,numericItinerary(N$1))","v":""},{"$f":"getProgramXref($A61,numericItinerary(O$1))","v":""},{"$f":"getProgramXref($A61,numericItinerary(P$1))","v":"x"},{"$f":"getProgramXref($A61,numericItinerary(Q$1))","v":""},{"$f":"getProgramXref($A61,numericItinerary(R$1))","v":""},{"$f":"getProgramXref($A61,numericItinerary(S$1))","v":""},{"$f":"getProgramXref($A61,numericItinerary(T$1))","v":""},{"$f":"getProgramXref($A61,numericItinerary(U$1))","v":""},{"$f":"getProgramXref($A61,numericItinerary(V$1))","v":"x"},{"$f":"getProgramXref($A61,numericItinerary(W$1))","v":""},{"$f":"getProgramXref($A61,numericItinerary(X$1))","v":""},{"$f":"getProgramXref($A61,numericItinerary(Y$1))","v":""},{"$f":"getProgramXref($A61,numericItinerary(Z$1))","v":""},null,4]
["# programs in itinerary:  ",null,{"$f":"COUNTIF(C6:C61,\"X\")","v":22},18,14,20,19,17,17,21,23,26,19,23,18,18,23,23,27,{"$f":"COUNTIF(T6:T61,\"X\")","v":18},20,18,28,23,21,22,null,{"$f":"COUNTIF(#REF!,\"X\")","v":{"$error":"#REF!"}}]
[null,null,null,null,null,null,null,null,null,null,null,null,null,null,null,null,null,null,null,null,null,null,null,null,null,null,null,{"$f":"COUNTIF(#REF!,\"X\")","v":{"$error":"#REF!"}}]
[null,null,null,null,null,null,null,null,null,null,null,null,null,null,null,null,null,null,null,null,null,null,null,null,null,null,null,{"$f":"COUNTIF(#REF!,\"X\")","v":{"$error":"#REF!"}}]
[null,null,null,null,null,null,null,null,null,null,null,null,null,null,null,null,null,null,null,null,null,null,null,null,null,null,null,{"$f":"COUNTIF(#REF!,\"X\")","v":{"$error":"#REF!"}}]

{"sheet":"Tables","index":8,"n_rows":153,"n_cols":16,"rows_kept":153,"cut":false,"hidden":false,"merged":[[1,4,1,10],[1,11,57,11],[145,0,152,0],[108,10,108,14],[116,8,116,9],[117,8,117,9],[120,11,125,11],[120,12,125,12],[120,13,125,13],[120,14,125,14]]}
["Row","Category","Code","Value",null,"Total","Score Selected",null,null,null,"n","Index"]
[null,"programFactor","Multiply X Activity score for value to use",1.5,"This is applied to each score in the calculation. Use to make activities more/less important.",null,null,null,null,null,null,"These are the results of the \"Scores\" worksheet — from the scores entered from the Preference Survey worksheets.","Total","Average","Median","Mode"]
[{"$f":"ROW()-2","v":1},"Program",{"$f":" INDEX(program_table,A3,1)","v":"Climbing: Bouldering Gym"},{"$f":"SUM(Scores!B2:M2)","v":152},null,null,null,null,null,null,1,null,{"$f":"SUM(Scores!$B2:M2)*programFactor","v":228},{"$f":"IF(COUNT(Scores!$B2:M2)>0,AVERAGE(Scores!$B2:M2)*programFactor,0)","v":19},{"$f":"IF(COUNT(Scores!$B2:M2)>0,MEDIAN(Scores!$B2:M2)*programFactor,0)","v":22.5},{"$f":"IF(getmode(Scores!$B2:M2)=\"\",\"\",getmode(Scores!$B2:M2)*programFactor)","v":22.5}]
[{"$f":"ROW()-2","v":2},"Program",{"$f":" INDEX(program_table,A4,1)","v":"Climbing: Climbing Wall/Tower"},{"$f":"SUM(Scores!B3:M3)","v":225},null,null,null,null,null,null,2,null,{"$f":"SUM(Scores!$B3:M3)*programFactor","v":337.5},{"$f":"IF(COUNT(Scores!$B3:M3)>0,AVERAGE(Scores!$B3:M3)*programFactor,0)","v":28.125},{"$f":"IF(COUNT(Scores!$B3:M3)>0,MEDIAN(Scores!$B3:M3)*programFactor,0)","v":30},{"$f":"IF(getmode(Scores!$B3:M3)=\"\",\"\",getmode(Scores!$B3:M3)*programFactor)","v":30}]
[3,"Program",{"$f":" INDEX(program_table,A5,1)","v":"Climbing: Crate Stacking"},{"$f":"SUM(Scores!B4:M4)","v":76},null,null,null,null,null,null,3,null,{"$f":"SUM(Scores!$B4:M4)*programFactor","v":114},{"$f":"IF(COUNT(Scores!$B4:M4)>0,AVERAGE(Scores!$B4:M4)*programFactor,0)","v":9.5},{"$f":"IF(COUNT(Scores!$B4:M4)>0,MEDIAN(Scores!$B4:M4)*programFactor,0)","v":10.5},{"$f":"IF(getmode(Scores!$B4:M4)=\"\",\"\",getmode(Scores!$B4:M4)*programFactor)","v":3}]
[4,"Program",{"$f":" INDEX(program_table,A6,1)","v":"Climbing: Rock Climbing"},{"$f":"SUM(Scores!B5:M5)","v":188},null,null,null,null,null,null,4,null,{"$f":"SUM(Scores!$B5:M5)*programFactor","v":282},{"$f":"IF(COUNT(Scores!$B5:M5)>0,AVERAGE(Scores!$B5:M5)*programFactor,0)","v":23.5},{"$f":"IF(COUNT(Scores!$B5:M5)>0,MEDIAN(Scores!$B5:M5)*programFactor,0)","v":27},{"$f":"IF(getmode(Scores!$B5:M5)=\"\",\"\",getmode(Scores!$B5:M5)*programFactor)","v":27}]
[5,"Program",{"$f":" INDEX(program_table,A7,1)","v":"COPE: High Challenge Course"},{"$f":"SUM(Scores!B6:M6)","v":108},null,null,null,null,null,null,5,null,{"$f":"SUM(Scores!$B6:M6)*programFactor","v":162},{"$f":"IF(COUNT(Scores!$B6:M6)>0,AVERAGE(Scores!$B6:M6)*programFactor,0)","v":13.5},{"$f":"IF(COUNT(Scores!$B6:M6)>0,MEDIAN(Scores!$B6:M6)*programFactor,0)","v":12.75},{"$f":"IF(getmode(Scores!$B6:M6)=\"\",\"\",getmode(Scores!$B6:M6)*programFactor)","v":0}]
[6,"Program",{"$f":" INDEX(program_table,A8,1)","v":"COPE: Initiative Games"},{"$f":"SUM(Scores!B7:M7)","v":111},null,null,null,null,null,null,6,null,{"$f":"SUM(Scores!$B7:M7)*programFactor","v":166.5},{"$f":"IF(COUNT(Scores!$B7:M7)>0,AVERAGE(Scores!$B7:M7)*programFactor,0)","v":13.875},{"$f":"IF(COUNT(Scores!$B7:M7)>0,MEDIAN(Scores!$B7:M7)*programFactor,0)","v":14.25},{"$f":"IF(getmode(Scores!$B7:M7)=\"\",\"\",getmode(Scores!$B7:M7)*programFactor)","v":0}]
[7,"Program",{"$f":" INDEX(program_table,A9,1)","v":"COPE: Low Challenge Course"},{"$f":"SUM(Scores!B8:M8)","v":111},null,null,null,null,null,null,7,null,{"$f":"SUM(Scores!$B8:M8)*programFactor","v":166.5},{"$f":"IF(COUNT(Scores!$B8:M8)>0,AVERAGE(Scores!$B8:M8)*programFactor,0)","v":13.875},{"$f":"IF(COUNT(Scores!$B8:M8)>0,MEDIAN(Scores!$B8:M8)*programFactor,0)","v":14.25},{"$f":"IF(getmode(Scores!$B8:M8)=\"\",\"\",getmode(Scores!$B8:M8)*programFactor)","v":0}]
[8,"Program",{"$f":" INDEX(program_table,A10,1)","v":"Ecology: Demonstration Forest"},{"$f":"SUM(Scores!B9:M9)","v":84},null,null,null,null,null,null,8,null,{"$f":"SUM(Scores!$B9:M9)*programFactor","v":126},{"$f":"IF(COUNT(Scores!$B9:M9)>0,AVERAGE(Scores!$B9:M9)*programFactor,0)","v":10.5},{"$f":"IF(COUNT(Scores!$B9:M9)>0,MEDIAN(Scores!$B9:M9)*programFactor,0)","v":9},{"$f":"IF(getmode(Scores!$B9:M9)=\"\",\"\",getmode(Scores!$B9:M9)*programFactor)","v":0}]
[9,"Program",{"$f":" INDEX(program_table,A11,1)","v":"Ecology: Self-Guided Fishing"},{"$f":"SUM(Scores!B10:M10)","v":87},null,null,null,null,null,null,9,null,{"$f":"SUM(Scores!$B10:M10)*programFactor","v":130.5},{"$f":"IF(COUNT(Scores!$B10:M10)>0,AVERAGE(Scores!$B10:M10)*programFactor,0)","v":10.875},{"$f":"IF(COUNT(Scores!$B10:M10)>0,MEDIAN(Scores!$B10:M10)*programFactor,0)","v":13.5},{"$f":"IF(getmode(Scores!$B10:M10)=\"\",\"\",getmode(Scores!$B10:M10)*programFactor)","v":0}]
[10,"Program",{"$f":" INDEX(program_table,A12,1)","v":"Evening: Abreu Family Dinner"},{"$f":"SUM(Scores!B11:M11)","v":61},null,null,null,null,null,null,10,null,{"$f":"SUM(Scores!$B11:M11)*programFactor","v":91.5},{"$f":"IF(COUNT(Scores!$B11:M11)>0,AVERAGE(Scores!$B11:M11)*programFactor,0)","v":8.3181818181818183},{"$f":"IF(COUNT(Scores!$B11:M11)>0,MEDIAN(Scores!$B11:M11)*programFactor,0)","v":7.5},{"$f":"IF(getmode(Scores!$B11:M11)=\"\",\"\",getmode(Scores!$B11:M11)*programFactor)","v":0}]
[11,"Program",{"$f":" INDEX(program_table,A13,1)","v":"Evening: Advisor Coffee"},{"$f":"SUM(Scores!B12:M12)","v":73},null,null,null,null,null,null,11,null,{"$f":"SUM(Scores!$B12:M12)*programFactor","v":109.5},{"$f":"IF(COUNT(Scores!$B12:M12)>0,AVERAGE(Scores!$B12:M12)*programFactor,0)","v":9.954545454545455},{"$f":"IF(COUNT(Scores!$B12:M12)>0,MEDIAN(Scores!$B12:M12)*programFactor,0)","v":7.5},{"$f":"IF(getmode(Scores!$B12:M12)=\"\",\"\",getmode(Scores!$B12:M12)*programFactor)","v":7.5}]
[12,"Program",{"$f":" INDEX(program_table,A14,1)","v":"Evening: Campfire Show"},{"$f":"SUM(Scores!B13:M13)","v":73},null,null,null,null,null,null,12,null,{"$f":"SUM(Scores!$B13:M13)*programFactor","v":109.5},{"$f":"IF(COUNT(Scores!$B13:M13)>0,AVERAGE(Scores!$B13:M13)*programFactor,0)","v":13.6875},{"$f":"IF(COUNT(Scores!$B13:M13)>0,MEDIAN(Scores!$B13:M13)*programFactor,0)","v":15.75},{"$f":"IF(getmode(Scores!$B13:M13)=\"\",\"\",getmode(Scores!$B13:M13)*programFactor)","v":0}]
[13,"Program",{"$f":" INDEX(program_table,A15,1)","v":"Evening: Chuckwagon Dinner"},{"$f":"SUM(Scores!B14:M14)","v":74},null,null,null,null,null,null,13,null,{"$f":"SUM(Scores!$B14:M14)*programFactor","v":111},{"$f":"IF(COUNT(Scores!$B14:M14)>0,AVERAGE(Scores!$B14:M14)*programFactor,0)","v":9.25},{"$f":"IF(COUNT(Scores!$B14:M14)>0,MEDIAN(Scores!$B14:M14)*programFactor,0)","v":6},{"$f":"IF(getmode(Scores!$B14:M14)=\"\",\"\",getmode(Scores!$B14:M14)*programFactor)","v":0}]
[14,"Program",{"$f":" INDEX(program_table,A16,1)","v":"Historical: Adobe Brick-Making"},{"$f":"SUM(Scores!B15:M15)","v":76},null,null,null,null,null,null,14,null,{"$f":"SUM(Scores!$B15:M15)*programFactor","v":114},{"$f":"IF(COUNT(Scores!$B15:M15)>0,AVERAGE(Scores!$B15:M15)*programFactor,0)","v":10.363636363636363},{"$f":"IF(COUNT(Scores!$B15:M15)>0,MEDIAN(Scores!$B15:M15)*programFactor,0)","v":10.5},{"$f":"IF(getmode(Scores!$B15:M15)=\"\",\"\",getmode(Scores!$B15:M15)*programFactor)","v":3}]
[15,"Program",{"$f":" INDEX(program_table,A17,1)","v":"Historical: Blacksmithing"},{"$f":"SUM(Scores!B16:M16)","v":82},null,null,null,null,null,null,15,null,{"$f":"SUM(Scores!$B16:M16)*programFactor","v":123},{"$f":"IF(COUNT(Scores!$B16:M16)>0,AVERAGE(Scores!$B16:M16)*programFactor,0)","v":11.181818181818182},{"$f":"IF(COUNT(Scores!$B16:M16)>0,MEDIAN(Scores!$B16:M16)*programFactor,0)","v":7.5},{"$f":"IF(getmode(Scores!$B16:M16)=\"\",\"\",getmode(Scores!$B16:M16)*programFactor)","v":4.5}]
[16,"Program",{"$f":" INDEX(program_table,A18,1)","v":"Historical: Cabin Restoration"},{"$f":"SUM(Scores!B17:M17)","v":84},null,null,null,null,null,null,16,null,{"$f":"SUM(Scores!$B17:M17)*programFactor","v":126},{"$f":"IF(COUNT(Scores!$B17:M17)>0,AVERAGE(Scores!$B17:M17)*programFactor,0)","v":10.5},{"$f":"IF(COUNT(Scores!$B17:M17)>0,MEDIAN(Scores!$B17:M17)*programFactor,0)","v":12},{"$f":"IF(getmode(Scores!$B17:M17)=\"\",\"\",getmode(Scores!$B17:M17)*programFactor)","v":12}]
[17,"Program",{"$f":" INDEX(program_table,A19,1)","v":"Historical: Cabin/House Tour"},{"$f":"SUM(Scores!B18:M18)","v":71},null,null,null,null,null,null,17,null,{"$f":"SUM(Scores!$B18:M18)*programFactor","v":106.5},{"$f":"IF(COUNT(Scores!$B18:M18)>0,AVERAGE(Scores!$B18:M18)*programFactor,0)","v":8.875},{"$f":"IF(COUNT(Scores!$B18:M18)>0,MEDIAN(Scores!$B18:M18)*programFactor,0)","v":6},{"$f":"IF(getmode(Scores!$B18:M18)=\"\",\"\",getmode(Scores!$B18:M18)*programFactor)","v":1.5}]
[18,"Program",{"$f":" INDEX(program_table,A20,1)","v":"Historical: Crafting"},{"$f":"SUM(Scores!B19:M19)","v":97},null,null,null,null,null,null,18,null,{"$f":"SUM(Scores!$B19:M19)*programFactor","v":145.5},{"$f":"IF(COUNT(Scores!$B19:M19)>0,AVERAGE(Scores!$B19:M19)*programFactor,0)","v":13.227272727272727},{"$f":"IF(COUNT(Scores!$B19:M19)>0,MEDIAN(Scores!$B19:M19)*programFactor,0)","v":15},{"$f":"IF(getmode(Scores!$B19:M19)=\"\",\"\",getmode(Scores!$B19:M19)*programFactor)","v":15}]
[19,"Program",{"$f":" INDEX(program_table,A21,1)","v":"Historical: Crosscut & Tie Making"},{"$f":"SUM(Scores!B20:M20)","v":62},null,null,null,null,null,null,19,null,{"$f":"SUM(Scores!$B20:M20)*programFactor","v":93},{"$f":"IF(COUNT(Scores!$B20:M20)>0,AVERAGE(Scores!$B20:M20)*programFactor,0)","v":7.75},{"$f":"IF(COUNT(Scores!$B20:M20)>0,MEDIAN(Scores!$B20:M20)*programFactor,0)","v":6},{"$f":"IF(getmode(Scores!$B20:M20)=\"\",\"\",getmode(Scores!$B20:M20)*programFactor)","v":0}]
[20,"Program",{"$f":" INDEX(program_table,A22,1)","v":"Historical: Flint Knapping"},{"$f":"SUM(Scores!B21:M21)","v":104},null,null,null,null,null,null,20,null,{"$f":"SUM(Scores!$B21:M21)*programFactor","v":156},{"$f":"IF(COUNT(Scores!$B21:M21)>0,AVERAGE(Scores!$B21:M21)*programFactor,0)","v":13},{"$f":"IF(COUNT(Scores!$B21:M21)>0,MEDIAN(Scores!$B21:M21)*programFactor,0)","v":15},{"$f":"IF(getmode(Scores!$B21:M21)=\"\",\"\",getmode(Scores!$B21:M21)*programFactor)","v":3}]
[21,"Program",{"$f":" INDEX(program_table,A23,1)","v":"Historical: Fur Trapper Rendezvous"},{"$f":"SUM(Scores!B22:M22)","v":76},null,null,null,null,null,null,21,null,{"$f":"SUM(Scores!$B22:M22)*programFactor","v":114},{"$f":"IF(COUNT(Scores!$B22:M22)>0,AVERAGE(Scores!$B22:M22)*programFactor,0)","v":9.5},{"$f":"IF(COUNT(Scores!$B22:M22)>0,MEDIAN(Scores!$B22:M22)*programFactor,0)","v":6},{"$f":"IF(getmode(Scores!$B22:M22)=\"\",\"\",getmode(Scores!$B22:M22)*programFactor)","v":0}]
[22,"Program",{"$f":" INDEX(program_table,A24,1)","v":"Historical: Gold Panning"},{"$f":"SUM(Scores!B23:M23)","v":86},null,null,null,null,null,null,22,null,{"$f":"SUM(Scores!$B23:M23)*programFactor","v":129},{"$f":"IF(COUNT(Scores!$B23:M23)>0,AVERAGE(Scores!$B23:M23)*programFactor,0)","v":10.75},{"$f":"IF(COUNT(Scores!$B23:M23)>0,MEDIAN(Scores!$B23:M23)*programFactor,0)","v":9.75},{"$f":"IF(getmode(Scores!$B23:M23)=\"\",\"\",getmode(Scores!$B23:M23)*programFactor)","v":0}]
[23,"Program",{"$f":" INDEX(program_table,A25,1)","v":"Historical: Mine Tour"},{"$f":"SUM(Scores!B24:M24)","v":69},null,null,null,null,null,null,23,null,{"$f":"SUM(Scores!$B24:M24)*programFactor","v":103.5},{"$f":"IF(COUNT(Scores!$B24:M24)>0,AVERAGE(Scores!$B24:M24)*programFactor,0)","v":8.625},{"$f":"IF(COUNT(Scores!$B24:M24)>0,MEDIAN(Scores!$B24:M24)*programFactor,0)","v":9.75},{"$f":"IF(getmode(Scores!$B24:M24)=\"\",\"\",getmode(Scores!$B24:M24)*programFactor)","v":3}]
[24,"Program",{"$f":" INDEX(program_table,A26,1)","v":"Historical: Petroglyph Tour"},{"$f":"SUM(Scores!B25:M25)","v":108},null,null,null,null,null,null,24,null,{"$f":"SUM(Scores!$B25:M25)*programFactor","v":162},{"$f":"IF(COUNT(Scores!$B25:M25)>0,AVERAGE(Scores!$B25:M25)*programFactor,0)","v":18},{"$f":"IF(COUNT(Scores!$B25:M25)>0,MEDIAN(Scores!$B25:M25)*programFactor,0)","v":22.5},{"$f":"IF(getmode(Scores!$B25:M25)=\"\",\"\",getmode(Scores!$B25:M25)*programFactor)","v":0}]
[25,"Program",{"$f":" INDEX(program_table,A27,1)","v":"Historical: Pump Car Rides"},{"$f":"SUM(Scores!B26:M26)","v":134},null,null,null,null,null,null,25,null,{"$f":"SUM(Scores!$B26:M26)*programFactor","v":201},{"$f":"IF(COUNT(Scores!$B26:M26)>0,AVERAGE(Scores!$B26:M26)*programFactor,0)","v":16.75},{"$f":"IF(COUNT(Scores!$B26:M26)>0,MEDIAN(Scores!$B26:M26)*programFactor,0)","v":18.75},{"$f":"IF(getmode(Scores!$B26:M26)=\"\",\"\",getmode(Scores!$B26:M26)*programFactor)","v":15}]
[26,"Program",{"$f":" INDEX(program_table,A28,1)","v":"Historical: Railroad Construction"},{"$f":"SUM(Scores!B27:M27)","v":97},null,null,null,null,null,null,26,null,{"$f":"SUM(Scores!$B27:M27)*programFactor","v":145.5},{"$f":"IF(COUNT(Scores!$B27:M27)>0,AVERAGE(Scores!$B27:M27)*programFactor,0)","v":14.549999999999999},{"$f":"IF(COUNT(Scores!$B27:M27)>0,MEDIAN(Scores!$B27:M27)*programFactor,0)","v":15},{"$f":"IF(getmode(Scores!$B27:M27)=\"\",\"\",getmode(Scores!$B27:M27)*programFactor)","v":15}]
[27,"Program",{"$f":" INDEX(program_table,A29,1)","v":"Historical: Spar Pole Climbing"},{"$f":"SUM(Scores!B28:M28)","v":100},null,null,null,null,null,null,26,null,{"$f":"SUM(Scores!$B28:M28)*programFactor","v":150},{"$f":"IF(COUNT(Scores!$B28:M28)>0,AVERAGE(Scores!$B28:M28)*programFactor,0)","v":13.636363636363637},{"$f":"IF(COUNT(Scores!$B28:M28)>0,MEDIAN(Scores!$B28:M28)*programFactor,0)","v":18},{"$f":"IF(getmode(Scores!$B28:M28)=\"\",\"\",getmode(Scores!$B28:M28)*programFactor)","v":0}]
[28,"Program",{"$f":" INDEX(program_table,A30,1)","v":"Landmarks: Baldy Mountain"},{"$f":"SUM(Scores!B29:M29)","v":117},null,null,null,null,null,null,27,null,{"$f":"SUM(Scores!$B29:M29)*programFactor","v":175.5},{"$f":"IF(COUNT(Scores!$B29:M29)>0,AVERAGE(Scores!$B29:M29)*programFactor,0)","v":15.954545454545455},{"$f":"IF(COUNT(Scores!$B29:M29)>0,MEDIAN(Scores!$B29:M29)*programFactor,0)","v":18},{"$f":"IF(getmode(Scores!$B29:M29)=\"\",\"\",getmode(Scores!$B29:M29)*programFactor)","v":0}]
[29,"Program",{"$f":" INDEX(program_table,A31,1)","v":"Landmarks: Inspiration Point"},{"$f":"SUM(Scores!B30:M30)","v":103},null,null,null,null,null,null,28,null,{"$f":"SUM(Scores!$B30:M30)*programFactor","v":154.5},{"$f":"IF(COUNT(Scores!$B30:M30)>0,AVERAGE(Scores!$B30:M30)*programFactor,0)","v":15.450000000000001},{"$f":"IF(COUNT(Scores!$B30:M30)>0,MEDIAN(Scores!$B30:M30)*programFactor,0)","v":18},{"$f":"IF(getmode(Scores!$B30:M30)=\"\",\"\",getmode(Scores!$B30:M30)*programFactor)","v":18}]
[30,"Program",{"$f":" INDEX(program_table,A32,1)","v":"Landmarks: Mount Phillips"},{"$f":"SUM(Scores!B31:M31)","v":126},null,null,null,null,null,null,null,null,{"$f":"SUM(Scores!$B31:M31)*programFactor","v":189},{"$f":"IF(COUNT(Scores!$B31:M31)>0,AVERAGE(Scores!$B31:M31)*programFactor,0)","v":17.181818181818183},{"$f":"IF(COUNT(Scores!$B31:M31)>0,MEDIAN(Scores!$B31:M31)*programFactor,0)","v":18},{"$f":"IF(getmode(Scores!$B31:M31)=\"\",\"\",getmode(Scores!$B31:M31)*programFactor)","v":22.5}]
[31,"Program",{"$f":" INDEX(program_table,A33,1)","v":"Landmarks: Mountaineering"},{"$f":"SUM(Scores!B32:M32)","v":135},null,null,null,null,null,null,null,null,{"$f":"SUM(Scores!$B32:M32)*programFactor","v":202.5},{"$f":"IF(COUNT(Scores!$B32:M32)>0,AVERAGE(Scores!$B32:M32)*programFactor,0)","v":18.40909090909091},{"$f":"IF(COUNT(Scores!$B32:M32)>0,MEDIAN(Scores!$B32:M32)*programFactor,0)","v":19.5},{"$f":"IF(getmode(Scores!$B32:M32)=\"\",\"\",getmode(Scores!$B32:M32)*programFactor)","v":19.5}]
[32,"Program",{"$f":" INDEX(program_table,A34,1)","v":"Landmarks: Tooth of Time"},{"$f":"SUM(Scores!B33:M33)","v":61},null,null,null,null,null,null,null,null,{"$f":"SUM(Scores!$B33:M33)*programFactor","v":91.5},{"$f":"IF(COUNT(Scores!$B33:M33)>0,AVERAGE(Scores!$B33:M33)*programFactor,0)","v":9.1499999999999986},{"$f":"IF(COUNT(Scores!$B33:M33)>0,MEDIAN(Scores!$B33:M33)*programFactor,0)","v":7.5},{"$f":"IF(getmode(Scores!$B33:M33)=\"\",\"\",getmode(Scores!$B33:M33)*programFactor)","v":0}]
[33,"Program",{"$f":" INDEX(program_table,A35,1)","v":"Landmarks: Trail Peak"},{"$f":"SUM(Scores!B34:M34)","v":121},null,null,null,null,null,null,null,null,{"$f":"SUM(Scores!$B34:M34)*programFactor","v":181.5},{"$f":"IF(COUNT(Scores!$B34:M34)>0,AVERAGE(Scores!$B34:M34)*programFactor,0)","v":18.149999999999999},{"$f":"IF(COUNT(Scores!$B34:M34)>0,MEDIAN(Scores!$B34:M34)*programFactor,0)","v":18},{"$f":"IF(getmode(Scores!$B34:M34)=\"\",\"\",getmode(Scores!$B34:M34)*programFactor)","v":10.5}]
[34,"Program",{"$f":" INDEX(program_table,A36,1)","v":"Livestock: Animal Husbandry"},{"$f":"SUM(Scores!B35:M35)","v":147},null,null,null,null,null,null,null,null,{"$f":"SUM(Scores!$B35:M35)*programFactor","v":220.5},{"$f":"IF(COUNT(Scores!$B35:M35)>0,AVERAGE(Scores!$B35:M35)*programFactor,0)","v":18.375},{"$f":"IF(COUNT(Scores!$B35:M35)>0,MEDIAN(Scores!$B35:M35)*programFactor,0)","v":18},{"$f":"IF(getmode(Scores!$B35:M35)=\"\",\"\",getmode(Scores!$B35:M35)*programFactor)","v":10.5}]
[35,"Program",{"$f":" INDEX(program_table,A37,1)","v":"Livestock: Burro Packing"},{"$f":"SUM(Scores!B36:M36)","v":140},null,null,null,null,null,null,null,null,{"$f":"SUM(Scores!$B36:M36)*programFactor","v":210},{"$f":"IF(COUNT(Scores!$B36:M36)>0,AVERAGE(Scores!$B36:M36)*programFactor,0)","v":19.09090909090909},{"$f":"IF(COUNT(Scores!$B36:M36)>0,MEDIAN(Scores!$B36:M36)*programFactor,0)","v":21},{"$f":"IF(getmode(Scores!$B36:M36)=\"\",\"\",getmode(Scores!$B36:M36)*programFactor)","v":7.5}]
[36,"Program",{"$f":" INDEX(program_table,A38,1)","v":"Livestock: Chicken Tending"},{"$f":"SUM(Scores!B37:M37)","v":170},null,null,null,null,null,null,null,null,{"$f":"SUM(Scores!$B37:M37)*programFactor","v":255},{"$f":"IF(COUNT(Scores!$B37:M37)>0,AVERAGE(Scores!$B37:M37)*programFactor,0)","v":23.181818181818183},{"$f":"IF(COUNT(Scores!$B37:M37)>0,MEDIAN(Scores!$B37:M37)*programFactor,0)","v":27},{"$f":"IF(getmode(Scores!$B37:M37)=\"\",\"\",getmode(Scores!$B37:M37)*programFactor)","v":30}]
[37,"Program",{"$f":" INDEX(program_table,A39,1)","v":"Livestock: Horse Rides"},{"$f":"SUM(Scores!B38:M38)","v":157},null,null,null,null,null,null,null,null,{"$f":"SUM(Scores!$B38:M38)*programFactor","v":235.5},{"$f":"IF(COUNT(Scores!$B38:M38)>0,AVERAGE(Scores!$B38:M38)*programFactor,0)","v":21.40909090909091},{"$f":"IF(COUNT(Scores!$B38:M38)>0,MEDIAN(Scores!$B38:M38)*programFactor,0)","v":22.5},{"$f":"IF(getmode(Scores!$B38:M38)=\"\",\"\",getmode(Scores!$B38:M38)*programFactor)","v":30}]
[38,"Program",{"$f":" INDEX(program_table,A40,1)","v":"Low Impact Camping"},{"$f":"SUM(Scores!B39:M39)","v":129},null,null,null,null,null,null,null,null,{"$f":"SUM(Scores!$B39:M39)*programFactor","v":193.5},{"$f":"IF(COUNT(Scores!$B39:M39)>0,AVERAGE(Scores!$B39:M39)*programFactor,0)","v":19.350000000000001},{"$f":"IF(COUNT(Scores!$B39:M39)>0,MEDIAN(Scores!$B39:M39)*programFactor,0)","v":18},{"$f":"IF(getmode(Scores!$B39:M39)=\"\",\"\",getmode(Scores!$B39:M39)*programFactor)","v":10.5}]
[39,"Program",{"$f":" INDEX(program_table,A41,1)","v":"Range Sports: 3D Archery"},{"$f":"SUM(Scores!B40:M40)","v":101},null,null,null,null,null,null,null,null,{"$f":"SUM(Scores!$B34:M34)*programFactor","v":181.5},{"$f":"IF(COUNT(Scores!$B34:M34)>0,AVERAGE(Scores!$B34:M34)*programFactor,0)","v":18.149999999999999},{"$f":"IF(COUNT(Scores!$B34:M34)>0,MEDIAN(Scores!$B34:M34)*programFactor,0)","v":18},{"$f":"IF(getmode(Scores!$B34:M34)=\"\",\"\",getmode(Scores!$B34:M34)*programFactor)","v":10.5}]
[40,"Program",{"$f":" INDEX(program_table,A42,1)","v":"Range Sports: Aerial Archery"},{"$f":"SUM(Scores!B35:M35)","v":147},null,null,null,null,null,null,null,null,{"$f":"SUM(Scores!$B35:M35)*programFactor","v":220.5},{"$f":"IF(COUNT(Scores!$B35:M35)>0,AVERAGE(Scores!$B35:M35)*programFactor,0)","v":18.375},{"$f":"IF(COUNT(Scores!$B35:M35)>0,MEDIAN(Scores!$B35:M35)*programFactor,0)","v":18},{"$f":"IF(getmode(Scores!$B35:M35)=\"\",\"\",getmode(Scores!$B35:M35)*programFactor)","v":10.5}]
[41,"Program",{"$f":" INDEX(program_table,A43,1)","v":"Range Sports: Atlatl Throwing"},{"$f":"SUM(Scores!B36:M36)","v":140},null,null,null,null,null,null,null,null,{"$f":"SUM(Scores!$B36:M36)*programFactor","v":210},{"$f":"IF(COUNT(Scores!$B36:M36)>0,AVERAGE(Scores!$B36:M36)*programFactor,0)","v":19.09090909090909},{"$f":"IF(COUNT(Scores!$B36:M36)>0,MEDIAN(Scores!$B36:M36)*programFactor,0)","v":21},{"$f":"IF(getmode(Scores!$B36:M36)=\"\",\"\",getmode(Scores!$B36:M36)*programFactor)","v":7.5}]
[42,"Program",{"$f":" INDEX(program_table,A44,1)","v":"Range Sports: Cartridge Reloading"},{"$f":"SUM(Scores!B37:M37)","v":170},null,null,null,null,null,null,null,null,{"$f":"SUM(Scores!$B37:M37)*programFactor","v":255},{"$f":"IF(COUNT(Scores!$B37:M37)>0,AVERAGE(Scores!$B37:M37)*programFactor,0)","v":23.181818181818183},{"$f":"IF(COUNT(Scores!$B37:M37)>0,MEDIAN(Scores!$B37:M37)*programFactor,0)","v":27},{"$f":"IF(getmode(Scores!$B37:M37)=\"\",\"\",getmode(Scores!$B37:M37)*programFactor)","v":30}]
[43,"Program",{"$f":" INDEX(program_table,A45,1)","v":"Range Sports: Cowboy Action Shooting"},{"$f":"SUM(Scores!B38:M38)","v":157},null,null,null,null,null,null,null,null,{"$f":"SUM(Scores!$B38:M38)*programFactor","v":235.5},{"$f":"IF(COUNT(Scores!$B38:M38)>0,AVERAGE(Scores!$B38:M38)*programFactor,0)","v":21.40909090909091},{"$f":"IF(COUNT(Scores!$B38:M38)>0,MEDIAN(Scores!$B38:M38)*programFactor,0)","v":22.5},{"$f":"IF(getmode(Scores!$B38:M38)=\"\",\"\",getmode(Scores!$B38:M38)*programFactor)","v":30}]
[44,"Program",{"$f":" INDEX(program_table,A46,1)","v":"Range Sports: Field Archery"},{"$f":"SUM(Scores!B39:M39)","v":129},null,null,null,null,null,null,null,null,{"$f":"SUM(Scores!$B39:M39)*programFactor","v":193.5},{"$f":"IF(COUNT(Scores!$B39:M39)>0,AVERAGE(Scores!$B39:M39)*programFactor,0)","v":19.350000000000001},{"$f":"IF(COUNT(Scores!$B39:M39)>0,MEDIAN(Scores!$B39:M39)*programFactor,0)","v":18},{"$f":"IF(getmode(Scores!$B39:M39)=\"\",\"\",getmode(Scores!$B39:M39)*programFactor)","v":10.5}]
[45,"Program",{"$f":" INDEX(program_table,A47,1)","v":"Range Sports: Muzzleloader Shooting"},{"$f":"SUM(Scores!B40:M40)","v":101},null,null,null,null,null,null,null,null,{"$f":"SUM(Scores!$B40:M40)*programFactor","v":151.5},{"$f":"IF(COUNT(Scores!$B40:M40)>0,AVERAGE(Scores!$B40:M40)*programFactor,0)","v":12.625},{"$f":"IF(COUNT(Scores!$B40:M40)>0,MEDIAN(Scores!$B40:M40)*programFactor,0)","v":15},{"$f":"IF(getmode(Scores!$B40:M40)=\"\",\"\",getmode(Scores!$B40:M40)*programFactor)","v":15}]
[46,"Program",{"$f":" INDEX(program_table,A48,1)","v":"Range Sports: Rifle Shooting"},{"$f":"SUM(Scores!B41:M41)","v":91},null,null,null,null,null,null,null,null,{"$f":"SUM(Scores!$B41:M41)*programFactor","v":136.5},{"$f":"IF(COUNT(Scores!$B41:M41)>0,AVERAGE(Scores!$B41:M41)*programFactor,0)","v":11.375},{"$f":"IF(COUNT(Scores!$B41:M41)>0,MEDIAN(Scores!$B41:M41)*programFactor,0)","v":9},{"$f":"IF(getmode(Scores!$B41:M41)=\"\",\"\",getmode(Scores!$B41:M41)*programFactor)","v":7.5}]
[47,"Program",{"$f":" INDEX(program_table,A49,1)","v":"Range Sports: Shotgun Shooting"},{"$f":"SUM(Scores!B42:M42)","v":135},null,null,null,null,null,null,null,null,{"$f":"SUM(Scores!$B42:M42)*programFactor","v":202.5},{"$f":"IF(COUNT(Scores!$B42:M42)>0,AVERAGE(Scores!$B42:M42)*programFactor,0)","v":18.40909090909091},{"$f":"IF(COUNT(Scores!$B42:M42)>0,MEDIAN(Scores!$B42:M42)*programFactor,0)","v":19.5},{"$f":"IF(getmode(Scores!$B42:M42)=\"\",\"\",getmode(Scores!$B42:M42)*programFactor)","v":19.5}]
[48,"Program",{"$f":" INDEX(program_table,A50,1)","v":"Range Sports: Shotshell Reloading"},{"$f":"SUM(Scores!B43:M43)","v":138},null,null,null,null,null,null,null,null,{"$f":"SUM(Scores!$B43:M43)*programFactor","v":207},{"$f":"IF(COUNT(Scores!$B43:M43)>0,AVERAGE(Scores!$B43:M43)*programFactor,0)","v":18.818181818181817},{"$f":"IF(COUNT(Scores!$B43:M43)>0,MEDIAN(Scores!$B43:M43)*programFactor,0)","v":18},{"$f":"IF(getmode(Scores!$B43:M43)=\"\",\"\",getmode(Scores!$B43:M43)*programFactor)","v":15}]
[49,"Program",{"$f":" INDEX(program_table,A51,1)","v":"Range Sports: Tomahawk Throwing"},{"$f":"SUM(Scores!B50:M50)","v":138},null,null,null,null,null,null,null,null,{"$f":"SUM(Scores!$B50:M50)*programFactor","v":207},{"$f":"IF(COUNT(Scores!$B50:M50)>0,AVERAGE(Scores!$B50:M50)*programFactor,0)","v":18.818181818181817},{"$f":"IF(COUNT(Scores!$B50:M50)>0,MEDIAN(Scores!$B50:M50)*programFactor,0)","v":18},{"$f":"IF(getmode(Scores!$B50:M50)=\"\",\"\",getmode(Scores!$B50:M50)*programFactor)","v":15}]
[50,"Program",{"$f":" INDEX(program_table,A52,1)","v":"STEM: Archeology"},{"$f":"SUM(Scores!B51:M51)","v":138},null,null,null,null,null,null,null,null,{"$f":"SUM(Scores!$B51:M51)*programFactor","v":207},{"$f":"IF(COUNT(Scores!$B51:M51)>0,AVERAGE(Scores!$B51:M51)*programFactor,0)","v":18.818181818181817},{"$f":"IF(COUNT(Scores!$B51:M51)>0,MEDIAN(Scores!$B51:M51)*programFactor,0)","v":18},{"$f":"IF(getmode(Scores!$B51:M51)=\"\",\"\",getmode(Scores!$B51:M51)*programFactor)","v":15}]
[51,"Program",{"$f":" INDEX(program_table,A53,1)","v":"STEM: Astronomy"},{"$f":"SUM(Scores!B52:M52)","v":61},null,null,null,null,null,null,null,null,{"$f":"SUM(Scores!$B52:M52)*programFactor","v":91.5},{"$f":"IF(COUNT(Scores!$B52:M52)>0,AVERAGE(Scores!$B52:M52)*programFactor,0)","v":9.1499999999999986},{"$f":"IF(COUNT(Scores!$B52:M52)>0,MEDIAN(Scores!$B52:M52)*programFactor,0)","v":7.5},{"$f":"IF(getmode(Scores!$B52:M52)=\"\",\"\",getmode(Scores!$B52:M52)*programFactor)","v":0}]
[52,"Program",{"$f":" INDEX(program_table,A54,1)","v":"STEM: Geology"},{"$f":"SUM(Scores!B53:M53)","v":157},null,null,null,null,null,null,31,null,{"$f":"SUM(Scores!$B53:M53)*programFactor","v":235.5},{"$f":"IF(COUNT(Scores!$B53:M53)>0,AVERAGE(Scores!$B53:M53)*programFactor,0)","v":23.549999999999997},{"$f":"IF(COUNT(Scores!$B53:M53)>0,MEDIAN(Scores!$B53:M53)*programFactor,0)","v":24.75},{"$f":"IF(getmode(Scores!$B53:M53)=\"\",\"\",getmode(Scores!$B53:M53)*programFactor)","v":30}]
[53,"Program",{"$f":" INDEX(program_table,A55,1)","v":"Western Lore: Branding"},{"$f":"SUM(Scores!B54:M54)","v":89},null,null,null,null,null,null,null,null,{"$f":"SUM(Scores!$B54:M54)*programFactor","v":133.5},{"$f":"IF(COUNT(Scores!$B54:M54)>0,AVERAGE(Scores!$B54:M54)*programFactor,0)","v":16.6875},{"$f":"IF(COUNT(Scores!$B54:M54)>0,MEDIAN(Scores!$B54:M54)*programFactor,0)","v":15.75},{"$f":"IF(getmode(Scores!$B54:M54)=\"\",\"\",getmode(Scores!$B54:M54)*programFactor)","v":0}]
[54,"Program",{"$f":" INDEX(program_table,A56,1)","v":"Western Lore: Cantina"},{"$f":"SUM(Scores!B55:M55)","v":190},null,null,null,null,null,null,31,null,{"$f":"SUM(Scores!$B55:M55)*programFactor","v":285},{"$f":"IF(COUNT(Scores!$B55:M55)>0,AVERAGE(Scores!$B55:M55)*programFactor,0)","v":25.90909090909091},{"$f":"IF(COUNT(Scores!$B55:M55)>0,MEDIAN(Scores!$B55:M55)*programFactor,0)","v":27},{"$f":"IF(getmode(Scores!$B55:M55)=\"\",\"\",getmode(Scores!$B55:M55)*programFactor)","v":30}]
[55,"Program",{"$f":" INDEX(program_table,A57,1)","v":"Western Lore: Roping"},{"$f":"SUM(Scores!B56:M56)","v":76},null,null,null,null,null,null,31,null,{"$f":"SUM(Scores!$B56:M56)*programFactor","v":114},{"$f":"IF(COUNT(Scores!$B56:M56)>0,AVERAGE(Scores!$B56:M56)*programFactor,0)","v":16.285714285714285},{"$f":"IF(COUNT(Scores!$B56:M56)>0,MEDIAN(Scores!$B56:M56)*programFactor,0)","v":15},{"$f":"IF(getmode(Scores!$B56:M56)=\"\",\"\",getmode(Scores!$B56:M56)*programFactor)","v":15}]
[56,"Program",{"$f":" INDEX(program_table,A58,1)","v":"Wheeled: Mountain Biking"},{"$f":"SUM(Scores!B57:M57)","v":93},null,null,null,null,null,null,31,null,{"$f":"SUM(Scores!$B57:M57)*programFactor","v":139.5},{"$f":"IF(COUNT(Scores!$B57:M57)>0,AVERAGE(Scores!$B57:M57)*programFactor,0)","v":13.950000000000001},{"$f":"IF(COUNT(Scores!$B57:M57)>0,MEDIAN(Scores!$B57:M57)*programFactor,0)","v":13.5},{"$f":"IF(getmode(Scores!$B57:M57)=\"\",\"\",getmode(Scores!$B57:M57)*programFactor)","v":12}]
[{"$f":"A58+1","v":57},"Peaks","Baldy Mountain",2]
[58,"Peaks","Mount Phillips",1.5]
[59,"Peaks","Tooth of Time",1.5]
[60,"Peaks","Inspiration Point",1]
[61,"Peaks","Trail Peak",1.5]
[62,"Peaks","Mountaineering",1.2]
[63,"Area","Rank 1",{"$f":"IF(UPPER(areaImportant)=\"Y\",INDEX(areaDefaults,Preferences!B7),0)","v":200},null,null,null,null,1,1000]
[64,"Area","Rank 2",{"$f":"IF(UPPER(areaImportant)=\"Y\",INDEX(areaDefaults,Preferences!B8),0)","v":150},null,null,null,null,2,600,{"$f":"IF(areaImportant=\"y\",\"Preferences setting is that area is important\", \"Preferences setting is that area is not important\")","v":"Preferences setting is that area is important"}]
[65,"Area","Rank 3",{"$f":"IF(UPPER(areaImportant)=\"Y\",INDEX(areaDefaults,Preferences!B9),0)","v":1000},null,null,null,null,3,200,{"$f":"IF(areaImportant=\"y\",\"These are the default values — MAKE CHANGES HERE\", \"\")","v":"These are the default values — MAKE CHANGES HERE"}]
[66,"Area","Rank 4",{"$f":"IF(UPPER(areaImportant)=\"Y\",INDEX(areaDefaults,Preferences!B10),0)","v":600},null,null,null,null,4,150]
[67,"Days Food",1,100]
[68,"Days Food",2,90]
[69,"Days Food",3,80]
[70,"Days Food",4,70]
[71,"Days Food",5,60]
[72,"Days Food",6,50]
[73,"Food from HQ",1,20]
[74,"Food from HQ",2,30]
[75,"Food from HQ",3,40]
[76,"Food from HQ",4,50]
[77,"Food from HQ",5,60]
[78,"Food from HQ",6,70]
[79,"Food from HQ",7,80]
[80,"Food from HQ",8,90]
[81,"Food from HQ",9,100]
[82,"Trail Camps",0,250]
[83,"Trail Camps",1,200]
[84,"Trail Camps",2,175]
[{"$f":"A86+1","v":85},"Trail Camps",3,150]
[{"$f":"A87+1","v":86},"Trail Camps",4,125]
[{"$f":"A88+1","v":87},"Trail Camps",5,100]
[{"$f":"A89+1","v":88},"Trail Camps",6,75]
[{"$f":"A90+1","v":89},"Trail Camps",7,50]
[90,"Trail Camps",8,25]
[91,"Dry Camps",0,300]
[92,"Dry Camps",1,250]
[93,"Dry Camps",2,225]
[94,"Dry Camps",3,200]
[95,"Dry Camps",4,150]
[96,"Dry Camps",5,100]
[97,"Dry Camps",6,50]
[98,"Dry Camps",7,20]
[99,"Total Camps",3,60]
[100,"Total Camps",4,70]
[101,"Total Camps",5,80]
[102,"Total Camps",6,90]
[103,"Total Camps",7,100]
[104,"Total Camps",8,75]
[105,"Total Camps",9,60]
[106,"Total Camps",10,50]
[107,"Difficulty","C",2500,null,null,null,null,null,null,"Match skill level with itinerary difficulty"]
[108,"Difficulty","R",2666.6666666666665,null,null,null,null,null,null,"Skill","C","R","S","SS"]
[109,"Difficulty","S",2833.333333333333,null,null,null,null,"maxSkill:",4000,1,{"$f":"maxSkill+maxDifficult","v":5000},{"$f":"L111-((L111-O111)/3)","v":3500},{"$f":"M111-((L111-O111)/3)","v":2000},{"$f":"difficultDelta","v":500}]
[110,"Difficulty","SS",3000,null,null,null,null,"maxDifficult:",1000,2,{"$f":"L111-((L$111-L$120)/9)","v":4500},{"$f":"L112-((L112-O112)/3)","v":3333.333333333333},{"$f":"M112-((L112-O112)/3)","v":2166.6666666666661},{"$f":"L119","v":1000}]
[111,"Max Altitude",0,20,null,null,null,null,"minDifficult:",500,3,{"$f":"L112-((L$111-L$120)/9)","v":4000},3166.6666666666665,2333.333333333333,{"$f":"L118","v":1500}]
[112,"Max Altitude",9000,30,null,null,null,null,null,null,4,3500,3000,2500,{"$f":"L117","v":2000}]
[113,"Max Altitude",9100,40,null,null,null,null,null,null,5,3000,2833.3333333333335,2666.666666666667,{"$f":"L116","v":2500}]
[114,"Max Altitude",9200,50,null,null,null,null,null,null,6,2500,2666.6666666666665,2833.333333333333,{"$f":"L115","v":3000}]
[115,"Max Altitude",9800,60,null,null,null,null,{"$f":"\"Your Crew is Level \" & skillLevel","v":"Your Crew is Level 6"},null,7,2000,2500,3000,{"$f":"L114","v":3500}]
[116,"Max Altitude",10000,70,null,null,null,null,"(from Preferences)",null,8,1500,2333.3333333333335,3166.666666666667,{"$f":"L113","v":4000}]
[117,"Max Altitude",10500,80,null,null,null,null,null,null,9,1000,2166.666666666667,3333.3333333333339,{"$f":"L112","v":4500}]
[118,"Max Altitude",10600,90,null,null,null,null,null,null,10,{"$f":"difficultDelta","v":500},2000,3500,{"$f":"L111","v":5000}]
[119,"Max Altitude",10800,100,null,null,null,null,null,null,null,"Challenging","Rugged","Strenuous","Super Strenuous"]
[120,"Max Altitude",11000,110]
[121,"Max Altitude",11800,120]
[122,"Max Altitude",12441,130]
[123,"Total Gain",0,40]
[124,"Total Gain",1500,50]
[125,"Total Gain",2000,60]
[126,"Total Gain",2500,70]
[127,"Total Gain",3000,80]
[128,"Total Gain",3500,90]
[129,"Total Gain",4000,100]
[130,"Total Gain",4500,90]
[131,"Total Gain",5000,80]
[132,"Total Gain",5500,70]
[133,"Total Gain",6000,60]
[134,"Total Gain",6500,50]
[135,"Daily Change",300,100]
[136,"Daily Change",600,300]
[137,"Daily Change",900,200]
[138,"Daily Change",1200,100]
[139,"Hike Out","n",0]
[140,"Hike Out","y",500]
[141,"Hike In","n",0]
[142,"Hike In","y",500]
[143,"Distance","Miles",100]
["These are used for code lookup puposes only.","Difficulty","C","Challenging"]
[null,"Difficulty","R","Rugged"]
[null,"Difficulty","S","Strenuous"]
[null,"Difficulty","SS","Super Strenuous"]
[null,"campType","D","Dry"]
[null,"campType","S","Staffed"]
[null,"campType","T","Trail"]
[null,"campType","X","No  Camping"]

{"sheet":"Detail Informaton","index":9,"n_rows":37,"n_cols":2,"rows_kept":37,"cut":false,"hidden":false,"merged":[[1,0,1,1],[2,0,2,1]]}
["This sheet provides more detailed information about this spreadsheet and may be useful for anyone wishing to modify it."]
["This spreadsheet makes extensive use of \"Protected\" and \"Hidden\" cells and \"Hidden\"  worksheets.  To \"unprotect\" or \"unhide\" any of these, put the cursor on a worksheet tab and right click it.  Click \"Unprotect Sheet...\" and select the worksheet to display.  There are no passwords locking any of the \"hidden\" or \"protected\" areas."]
["There are buttons that may be pressed to select the scoring to be used in the calculation.  These are \"Total\" for the total score, \"Average\" to select the average (or Mean) score, \"Median\" to select the most common score, or \"Mode\" (most frequently used score).  These control the actual score values used in calculation  Try all and see what the difference in the results is."]
[]
["There are a number of \"tabs\" or \"worksheets\".  The use of these is as follows:"]
["Visible:"]
["  Instructions","General use instructions for the user that does not want to make any changes to the spreadsheet."]
["  Preferences","A set of \"preferences\" that may be used to adjust the calculations based on information specific to the crew."]
["  Scores","The \"scores\" for each crewmember from the program survey form.  These are on the basis of 0 to 20."]
["  Results","The calculated \"result\" from fitting the \"scores\" to the itinerary information."]
["  Itinerary Chart","Graph of sorted itineraries — shows relative differences between selections"]
["  Program Chart","This is a graph showing what programs the crewmembers wish to participate in."]
["  Itinerary Details","This provides a snapshot of individual itineraries.  Enter the itinerary the snapship is desired for."]
["  Itinerary Xref Chart","This is the same chart that's in the in the TREKS book"]
["  Tables","This is the set of \"factors\" for each of the various metrics.  These may be modified by the user."]
["  Detail Information","This worksheet."]
["Hidden:  (Note that there are no passwords on these, the user may \"unhide\" them by right-clicking in the tab area)"]
["  Itinerary Camps","Much information updated annually by hand from the TREKS Book.  Information relating to itineraries is calculated from these entries."]
["  ItineraryPrograms","Programs available at camps.  This can be created automatically but must be checked & updated manually.  Can verify with the Itinerary Xref Chart.  This takes a lot of detailed work!"]
["  Descriptions","This is the textual description of each itinerary.  This is manually copied from the TREKS Book each year."]
["  Calculator","This brings the preferences, scores, factors from \"Tables\", and itinerary information together to calculate detailed preference values for each itinerary.  The sum of these is the \"Result\" for each itinerary."]
["  Itineraries","This is information relative to the current year's itineraries.  All is derived from tables in other worksheets."]
["  Programs","Table of Philmont's available programs.  These are specific to 12-Day (all), 9-Day (subset) and 7-Day (subset) treks."]
["  Camp Programs","This is a table of programs available at each staffed camp. Verified manually, used to develop basic info for ItineraryPrograms worksheet.  Does not often change from year to year."]
["  Camp Elevations","This is information relative to Philmont's camps.  It is used in the calculations and in the Itinerary Details printout.  Is a good source of camp names & UTM Coordinates/elevations."]
[]
["Information in the Visible tabs is generally either documented in the worksheet or is self-evident.  Information about the worksheets that may be useful is below."]
["  Scores","Clicking the \"Clear Scores\" button erases all scores for all 12 participants.  User should enter the participant names in row 1."]
["  Results","The left side shows the itineraries that best \"fit\" the crew's desires.  On the right is a table showing the programs the crew desired in preference order.  It indicates which programs are included in each of the top 6 itineraries. "]
["  Itinerary Details","Enter the itinerary number and expedition number to get information about the itinerary including daily information."]
["  Tables","If some of the areas are more important to your crew, you can change the factors used in the calculations here.  The factors are highlighted where arbitrary values were set based on the author's preferences, they may be modified to meet your crew.   Only make changes in the unlocked cells in the Value column or the Green boxes for Area or Skill/Difficulty.  You may navigate between these with the TAB key."]
["  Itineraries","This sheet has information about the current year's itineraries.  Key information is manually updated from the TREKS books (daily campsites, first food pickup day number, method of return to base, itineraries that cross US-64, peaks hiked, etc.)  Row 1 has the columns that must be updated annually highlighted in red."]
["  itineraryXrefChart","This conforms to the Cross Reference chart in the TREKS book showing itineraries that have programs.  It is based on information in the Itinerary Programs worksheet."]
["  Calculator","This calculates a preference value for each of the metrics.  There is nothing to modify here — the value calculated will be based on values from other worksheets and any modification desired to any metric should be made in those underlying sheets, not in this one."]
["  Camp Elevations","This worksheet is a list of all the camps with details about the camp.  Note that some of the camps are not used and the information may not be complete for them.  It doesn't matter because only the camps included in the current year's itineraries is ever referenced.  All are shown here for completeness.   It is a good source of camp names & UTM Coordinates/elevations."]
["  Descriptions","These descriptions are copied from the TREKS Book and are displayed on the Itinerary Details display."]
["  Camp Programs","This is a table of staffed camps with flags for the programs offered at each.  It is used to provide much of the program inclusion information in the Itineries worksheet."]

{"sheet":"itineraryCamps","index":10,"n_rows":30,"n_cols":117,"rows_kept":30,"cut":false,"hidden":true,"merged":[[1,24,1,26],[28,30,28,35],[1,30,1,35],[1,1,1,3],[0,0,2,0],[1,4,1,13],[1,14,1,23],[1,27,1,29],[1,36,1,45],[1,115,1,116],[1,85,1,94],[1,46,1,54],[1,55,1,64],[1,65,1,74],[1,75,1,84],[1,95,1,104],[1,105,1,114]]}
["(Enter Red columns manually)\n\n\nItinerary",1,{"$f":"B1+1","v":2},3,4,5,{"$f":"F1+1","v":6},{"$f":"G1+1","v":7},{"$f":"H1+1","v":8},{"$f":"I1+1","v":9},10,11,12,13,14,15,16,{"$f":"Q1+1","v":17},18,19,20,21,22,23,24,25,26,27,28,29,{"$f":"AD1+1","v":30},{"$f":"AE1+1","v":31},{"$f":"AF1+1","v":32},{"$f":"AG1+1","v":33},{"$f":"AH1+1","v":34},{"$f":"AI1+1","v":35},{"$f":"AJ1+1","v":36},{"$f":"AK1+1","v":37},{"$f":"AL1+1","v":38},{"$f":"AM1+1","v":39},{"$f":"AN1+1","v":40},{"$f":"AO1+1","v":41},{"$f":"AP1+1","v":42},{"$f":"AQ1+1","v":43},{"$f":"AR1+1","v":44},{"$f":"AS1+1","v":45},{"$f":"AT1+1","v":46},{"$f":"AU1+1","v":47},{"$f":"AV1+1","v":48},{"$f":"AW1+1","v":49},{"$f":"AX1+1","v":50},{"$f":"AY1+1","v":51},{"$f":"AZ1+1","v":52},{"$f":"BA1+1","v":53},{"$f":"BB1+1","v":54},{"$f":"BC1+1","v":55},{"$f":"BD1+1","v":56},{"$f":"BE1+1","v":57},{"$f":"BF1+1","v":58},{"$f":"BG1+1","v":59},{"$f":"BH1+1","v":60},{"$f":"BI1+1","v":61},{"$f":"BJ1+1","v":62},{"$f":"BK1+1","v":63},{"$f":"BL1+1","v":64},{"$f":"BM1+1","v":65},{"$f":"BN1+1","v":66},{"$f":"BO1+1","v":67},{"$f":"BP1+1","v":68},{"$f":"BQ1+1","v":69},{"$f":"BR1+1","v":70},{"$f":"BS1+1","v":71},{"$f":"BT1+1","v":72},{"$f":"BU1+1","v":73},{"$f":"BV1+1","v":74},{"$f":"BW1+1","v":75},{"$f":"BX1+1","v":76},{"$f":"BY1+1","v":77},{"$f":"BZ1+1","v":78},{"$f":"CA1+1","v":79},{"$f":"CB1+1","v":80},{"$f":"CC1+1","v":81},{"$f":"CD1+1","v":82},{"$f":"CE1+1","v":83},{"$f":"CF1+1","v":84},{"$f":"CG1+1","v":85},{"$f":"CH1+1","v":86},{"$f":"CI1+1","v":87},{"$f":"CJ1+1","v":88},{"$f":"CK1+1","v":89},{"$f":"CL1+1","v":90},{"$f":"CM1+1","v":91},{"$f":"CN1+1","v":92},{"$f":"CO1+1","v":93},{"$f":"CP1+1","v":94},{"$f":"CQ1+1","v":95},{"$f":"CR1+1","v":96},{"$f":"CS1+1","v":97},{"$f":"CT1+1","v":98},{"$f":"CU1+1","v":99},{"$f":"CV1+1","v":100},{"$f":"CW1+1","v":101},{"$f":"CX1+1","v":102},{"$f":"CY1+1","v":103},{"$f":"CZ1+1","v":104},{"$f":"DA1+1","v":105},{"$f":"DB1+1","v":106},{"$f":"DC1+1","v":107},{"$f":"DD1+1","v":108},{"$f":"DE1+1","v":109},{"$f":"DF1+1","v":110},{"$f":"DG1+1","v":111},{"$f":"DH1+1","v":112},{"$f":"DI1+1","v":113},{"$f":"DJ1+1","v":114},{"$f":"DK1+1","v":115}]
[null,"Itinerary Information",null,null,"Backcountry Camps by Itinerary Day",null,null,null,null,null,null,null,null,null,"Food Pickup's",null,null,null,null,null,null,null,null,null,"Start/End",null,null,"Cross US-64",null,null,"Peaks (Enter Manually)",null,null,null,null,null,"Camp Elevation",null,null,null,null,null,null,null,null,null,"Daily Elevation Change",null,null,null,null,null,null,null,null,"Staffed Camp",null,null,null,null,null,null,null,null,null,"Trail Camp",null,null,null,null,null,null,null,null,null,"Dry Camp",null,null,null,null,null,null,null,null,null,"Layovers",null,null,null,null,null,null,null,null,null,"Country",null,null,null,null,null,null,null,null,null,"Map",null,null,null,null,null,null,null,null,null,"Food Pickup Info"]
[null,"Itinerary Label","Difficulty","Distance","Day 2","Day 3","Day 4","Day 5","Day 6","Day 7","Day 8","Day 9","Day 10","Day 11",2,{"$f":"O3+1","v":3},{"$f":"P3+1","v":4},5,6,7,8,9,10,11,"Starting Trailhead","Ending Trailhead","Via Tooth","Day","Cross At","Direction","Baldy Mountain","Inspiration Point","Mt. Phillips","Mountaineering","Tooth of Time","Trail Peak",{"$f":"O3","v":2},3,4,5,6,7,8,9,10,11,"2 :: 3","3 :: 4","4 :: 5","5 :: 6","6 :: 7","7 :: 8","8 :: 9","9 :: 10","10 :: 11",2,3,4,5,6,7,8,9,10,11,2,3,4,5,6,7,8,9,10,11,2,3,4,5,6,7,8,9,10,11,2,3,4,5,6,7,8,9,10,11,2,3,4,5,6,7,8,9,10,11,2,3,4,5,6,7,8,9,10,11,"Days to 1st Food PU","Max Food Days"]
[{"$f":"itineraryNoPrefix & ROW()-3","v":"12-1"},null,"C",46,"Toothache Springs","Crater Lake","Lower Bonito","Buck Creek","Apache Springs","Apache Springs","Fish Camp","Abreu","Urraca","Stockade Ridge","Camping HQ",null,null,"Phillips Junction",null,"Apache Springs",null,null,null,null,"Zastrow","Hike In",{"$f":"IF(Z4=\"Hike In\",\"y\",\"\")","v":"y"},null,null,null,{"$f":"IF(ItineraryPrograms!AD3=\"y\",\"y\",\"\")","v":""},{"$f":"IF(ItineraryPrograms!AE3=\"y\",\"y\",\"\")","v":"y"},{"$f":"IF(ItineraryPrograms!AF3=\"y\",\"y\",\"\")","v":""},null,{"$f":"checkTooth(AA4,LOWER(ItineraryPrograms!AH3))","v":"y"},null,{"$f":"IF(E4<>\"\",INDEX(Elevations,MATCH(E4,camps,0)),\"\")","v":7870},{"$f":"IF(F4<>\"\",INDEX(Elevations,MATCH(F4,camps,0)),\"\")","v":8398},{"$f":"IF(G4<>\"\",INDEX(Elevations,MATCH(G4,camps,0)),\"\")","v":8962},{"$f":"IF(H4<>\"\",INDEX(Elevations,MATCH(H4,camps,0)),\"\")","v":9131},{"$f":"IF(I4<>\"\",INDEX(Elevations,MATCH(I4,camps,0)),\"\")","v":9409},{"$f":"IF(J4<>\"\",INDEX(Elevations,MATCH(J4,camps,0)),\"\")","v":9409},{"$f":"IF(K4<>\"\",INDEX(Elevations,MATCH(K4,camps,0)),\"\")","v":8564},{"$f":"IF(L4<>\"\",INDEX(Elevations,MATCH(L4,camps,0)),\"\")","v":7217},{"$f":"IF(M4<>\"\",INDEX(Elevations,MATCH(M4,camps,0)),\"\")","v":7968},{"$f":"IF(N4<>\"\",INDEX(Elevations,MATCH(N4,camps,0)),\"\")","v":7519},{"$f":"IF(AL4<>\"\",ABS(AK4-AL4),\"\")","v":528},{"$f":"IF(AM4<>\"\",ABS(AL4-AM4),\"\")","v":564},169,278,0,845,1347,751,449,{"$f":"IF(INDEX(campsByItinerary,numericItinerary($A4),BD$3-1)=\"\",\"\",VLOOKUP(INDEX(campsByItinerary,numericItinerary($A4),BD$3-1),campInfo,8))","v":""},{"$f":"IF(INDEX(campsByItinerary,numericItinerary($A4),BE$3-1)=\"\",\"\",VLOOKUP(INDEX(campsByItinerary,numericItinerary($A4),BE$3-1),campInfo,8))","v":"Y"},{"$f":"IF(INDEX(campsByItinerary,numericItinerary($A4),BF$3-1)=\"\",\"\",VLOOKUP(INDEX(campsByItinerary,numericItinerary($A4),BF$3-1),campInfo,8))","v":""},{"$f":"IF(INDEX(campsByItinerary,numericItinerary($A4),BG$3-1)=\"\",\"\",VLOOKUP(INDEX(campsByItinerary,numericItinerary($A4),BG$3-1),campInfo,8))","v":""},{"$f":"IF(INDEX(campsByItinerary,numericItinerary($A4),BH$3-1)=\"\",\"\",VLOOKUP(INDEX(campsByItinerary,numericItinerary($A4),BH$3-1),campInfo,8))","v":"Y"},{"$f":"IF(INDEX(campsByItinerary,numericItinerary($A4),BI$3-1)=\"\",\"\",VLOOKUP(INDEX(campsByItinerary,numericItinerary($A4),BI$3-1),campInfo,8))","v":"Y"},{"$f":"IF(INDEX(campsByItinerary,numericItinerary($A4),BJ$3-1)=\"\",\"\",VLOOKUP(INDEX(campsByItinerary,numericItinerary($A4),BJ$3-1),campInfo,8))","v":"N"},{"$f":"IF(INDEX(campsByItinerary,numericItinerary($A4),BK$3-1)=\"\",\"\",VLOOKUP(INDEX(campsByItinerary,numericItinerary($A4),BK$3-1),campInfo,8))","v":"Y"},{"$f":"IF(INDEX(campsByItinerary,numericItinerary($A4),BL$3-1)=\"\",\"\",VLOOKUP(INDEX(campsByItinerary,numericItinerary($A4),BL$3-1),campInfo,8))","v":"Y"},{"$f":"IF(INDEX(campsByItinerary,numericItinerary($A4),BM$3-1)=\"\",\"\",VLOOKUP(INDEX(campsByItinerary,numericItinerary($A4),BM$3-1),campInfo,8))","v":""},{"$f":"IF(BD4=\"Y\",\"\",\"Y\")","v":"Y"},{"$f":"IF(BE4=\"Y\",\"\",\"Y\")","v":""},"Y","Y","","","Y","","","Y",{"$f":"IF(INDEX(campsByItinerary,numericItinerary($A4),BD$3-1)=\"\",\"\",VLOOKUP(INDEX(campsByItinerary,numericItinerary($A4),BD$3-1),campInfo,10))","v":""},{"$f":"IF(INDEX(campsByItinerary,numericItinerary($A4),BE$3-1)=\"\",\"\",VLOOKUP(INDEX(campsByItinerary,numericItinerary($A4),BE$3-1),campInfo,10))","v":""},{"$f":"IF(INDEX(campsByItinerary,numericItinerary($A4),BF$3-1)=\"\",\"\",VLOOKUP(INDEX(campsByItinerary,numericItinerary($A4),BF$3-1),campInfo,10))","v":""},{"$f":"IF(INDEX(campsByItinerary,numericItinerary($A4),BG$3-1)=\"\",\"\",VLOOKUP(INDEX(campsByItinerary,numericItinerary($A4),BG$3-1),campInfo,10))","v":""},{"$f":"IF(INDEX(campsByItinerary,numericItinerary($A4),BH$3-1)=\"\",\"\",VLOOKUP(INDEX(campsByItinerary,numericItinerary($A4),BH$3-1),campInfo,10))","v":""},{"$f":"IF(INDEX(campsByItinerary,numericItinerary($A4),BI$3-1)=\"\",\"\",VLOOKUP(INDEX(campsByItinerary,numericItinerary($A4),BI$3-1),campInfo,10))","v":""},{"$f":"IF(INDEX(campsByItinerary,numericItinerary($A4),BJ$3-1)=\"\",\"\",VLOOKUP(INDEX(campsByItinerary,numericItinerary($A4),BJ$3-1),campInfo,10))","v":""},{"$f":"IF(INDEX(campsByItinerary,numericItinerary($A4),BK$3-1)=\"\",\"\",VLOOKUP(INDEX(campsByItinerary,numericItinerary($A4),BK$3-1),campInfo,10))","v":""},{"$f":"IF(INDEX(campsByItinerary,numericItinerary($A4),BL$3-1)=\"\",\"\",VLOOKUP(INDEX(campsByItinerary,numericItinerary($A4),BL$3-1),campInfo,10))","v":""},{"$f":"IF(INDEX(campsByItinerary,numericItinerary($A4),BM$3-1)=\"\",\"\",VLOOKUP(INDEX(campsByItinerary,numericItinerary($A4),BM$3-1),campInfo,10))","v":"Y"},null,{"$f":"IF(E4=F4,\"Y\",\"\")","v":""},{"$f":"IF(F4=G4,\"Y\",\"\")","v":""},{"$f":"IF(G4=H4,\"Y\",\"\")","v":""},{"$f":"IF(H4=I4,\"Y\",\"\")","v":""},{"$f":"IF(I4=J4,\"Y\",\"\")","v":"Y"},{"$f":"IF(J4=K4,\"Y\",\"\")","v":""},{"$f":"IF(K4=L4,\"Y\",\"\")","v":""},{"$f":"IF(L4=M4,\"Y\",\"\")","v":""},{"$f":"IF(M4=N4,\"Y\",\"\")","v":""},{"$f":"INDEX(campsByItinerary,numericItinerary($A4),BD$3-1)","v":"Toothache Springs"},{"$f":"IF(INDEX(campsByItinerary,numericItinerary($A4),BE$3-1)=\"\",\"\",VLOOKUP(INDEX(campsByItinerary,numericItinerary($A4),BE$3-1),campInfo,2))","v":"South"},{"$f":"IF(INDEX(campsByItinerary,numericItinerary($A4),BF$3-1)=\"\",\"\",VLOOKUP(INDEX(campsByItinerary,numericItinerary($A4),BF$3-1),campInfo,2))","v":"South"},{"$f":"IF(INDEX(campsByItinerary,numericItinerary($A4),BG$3-1)=\"\",\"\",VLOOKUP(INDEX(campsByItinerary,numericItinerary($A4),BG$3-1),campInfo,2))","v":"South"},{"$f":"IF(INDEX(campsByItinerary,numericItinerary($A4),BH$3-1)=\"\",\"\",VLOOKUP(INDEX(campsByItinerary,numericItinerary($A4),BH$3-1),campInfo,2))","v":"South"},{"$f":"IF(INDEX(campsByItinerary,numericItinerary($A4),BI$3-1)=\"\",\"\",VLOOKUP(INDEX(campsByItinerary,numericItinerary($A4),BI$3-1),campInfo,2))","v":"South"},{"$f":"IF(INDEX(campsByItinerary,numericItinerary($A4),BJ$3-1)=\"\",\"\",VLOOKUP(INDEX(campsByItinerary,numericItinerary($A4),BJ$3-1),campInfo,2))","v":"South"},{"$f":"IF(INDEX(campsByItinerary,numericItinerary($A4),BK$3-1)=\"\",\"\",VLOOKUP(INDEX(campsByItinerary,numericItinerary($A4),BK$3-1),campInfo,2))","v":"South"},{"$f":"IF(INDEX(campsByItinerary,numericItinerary($A4),BL$3-1)=\"\",\"\",VLOOKUP(INDEX(campsByItinerary,numericItinerary($A4),BL$3-1),campInfo,2))","v":"South"},{"$f":"IF(INDEX(campsByItinerary,numericItinerary($A4),BM$3-1)=\"\",\"\",VLOOKUP(INDEX(campsByItinerary,numericItinerary($A4),BM$3-1),campInfo,2))","v":"South"},{"$f":"IF(INDEX(campsByItinerary,numericItinerary($A4),BD$3-1)=\"\",\"\",VLOOKUP(INDEX(campsByItinerary,numericItinerary($A4),BD$3-1),campInfo,12))","v":"South"},{"$f":"IF(INDEX(campsByItinerary,numericItinerary($A4),BE$3-1)=\"\",\"\",VLOOKUP(INDEX(campsByItinerary,numericItinerary($A4),BE$3-1),campInfo,12))","v":"South"},{"$f":"IF(INDEX(campsByItinerary,numericItinerary($A4),BF$3-1)=\"\",\"\",VLOOKUP(INDEX(campsByItinerary,numericItinerary($A4),BF$3-1),campInfo,12))","v":"South"},{"$f":"IF(INDEX(campsByItinerary,numericItinerary($A4),BG$3-1)=\"\",\"\",VLOOKUP(INDEX(campsByItinerary,numericItinerary($A4),BG$3-1),campInfo,12))","v":"South"},{"$f":"IF(INDEX(campsByItinerary,numericItinerary($A4),BH$3-1)=\"\",\"\",VLOOKUP(INDEX(campsByItinerary,numericItinerary($A4),BH$3-1),campInfo,12))","v":"South"},{"$f":"IF(INDEX(campsByItinerary,numericItinerary($A4),BI$3-1)=\"\",\"\",VLOOKUP(INDEX(campsByItinerary,numericItinerary($A4),BI$3-1),campInfo,12))","v":"South"},{"$f":"IF(INDEX(campsByItinerary,numericItinerary($A4),BJ$3-1)=\"\",\"\",VLOOKUP(INDEX(campsByItinerary,numericItinerary($A4),BJ$3-1),campInfo,12))","v":"South"},{"$f":"IF(INDEX(campsByItinerary,numericItinerary($A4),BK$3-1)=\"\",\"\",VLOOKUP(INDEX(campsByItinerary,numericItinerary($A4),BK$3-1),campInfo,12))","v":"South"},{"$f":"IF(INDEX(campsByItinerary,numericItinerary($A4),BL$3-1)=\"\",\"\",VLOOKUP(INDEX(campsByItinerary,numericItinerary($A4),BL$3-1),campInfo,12))","v":"South"},{"$f":"IF(INDEX(campsByItinerary,numericItinerary($A4),BM$3-1)=\"\",\"\",VLOOKUP(INDEX(campsByItinerary,numericItinerary($A4),BM$3-1),campInfo,12))","v":"South"},{"$f":"getfoodPU(\"First\",numericItinerary($A4))","v":3},{"$f":"getfoodPU(\"Max\",numericItinerary($A4))","v":3}]
["12-2",null,"C",58,"Trail Canyon","Dean Cow","New Dean","Bluestem","Pueblano","Ewells Park","Ewells Park","Touch-Me-Not Creek","Head of Dean","Mistletoe","Camping HQ",null,null,"Ponil",null,null,"Baldy Town",null,null,null,"Nine Mile","Ute Park",{"$f":"IF(Z5=\"Hike In\",\"y\",\"\")","v":""},12,"Bear Canyon","S",{"$f":"IF(ItineraryPrograms!AD4=\"y\",\"y\",\"\")","v":"y"},{"$f":"IF(ItineraryPrograms!AE4=\"y\",\"y\",\"\")","v":""},{"$f":"IF(ItineraryPrograms!AF4=\"y\",\"y\",\"\")","v":""},null,{"$f":"checkTooth(AA5,LOWER(ItineraryPrograms!AH4))","v":""},null,7070,7232,7724,7495,8069,9373,9373,8855,8754,8295,{"$f":"IF(AL5<>\"\",ABS(AK5-AL5),\"\")","v":162},{"$f":"IF(AM5<>\"\",ABS(AL5-AM5),\"\")","v":492},{"$f":"IF(AN5<>\"\",ABS(AM5-AN5),\"\")","v":229},{"$f":"IF(AO5<>\"\",ABS(AN5-AO5),\"\")","v":574},{"$f":"IF(AP5<>\"\",ABS(AO5-AP5),\"\")","v":1304},{"$f":"IF(AQ5<>\"\",ABS(AP5-AQ5),\"\")","v":0},{"$f":"IF(AR5<>\"\",ABS(AQ5-AR5),\"\")","v":518},{"$f":"IF(AS5<>\"\",ABS(AR5-AS5),\"\")","v":101},{"$f":"IF(AT5<>\"\",ABS(AS5-AT5),\"\")","v":459},{"$f":"IF(INDEX(campsByItinerary,numericItinerary($A5),BD$3-1)=\"\",\"\",VLOOKUP(INDEX(campsByItinerary,numericItinerary($A5),BD$3-1),campInfo,8))","v":""},{"$f":"IF(INDEX(campsByItinerary,numericItinerary($A5),BE$3-1)=\"\",\"\",VLOOKUP(INDEX(campsByItinerary,numericItinerary($A5),BE$3-1),campInfo,8))","v":"Y"},{"$f":"IF(INDEX(campsByItinerary,numericItinerary($A5),BF$3-1)=\"\",\"\",VLOOKUP(INDEX(campsByItinerary,numericItinerary($A5),BF$3-1),campInfo,8))","v":""},{"$f":"IF(INDEX(campsByItinerary,numericItinerary($A5),BG$3-1)=\"\",\"\",VLOOKUP(INDEX(campsByItinerary,numericItinerary($A5),BG$3-1),campInfo,8))","v":""},{"$f":"IF(INDEX(campsByItinerary,numericItinerary($A5),BH$3-1)=\"\",\"\",VLOOKUP(INDEX(campsByItinerary,numericItinerary($A5),BH$3-1),campInfo,8))","v":"Y"},{"$f":"IF(INDEX(campsByItinerary,numericItinerary($A5),BI$3-1)=\"\",\"\",VLOOKUP(INDEX(campsByItinerary,numericItinerary($A5),BI$3-1),campInfo,8))","v":""},{"$f":"IF(INDEX(campsByItinerary,numericItinerary($A5),BJ$3-1)=\"\",\"\",VLOOKUP(INDEX(campsByItinerary,numericItinerary($A5),BJ$3-1),campInfo,8))","v":""},{"$f":"IF(INDEX(campsByItinerary,numericItinerary($A5),BK$3-1)=\"\",\"\",VLOOKUP(INDEX(campsByItinerary,numericItinerary($A5),BK$3-1),campInfo,8))","v":""},{"$f":"IF(INDEX(campsByItinerary,numericItinerary($A5),BL$3-1)=\"\",\"\",VLOOKUP(INDEX(campsByItinerary,numericItinerary($A5),BL$3-1),campInfo,8))","v":"Y"},{"$f":"IF(INDEX(campsByItinerary,numericItinerary($A5),BM$3-1)=\"\",\"\",VLOOKUP(INDEX(campsByItinerary,numericItinerary($A5),BM$3-1),campInfo,8))","v":""},{"$f":"IF(BD5=\"Y\",\"\",\"Y\")","v":"Y"},{"$f":"IF(BE5=\"Y\",\"\",\"Y\")","v":""},{"$f":"IF(BF5=\"Y\",\"\",\"Y\")","v":"Y"},{"$f":"IF(BG5=\"Y\",\"\",\"Y\")","v":"Y"},{"$f":"IF(BH5=\"Y\",\"\",\"Y\")","v":""},{"$f":"IF(BI5=\"Y\",\"\",\"Y\")","v":"Y"},{"$f":"IF(BJ5=\"Y\",\"\",\"Y\")","v":"Y"},{"$f":"IF(BK5=\"Y\",\"\",\"Y\")","v":"Y"},{"$f":"IF(BL5=\"Y\",\"\",\"Y\")","v":""},{"$f":"IF(BM5=\"Y\",\"\",\"Y\")","v":"Y"},{"$f":"IF(INDEX(campsByItinerary,numericItinerary($A5),BD$3-1)=\"\",\"\",VLOOKUP(INDEX(campsByItinerary,numericItinerary($A5),BD$3-1),campInfo,10))","v":""},{"$f":"IF(INDEX(campsByItinerary,numericItinerary($A5),BE$3-1)=\"\",\"\",VLOOKUP(INDEX(campsByItinerary,numericItinerary($A5),BE$3-1),campInfo,10))","v":""},{"$f":"IF(INDEX(campsByItinerary,numericItinerary($A5),BF$3-1)=\"\",\"\",VLOOKUP(INDEX(campsByItinerary,numericItinerary($A5),BF$3-1),campInfo,10))","v":""},{"$f":"IF(INDEX(campsByItinerary,numericItinerary($A5),BG$3-1)=\"\",\"\",VLOOKUP(INDEX(campsByItinerary,numericItinerary($A5),BG$3-1),campInfo,10))","v":"Y"},{"$f":"IF(INDEX(campsByItinerary,numericItinerary($A5),BH$3-1)=\"\",\"\",VLOOKUP(INDEX(campsByItinerary,numericItinerary($A5),BH$3-1),campInfo,10))","v":""},{"$f":"IF(INDEX(campsByItinerary,numericItinerary($A5),BI$3-1)=\"\",\"\",VLOOKUP(INDEX(campsByItinerary,numericItinerary($A5),BI$3-1),campInfo,10))","v":""},{"$f":"IF(INDEX(campsByItinerary,numericItinerary($A5),BJ$3-1)=\"\",\"\",VLOOKUP(INDEX(campsByItinerary,numericItinerary($A5),BJ$3-1),campInfo,10))","v":""},{"$f":"IF(INDEX(campsByItinerary,numericItinerary($A5),BK$3-1)=\"\",\"\",VLOOKUP(INDEX(campsByItinerary,numericItinerary($A5),BK$3-1),campInfo,10))","v":""},{"$f":"IF(INDEX(campsByItinerary,numericItinerary($A5),BL$3-1)=\"\",\"\",VLOOKUP(INDEX(campsByItinerary,numericItinerary($A5),BL$3-1),campInfo,10))","v":""},{"$f":"IF(INDEX(campsByItinerary,numericItinerary($A5),BM$3-1)=\"\",\"\",VLOOKUP(INDEX(campsByItinerary,numericItinerary($A5),BM$3-1),campInfo,10))","v":"Y"},null,"","","","","","Y","","","",{"$f":"INDEX(campsByItinerary,numericItinerary($A5),BD$3-1)","v":"Trail Canyon"},{"$f":"IF(INDEX(campsByItinerary,numericItinerary($A5),BE$3-1)=\"\",\"\",VLOOKUP(INDEX(campsByItinerary,numericItinerary($A5),BE$3-1),campInfo,2))","v":"North"},{"$f":"IF(INDEX(campsByItinerary,numericItinerary($A5),BF$3-1)=\"\",\"\",VLOOKUP(INDEX(campsByItinerary,numericItinerary($A5),BF$3-1),campInfo,2))","v":"North"},{"$f":"IF(INDEX(campsByItinerary,numericItinerary($A5),BG$3-1)=\"\",\"\",VLOOKUP(INDEX(campsByItinerary,numericItinerary($A5),BG$3-1),campInfo,2))","v":"North"},{"$f":"IF(INDEX(campsByItinerary,numericItinerary($A5),BH$3-1)=\"\",\"\",VLOOKUP(INDEX(campsByItinerary,numericItinerary($A5),BH$3-1),campInfo,2))","v":"North"},{"$f":"IF(INDEX(campsByItinerary,numericItinerary($A5),BI$3-1)=\"\",\"\",VLOOKUP(INDEX(campsByItinerary,numericItinerary($A5),BI$3-1),campInfo,2))","v":"North"},{"$f":"IF(INDEX(campsByItinerary,numericItinerary($A5),BJ$3-1)=\"\",\"\",VLOOKUP(INDEX(campsByItinerary,numericItinerary($A5),BJ$3-1),campInfo,2))","v":"North"},{"$f":"IF(INDEX(campsByItinerary,numericItinerary($A5),BK$3-1)=\"\",\"\",VLOOKUP(INDEX(campsByItinerary,numericItinerary($A5),BK$3-1),campInfo,2))","v":"North"},{"$f":"IF(INDEX(campsByItinerary,numericItinerary($A5),BL$3-1)=\"\",\"\",VLOOKUP(INDEX(campsByItinerary,numericItinerary($A5),BL$3-1),campInfo,2))","v":"North"},{"$f":"IF(INDEX(campsByItinerary,numericItinerary($A5),BM$3-1)=\"\",\"\",VLOOKUP(INDEX(campsByItinerary,numericItinerary($A5),BM$3-1),campInfo,2))","v":"Central"},{"$f":"IF(INDEX(campsByItinerary,numericItinerary($A5),BD$3-1)=\"\",\"\",VLOOKUP(INDEX(campsByItinerary,numericItinerary($A5),BD$3-1),campInfo,12))","v":"North"},{"$f":"IF(INDEX(campsByItinerary,numericItinerary($A5),BE$3-1)=\"\",\"\",VLOOKUP(INDEX(campsByItinerary,numericItinerary($A5),BE$3-1),campInfo,12))","v":"North"},{"$f":"IF(INDEX(campsByItinerary,numericItinerary($A5),BF$3-1)=\"\",\"\",VLOOKUP(INDEX(campsByItinerary,numericItinerary($A5),BF$3-1),campInfo,12))","v":"North"},{"$f":"IF(INDEX(campsByItinerary,numericItinerary($A5),BG$3-1)=\"\",\"\",VLOOKUP(INDEX(campsByItinerary,numericItinerary($A5),BG$3-1),campInfo,12))","v":"North"},{"$f":"IF(INDEX(campsByItinerary,numericItinerary($A5),BH$3-1)=\"\",\"\",VLOOKUP(INDEX(campsByItinerary,numericItinerary($A5),BH$3-1),campInfo,12))","v":"North"},{"$f":"IF(INDEX(campsByItinerary,numericItinerary($A5),BI$3-1)=\"\",\"\",VLOOKUP(INDEX(campsByItinerary,numericItinerary($A5),BI$3-1),campInfo,12))","v":"North"},{"$f":"IF(INDEX(campsByItinerary,numericItinerary($A5),BJ$3-1)=\"\",\"\",VLOOKUP(INDEX(campsByItinerary,numericItinerary($A5),BJ$3-1),campInfo,12))","v":"North"},{"$f":"IF(INDEX(campsByItinerary,numericItinerary($A5),BK$3-1)=\"\",\"\",VLOOKUP(INDEX(campsByItinerary,numericItinerary($A5),BK$3-1),campInfo,12))","v":"North"},{"$f":"IF(INDEX(campsByItinerary,numericItinerary($A5),BL$3-1)=\"\",\"\",VLOOKUP(INDEX(campsByItinerary,numericItinerary($A5),BL$3-1),campInfo,12))","v":"North"},{"$f":"IF(INDEX(campsByItinerary,numericItinerary($A5),BM$3-1)=\"\",\"\",VLOOKUP(INDEX(campsByItinerary,numericItinerary($A5),BM$3-1),campInfo,12))","v":"North & South"},{"$f":"getfoodPU(\"First\",numericItinerary($A5))","v":3},{"$f":"getfoodPU(\"Max\",numericItinerary($A5))","v":3}]
["12-3",null,"R",71,"Trail Canyon","Elkhorn","Head of Dean","Rich Cabins","Middle Ponil","Ring Place","Whiteman Vega","Dan Beard","Cottonwood","House Canyon","Camping HQ",null,null,"Rich Cabins",null,"Ring Place",null,null,null,null,"Nine Mile","Six Mile Gate","",null,null,null,{"$f":"IF(ItineraryPrograms!AD5=\"y\",\"y\",\"\")","v":""},{"$f":"IF(ItineraryPrograms!AE5=\"y\",\"y\",\"\")","v":""},{"$f":"IF(ItineraryPrograms!AF5=\"y\",\"y\",\"\")","v":""},null,{"$f":"checkTooth(AA6,LOWER(ItineraryPrograms!AH5))","v":""},null,7070,8496,8754,7728,9118,8124,8061,7896,7373,7157,1426,258,1026,1390,994,63,165,523,216,{"$f":"IF(INDEX(campsByItinerary,numericItinerary($A6),BD$3-1)=\"\",\"\",VLOOKUP(INDEX(campsByItinerary,numericItinerary($A6),BD$3-1),campInfo,8))","v":""},{"$f":"IF(INDEX(campsByItinerary,numericItinerary($A6),BE$3-1)=\"\",\"\",VLOOKUP(INDEX(campsByItinerary,numericItinerary($A6),BE$3-1),campInfo,8))","v":""},{"$f":"IF(INDEX(campsByItinerary,numericItinerary($A6),BF$3-1)=\"\",\"\",VLOOKUP(INDEX(campsByItinerary,numericItinerary($A6),BF$3-1),campInfo,8))","v":"Y"},{"$f":"IF(INDEX(campsByItinerary,numericItinerary($A6),BG$3-1)=\"\",\"\",VLOOKUP(INDEX(campsByItinerary,numericItinerary($A6),BG$3-1),campInfo,8))","v":"Y"},{"$f":"IF(INDEX(campsByItinerary,numericItinerary($A6),BH$3-1)=\"\",\"\",VLOOKUP(INDEX(campsByItinerary,numericItinerary($A6),BH$3-1),campInfo,8))","v":""},{"$f":"IF(INDEX(campsByItinerary,numericItinerary($A6),BI$3-1)=\"\",\"\",VLOOKUP(INDEX(campsByItinerary,numericItinerary($A6),BI$3-1),campInfo,8))","v":"Y"},{"$f":"IF(INDEX(campsByItinerary,numericItinerary($A6),BJ$3-1)=\"\",\"\",VLOOKUP(INDEX(campsByItinerary,numericItinerary($A6),BJ$3-1),campInfo,8))","v":"Y"},{"$f":"IF(INDEX(campsByItinerary,numericItinerary($A6),BK$3-1)=\"\",\"\",VLOOKUP(INDEX(campsByItinerary,numericItinerary($A6),BK$3-1),campInfo,8))","v":"Y"},{"$f":"IF(INDEX(campsByItinerary,numericItinerary($A6),BL$3-1)=\"\",\"\",VLOOKUP(INDEX(campsByItinerary,numericItinerary($A6),BL$3-1),campInfo,8))","v":""},{"$f":"IF(INDEX(campsByItinerary,numericItinerary($A6),BM$3-1)=\"\",\"\",VLOOKUP(INDEX(campsByItinerary,numericItinerary($A6),BM$3-1),campInfo,8))","v":""},"Y","Y","","","Y","","","","Y","Y",{"$f":"IF(INDEX(campsByItinerary,numericItinerary($A6),BD$3-1)=\"\",\"\",VLOOKUP(INDEX(campsByItinerary,numericItinerary($A6),BD$3-1),campInfo,10))","v":""},{"$f":"IF(INDEX(campsByItinerary,numericItinerary($A6),BE$3-1)=\"\",\"\",VLOOKUP(INDEX(campsByItinerary,numericItinerary($A6),BE$3-1),campInfo,10))","v":""},{"$f":"IF(INDEX(campsByItinerary,numericItinerary($A6),BF$3-1)=\"\",\"\",VLOOKUP(INDEX(campsByItinerary,numericItinerary($A6),BF$3-1),campInfo,10))","v":""},{"$f":"IF(INDEX(campsByItinerary,numericItinerary($A6),BG$3-1)=\"\",\"\",VLOOKUP(INDEX(campsByItinerary,numericItinerary($A6),BG$3-1),campInfo,10))","v":""},{"$f":"IF(INDEX(campsByItinerary,numericItinerary($A6),BH$3-1)=\"\",\"\",VLOOKUP(INDEX(campsByItinerary,numericItinerary($A6),BH$3-1),campInfo,10))","v":""},{"$f":"IF(INDEX(campsByItinerary,numericItinerary($A6),BI$3-1)=\"\",\"\",VLOOKUP(INDEX(campsByItinerary,numericItinerary($A6),BI$3-1),campInfo,10))","v":""},{"$f":"IF(INDEX(campsByItinerary,numericItinerary($A6),BJ$3-1)=\"\",\"\",VLOOKUP(INDEX(campsByItinerary,numericItinerary($A6),BJ$3-1),campInfo,10))","v":""},{"$f":"IF(INDEX(campsByItinerary,numericItinerary($A6),BK$3-1)=\"\",\"\",VLOOKUP(INDEX(campsByItinerary,numericItinerary($A6),BK$3-1),campInfo,10))","v":""},{"$f":"IF(INDEX(campsByItinerary,numericItinerary($A6),BL$3-1)=\"\",\"\",VLOOKUP(INDEX(campsByItinerary,numericItinerary($A6),BL$3-1),campInfo,10))","v":""},{"$f":"IF(INDEX(campsByItinerary,numericItinerary($A6),BM$3-1)=\"\",\"\",VLOOKUP(INDEX(campsByItinerary,numericItinerary($A6),BM$3-1),campInfo,10))","v":""},null,"","","","","","","","","",{"$f":"INDEX(campsByItinerary,numericItinerary($A6),BD$3-1)","v":"Trail Canyon"},{"$f":"IF(INDEX(campsByItinerary,numericItinerary($A6),BE$3-1)=\"\",\"\",VLOOKUP(INDEX(campsByItinerary,numericItinerary($A6),BE$3-1),campInfo,2))","v":"North"},{"$f":"IF(INDEX(campsByItinerary,numericItinerary($A6),BF$3-1)=\"\",\"\",VLOOKUP(INDEX(campsByItinerary,numericItinerary($A6),BF$3-1),campInfo,2))","v":"North"},{"$f":"IF(INDEX(campsByItinerary,numericItinerary($A6),BG$3-1)=\"\",\"\",VLOOKUP(INDEX(campsByItinerary,numericItinerary($A6),BG$3-1),campInfo,2))","v":"Valle Vidal"},{"$f":"IF(INDEX(campsByItinerary,numericItinerary($A6),BH$3-1)=\"\",\"\",VLOOKUP(INDEX(campsByItinerary,numericItinerary($A6),BH$3-1),campInfo,2))","v":"Valle Vidal"},{"$f":"IF(INDEX(campsByItinerary,numericItinerary($A6),BI$3-1)=\"\",\"\",VLOOKUP(INDEX(campsByItinerary,numericItinerary($A6),BI$3-1),campInfo,2))","v":"Valle Vidal"},{"$f":"IF(INDEX(campsByItinerary,numericItinerary($A6),BJ$3-1)=\"\",\"\",VLOOKUP(INDEX(campsByItinerary,numericItinerary($A6),BJ$3-1),campInfo,2))","v":"Valle Vidal"},{"$f":"IF(INDEX(campsByItinerary,numericItinerary($A6),BK$3-1)=\"\",\"\",VLOOKUP(INDEX(campsByItinerary,numericItinerary($A6),BK$3-1),campInfo,2))","v":"North"},{"$f":"IF(INDEX(campsByItinerary,numericItinerary($A6),BL$3-1)=\"\",\"\",VLOOKUP(INDEX(campsByItinerary,numericItinerary($A6),BL$3-1),campInfo,2))","v":"North"},{"$f":"IF(INDEX(campsByItinerary,numericItinerary($A6),BM$3-1)=\"\",\"\",VLOOKUP(INDEX(campsByItinerary,numericItinerary($A6),BM$3-1),campInfo,2))","v":"North"},{"$f":"IF(INDEX(campsByItinerary,numericItinerary($A6),BD$3-1)=\"\",\"\",VLOOKUP(INDEX(campsByItinerary,numericItinerary($A6),BD$3-1),campInfo,12))","v":"North"},{"$f":"IF(INDEX(campsByItinerary,numericItinerary($A6),BE$3-1)=\"\",\"\",VLOOKUP(INDEX(campsByItinerary,numericItinerary($A6),BE$3-1),campInfo,12))","v":"North"},{"$f":"IF(INDEX(campsByItinerary,numericItinerary($A6),BF$3-1)=\"\",\"\",VLOOKUP(INDEX(campsByItinerary,numericItinerary($A6),BF$3-1),campInfo,12))","v":"North"},{"$f":"IF(INDEX(campsByItinerary,numericItinerary($A6),BG$3-1)=\"\",\"\",VLOOKUP(INDEX(campsByItinerary,numericItinerary($A6),BG$3-1),campInfo,12))","v":"North"},{"$f":"IF(INDEX(campsByItinerary,numericItinerary($A6),BH$3-1)=\"\",\"\",VLOOKUP(INDEX(campsByItinerary,numericItinerary($A6),BH$3-1),campInfo,12))","v":"North"},{"$f":"IF(INDEX(campsByItinerary,numericItinerary($A6),BI$3-1)=\"\",\"\",VLOOKUP(INDEX(campsByItinerary,numericItinerary($A6),BI$3-1),campInfo,12))","v":"North"},{"$f":"IF(INDEX(campsByItinerary,numericItinerary($A6),BJ$3-1)=\"\",\"\",VLOOKUP(INDEX(campsByItinerary,numericItinerary($A6),BJ$3-1),campInfo,12))","v":"North"},{"$f":"IF(INDEX(campsByItinerary,numericItinerary($A6),BK$3-1)=\"\",\"\",VLOOKUP(INDEX(campsByItinerary,numericItinerary($A6),BK$3-1),campInfo,12))","v":"North"},{"$f":"IF(INDEX(campsByItinerary,numericItinerary($A6),BL$3-1)=\"\",\"\",VLOOKUP(INDEX(campsByItinerary,numericItinerary($A6),BL$3-1),campInfo,12))","v":"North"},{"$f":"IF(INDEX(campsByItinerary,numericItinerary($A6),BM$3-1)=\"\",\"\",VLOOKUP(INDEX(campsByItinerary,numericItinerary($A6),BM$3-1),campInfo,12))","v":"North"},{"$f":"getfoodPU(\"First\",numericItinerary($A6))","v":3},{"$f":"getfoodPU(\"Max\",numericItinerary($A6))","v":3}]
["12-4",null,"C",58,"Flume Canyon","Pueblano Ruins","Baldy Town","Baldy Town","Maxwell","Head of Dean","Ponil","Metcalf Station","Cottonwood","House Canyon","Camping HQ",null,"Baldy Town",null,null,null,"Ponil",null,null,null,"Ponil","Six Mile Gate","",null,null,null,{"$f":"IF(ItineraryPrograms!AD6=\"y\",\"y\",\"\")","v":"y"},{"$f":"IF(ItineraryPrograms!AE6=\"y\",\"y\",\"\")","v":""},{"$f":"IF(ItineraryPrograms!AF6=\"y\",\"y\",\"\")","v":""},null,{"$f":"checkTooth(AA7,LOWER(ItineraryPrograms!AH6))","v":""},null,7715,8359,9851,9851,8498,8754,7150,7220,7373,7157,644,1492,0,1353,256,1604,70,153,216,{"$f":"IF(INDEX(campsByItinerary,numericItinerary($A7),BD$3-1)=\"\",\"\",VLOOKUP(INDEX(campsByItinerary,numericItinerary($A7),BD$3-1),campInfo,8))","v":""},{"$f":"IF(INDEX(campsByItinerary,numericItinerary($A7),BE$3-1)=\"\",\"\",VLOOKUP(INDEX(campsByItinerary,numericItinerary($A7),BE$3-1),campInfo,8))","v":""},{"$f":"IF(INDEX(campsByItinerary,numericItinerary($A7),BF$3-1)=\"\",\"\",VLOOKUP(INDEX(campsByItinerary,numericItinerary($A7),BF$3-1),campInfo,8))","v":"Y"},{"$f":"IF(INDEX(campsByItinerary,numericItinerary($A7),BG$3-1)=\"\",\"\",VLOOKUP(INDEX(campsByItinerary,numericItinerary($A7),BG$3-1),campInfo,8))","v":"Y"},{"$f":"IF(INDEX(campsByItinerary,numericItinerary($A7),BH$3-1)=\"\",\"\",VLOOKUP(INDEX(campsByItinerary,numericItinerary($A7),BH$3-1),campInfo,8))","v":""},{"$f":"IF(INDEX(campsByItinerary,numericItinerary($A7),BI$3-1)=\"\",\"\",VLOOKUP(INDEX(campsByItinerary,numericItinerary($A7),BI$3-1),campInfo,8))","v":"Y"},{"$f":"IF(INDEX(campsByItinerary,numericItinerary($A7),BJ$3-1)=\"\",\"\",VLOOKUP(INDEX(campsByItinerary,numericItinerary($A7),BJ$3-1),campInfo,8))","v":"Y"},{"$f":"IF(INDEX(campsByItinerary,numericItinerary($A7),BK$3-1)=\"\",\"\",VLOOKUP(INDEX(campsByItinerary,numericItinerary($A7),BK$3-1),campInfo,8))","v":"Y"},{"$f":"IF(INDEX(campsByItinerary,numericItinerary($A7),BL$3-1)=\"\",\"\",VLOOKUP(INDEX(campsByItinerary,numericItinerary($A7),BL$3-1),campInfo,8))","v":""},{"$f":"IF(INDEX(campsByItinerary,numericItinerary($A7),BM$3-1)=\"\",\"\",VLOOKUP(INDEX(campsByItinerary,numericItinerary($A7),BM$3-1),campInfo,8))","v":""},"Y","Y","","","Y","","","","Y","Y",{"$f":"IF(INDEX(campsByItinerary,numericItinerary($A7),BD$3-1)=\"\",\"\",VLOOKUP(INDEX(campsByItinerary,numericItinerary($A7),BD$3-1),campInfo,10))","v":""},{"$f":"IF(INDEX(campsByItinerary,numericItinerary($A7),BE$3-1)=\"\",\"\",VLOOKUP(INDEX(campsByItinerary,numericItinerary($A7),BE$3-1),campInfo,10))","v":""},{"$f":"IF(INDEX(campsByItinerary,numericItinerary($A7),BF$3-1)=\"\",\"\",VLOOKUP(INDEX(campsByItinerary,numericItinerary($A7),BF$3-1),campInfo,10))","v":""},{"$f":"IF(INDEX(campsByItinerary,numericItinerary($A7),BG$3-1)=\"\",\"\",VLOOKUP(INDEX(campsByItinerary,numericItinerary($A7),BG$3-1),campInfo,10))","v":""},{"$f":"IF(INDEX(campsByItinerary,numericItinerary($A7),BH$3-1)=\"\",\"\",VLOOKUP(INDEX(campsByItinerary,numericItinerary($A7),BH$3-1),campInfo,10))","v":""},{"$f":"IF(INDEX(campsByItinerary,numericItinerary($A7),BI$3-1)=\"\",\"\",VLOOKUP(INDEX(campsByItinerary,numericItinerary($A7),BI$3-1),campInfo,10))","v":""},{"$f":"IF(INDEX(campsByItinerary,numericItinerary($A7),BJ$3-1)=\"\",\"\",VLOOKUP(INDEX(campsByItinerary,numericItinerary($A7),BJ$3-1),campInfo,10))","v":""},{"$f":"IF(INDEX(campsByItinerary,numericItinerary($A7),BK$3-1)=\"\",\"\",VLOOKUP(INDEX(campsByItinerary,numericItinerary($A7),BK$3-1),campInfo,10))","v":""},{"$f":"IF(INDEX(campsByItinerary,numericItinerary($A7),BL$3-1)=\"\",\"\",VLOOKUP(INDEX(campsByItinerary,numericItinerary($A7),BL$3-1),campInfo,10))","v":""},{"$f":"IF(INDEX(campsByItinerary,numericItinerary($A7),BM$3-1)=\"\",\"\",VLOOKUP(INDEX(campsByItinerary,numericItinerary($A7),BM$3-1),campInfo,10))","v":""},null,"","","Y","","","","","","",{"$f":"INDEX(campsByItinerary,numericItinerary($A7),BD$3-1)","v":"Flume Canyon"},{"$f":"IF(INDEX(campsByItinerary,numericItinerary($A7),BE$3-1)=\"\",\"\",VLOOKUP(INDEX(campsByItinerary,numericItinerary($A7),BE$3-1),campInfo,2))","v":"North"},{"$f":"IF(INDEX(campsByItinerary,numericItinerary($A7),BF$3-1)=\"\",\"\",VLOOKUP(INDEX(campsByItinerary,numericItinerary($A7),BF$3-1),campInfo,2))","v":"North"},{"$f":"IF(INDEX(campsByItinerary,numericItinerary($A7),BG$3-1)=\"\",\"\",VLOOKUP(INDEX(campsByItinerary,numericItinerary($A7),BG$3-1),campInfo,2))","v":"North"},{"$f":"IF(INDEX(campsByItinerary,numericItinerary($A7),BH$3-1)=\"\",\"\",VLOOKUP(INDEX(campsByItinerary,numericItinerary($A7),BH$3-1),campInfo,2))","v":"North"},{"$f":"IF(INDEX(campsByItinerary,numericItinerary($A7),BI$3-1)=\"\",\"\",VLOOKUP(INDEX(campsByItinerary,numericItinerary($A7),BI$3-1),campInfo,2))","v":"North"},{"$f":"IF(INDEX(campsByItinerary,numericItinerary($A7),BJ$3-1)=\"\",\"\",VLOOKUP(INDEX(campsByItinerary,numericItinerary($A7),BJ$3-1),campInfo,2))","v":"North"},{"$f":"IF(INDEX(campsByItinerary,numericItinerary($A7),BK$3-1)=\"\",\"\",VLOOKUP(INDEX(campsByItinerary,numericItinerary($A7),BK$3-1),campInfo,2))","v":"North"},{"$f":"IF(INDEX(campsByItinerary,numericItinerary($A7),BL$3-1)=\"\",\"\",VLOOKUP(INDEX(campsByItinerary,numericItinerary($A7),BL$3-1),campInfo,2))","v":"North"},{"$f":"IF(INDEX(campsByItinerary,numericItinerary($A7),BM$3-1)=\"\",\"\",VLOOKUP(INDEX(campsByItinerary,numericItinerary($A7),BM$3-1),campInfo,2))","v":"North"},{"$f":"IF(INDEX(campsByItinerary,numericItinerary($A7),BD$3-1)=\"\",\"\",VLOOKUP(INDEX(campsByItinerary,numericItinerary($A7),BD$3-1),campInfo,12))","v":"North"},{"$f":"IF(INDEX(campsByItinerary,numericItinerary($A7),BE$3-1)=\"\",\"\",VLOOKUP(INDEX(campsByItinerary,numericItinerary($A7),BE$3-1),campInfo,12))","v":"North"},{"$f":"IF(INDEX(campsByItinerary,numericItinerary($A7),BF$3-1)=\"\",\"\",VLOOKUP(INDEX(campsByItinerary,numericItinerary($A7),BF$3-1),campInfo,12))","v":"North"},{"$f":"IF(INDEX(campsByItinerary,numericItinerary($A7),BG$3-1)=\"\",\"\",VLOOKUP(INDEX(campsByItinerary,numericItinerary($A7),BG$3-1),campInfo,12))","v":"North"},{"$f":"IF(INDEX(campsByItinerary,numericItinerary($A7),BH$3-1)=\"\",\"\",VLOOKUP(INDEX(campsByItinerary,numericItinerary($A7),BH$3-1),campInfo,12))","v":"North"},{"$f":"IF(INDEX(campsByItinerary,numericItinerary($A7),BI$3-1)=\"\",\"\",VLOOKUP(INDEX(campsByItinerary,numericItinerary($A7),BI$3-1),campInfo,12))","v":"North"},{"$f":"IF(INDEX(campsByItinerary,numericItinerary($A7),BJ$3-1)=\"\",\"\",VLOOKUP(INDEX(campsByItinerary,numericItinerary($A7),BJ$3-1),campInfo,12))","v":"North"},{"$f":"IF(INDEX(campsByItinerary,numericItinerary($A7),BK$3-1)=\"\",\"\",VLOOKUP(INDEX(campsByItinerary,numericItinerary($A7),BK$3-1),campInfo,12))","v":"North"},{"$f":"IF(INDEX(campsByItinerary,numericItinerary($A7),BL$3-1)=\"\",\"\",VLOOKUP(INDEX(campsByItinerary,numericItinerary($A7),BL$3-1),campInfo,12))","v":"North"},{"$f":"IF(INDEX(campsByItinerary,numericItinerary($A7),BM$3-1)=\"\",\"\",VLOOKUP(INDEX(campsByItinerary,numericItinerary($A7),BM$3-1),campInfo,12))","v":"North"},{"$f":"getfoodPU(\"First\",numericItinerary($A7))","v":2},{"$f":"getfoodPU(\"Max\",numericItinerary($A7))","v":4}]
["12-5",null,"C",54,"Abreu","Carson Meadows","Fish Camp","Lost Cabins","Crooked Creek","Clear Creek","Divide","Phillips Junction","Lookout Meadow","Bear Caves","Camping HQ",null,null,null,"Apache Springs",null,null,"Phillips Junction",null,null,"Zastrow","Lovers Leap","",null,null,null,{"$f":"IF(ItineraryPrograms!AD7=\"y\",\"y\",\"\")","v":""},{"$f":"IF(ItineraryPrograms!AE7=\"y\",\"y\",\"\")","v":""},{"$f":"IF(ItineraryPrograms!AF7=\"y\",\"y\",\"\")","v":"y"},"y",{"$f":"checkTooth(AA8,LOWER(ItineraryPrograms!AH7))","v":""},null,7217,7758,8564,9205,9360,10240,10509,8921,9419,8423,541,806,641,155,880,269,1588,498,996,{"$f":"IF(INDEX(campsByItinerary,numericItinerary($A8),BD$3-1)=\"\",\"\",VLOOKUP(INDEX(campsByItinerary,numericItinerary($A8),BD$3-1),campInfo,8))","v":"Y"},{"$f":"IF(INDEX(campsByItinerary,numericItinerary($A8),BE$3-1)=\"\",\"\",VLOOKUP(INDEX(campsByItinerary,numericItinerary($A8),BE$3-1),campInfo,8))","v":"N"},{"$f":"IF(INDEX(campsByItinerary,numericItinerary($A8),BF$3-1)=\"\",\"\",VLOOKUP(INDEX(campsByItinerary,numericItinerary($A8),BF$3-1),campInfo,8))","v":"N"},{"$f":"IF(INDEX(campsByItinerary,numericItinerary($A8),BG$3-1)=\"\",\"\",VLOOKUP(INDEX(campsByItinerary,numericItinerary($A8),BG$3-1),campInfo,8))","v":""},{"$f":"IF(INDEX(campsByItinerary,numericItinerary($A8),BH$3-1)=\"\",\"\",VLOOKUP(INDEX(campsByItinerary,numericItinerary($A8),BH$3-1),campInfo,8))","v":"Y"},{"$f":"IF(INDEX(campsByItinerary,numericItinerary($A8),BI$3-1)=\"\",\"\",VLOOKUP(INDEX(campsByItinerary,numericItinerary($A8),BI$3-1),campInfo,8))","v":"Y"},{"$f":"IF(INDEX(campsByItinerary,numericItinerary($A8),BJ$3-1)=\"\",\"\",VLOOKUP(INDEX(campsByItinerary,numericItinerary($A8),BJ$3-1),campInfo,8))","v":""},{"$f":"IF(INDEX(campsByItinerary,numericItinerary($A8),BK$3-1)=\"\",\"\",VLOOKUP(INDEX(campsByItinerary,numericItinerary($A8),BK$3-1),campInfo,8))","v":"Y"},{"$f":"IF(INDEX(campsByItinerary,numericItinerary($A8),BL$3-1)=\"\",\"\",VLOOKUP(INDEX(campsByItinerary,numericItinerary($A8),BL$3-1),campInfo,8))","v":""},{"$f":"IF(INDEX(campsByItinerary,numericItinerary($A8),BM$3-1)=\"\",\"\",VLOOKUP(INDEX(campsByItinerary,numericItinerary($A8),BM$3-1),campInfo,8))","v":""},"","Y","Y","Y","","","Y","","Y","Y",{"$f":"IF(INDEX(campsByItinerary,numericItinerary($A8),BD$3-1)=\"\",\"\",VLOOKUP(INDEX(campsByItinerary,numericItinerary($A8),BD$3-1),campInfo,10))","v":""},{"$f":"IF(INDEX(campsByItinerary,numericItinerary($A8),BE$3-1)=\"\",\"\",VLOOKUP(INDEX(campsByItinerary,numericItinerary($A8),BE$3-1),campInfo,10))","v":""},{"$f":"IF(INDEX(campsByItinerary,numericItinerary($A8),BF$3-1)=\"\",\"\",VLOOKUP(INDEX(campsByItinerary,numericItinerary($A8),BF$3-1),campInfo,10))","v":""},{"$f":"IF(INDEX(campsByItinerary,numericItinerary($A8),BG$3-1)=\"\",\"\",VLOOKUP(INDEX(campsByItinerary,numericItinerary($A8),BG$3-1),campInfo,10))","v":""},{"$f":"IF(INDEX(campsByItinerary,numericItinerary($A8),BH$3-1)=\"\",\"\",VLOOKUP(INDEX(campsByItinerary,numericItinerary($A8),BH$3-1),campInfo,10))","v":""},{"$f":"IF(INDEX(campsByItinerary,numericItinerary($A8),BI$3-1)=\"\",\"\",VLOOKUP(INDEX(campsByItinerary,numericItinerary($A8),BI$3-1),campInfo,10))","v":""},{"$f":"IF(INDEX(campsByItinerary,numericItinerary($A8),BJ$3-1)=\"\",\"\",VLOOKUP(INDEX(campsByItinerary,numericItinerary($A8),BJ$3-1),campInfo,10))","v":"Y"},{"$f":"IF(INDEX(campsByItinerary,numericItinerary($A8),BK$3-1)=\"\",\"\",VLOOKUP(INDEX(campsByItinerary,numericItinerary($A8),BK$3-1),campInfo,10))","v":""},{"$f":"IF(INDEX(campsByItinerary,numericItinerary($A8),BL$3-1)=\"\",\"\",VLOOKUP(INDEX(campsByItinerary,numericItinerary($A8),BL$3-1),campInfo,10))","v":""},{"$f":"IF(INDEX(campsByItinerary,numericItinerary($A8),BM$3-1)=\"\",\"\",VLOOKUP(INDEX(campsByItinerary,numericItinerary($A8),BM$3-1),campInfo,10))","v":""},null,"","","","","","","","","",{"$f":"INDEX(campsByItinerary,numericItinerary($A8),BD$3-1)","v":"Abreu"},{"$f":"IF(INDEX(campsByItinerary,numericItinerary($A8),BE$3-1)=\"\",\"\",VLOOKUP(INDEX(campsByItinerary,numericItinerary($A8),BE$3-1),campInfo,2))","v":"South"},{"$f":"IF(INDEX(campsByItinerary,numericItinerary($A8),BF$3-1)=\"\",\"\",VLOOKUP(INDEX(campsByItinerary,numericItinerary($A8),BF$3-1),campInfo,2))","v":"South"},{"$f":"IF(INDEX(campsByItinerary,numericItinerary($A8),BG$3-1)=\"\",\"\",VLOOKUP(INDEX(campsByItinerary,numericItinerary($A8),BG$3-1),campInfo,2))","v":"South"},{"$f":"IF(INDEX(campsByItinerary,numericItinerary($A8),BH$3-1)=\"\",\"\",VLOOKUP(INDEX(campsByItinerary,numericItinerary($A8),BH$3-1),campInfo,2))","v":"South"},{"$f":"IF(INDEX(campsByItinerary,numericItinerary($A8),BI$3-1)=\"\",\"\",VLOOKUP(INDEX(campsByItinerary,numericItinerary($A8),BI$3-1),campInfo,2))","v":"Central"},{"$f":"IF(INDEX(campsByItinerary,numericItinerary($A8),BJ$3-1)=\"\",\"\",VLOOKUP(INDEX(campsByItinerary,numericItinerary($A8),BJ$3-1),campInfo,2))","v":"South"},{"$f":"IF(INDEX(campsByItinerary,numericItinerary($A8),BK$3-1)=\"\",\"\",VLOOKUP(INDEX(campsByItinerary,numericItinerary($A8),BK$3-1),campInfo,2))","v":"South"},{"$f":"IF(INDEX(campsByItinerary,numericItinerary($A8),BL$3-1)=\"\",\"\",VLOOKUP(INDEX(campsByItinerary,numericItinerary($A8),BL$3-1),campInfo,2))","v":"South"},{"$f":"IF(INDEX(campsByItinerary,numericItinerary($A8),BM$3-1)=\"\",\"\",VLOOKUP(INDEX(campsByItinerary,numericItinerary($A8),BM$3-1),campInfo,2))","v":"South"},{"$f":"IF(INDEX(campsByItinerary,numericItinerary($A8),BD$3-1)=\"\",\"\",VLOOKUP(INDEX(campsByItinerary,numericItinerary($A8),BD$3-1),campInfo,12))","v":"South"},{"$f":"IF(INDEX(campsByItinerary,numericItinerary($A8),BE$3-1)=\"\",\"\",VLOOKUP(INDEX(campsByItinerary,numericItinerary($A8),BE$3-1),campInfo,12))","v":"South"},{"$f":"IF(INDEX(campsByItinerary,numericItinerary($A8),BF$3-1)=\"\",\"\",VLOOKUP(INDEX(campsByItinerary,numericItinerary($A8),BF$3-1),campInfo,12))","v":"South"},{"$f":"IF(INDEX(campsByItinerary,numericItinerary($A8),BG$3-1)=\"\",\"\",VLOOKUP(INDEX(campsByItinerary,numericItinerary($A8),BG$3-1),campInfo,12))","v":"South"},{"$f":"IF(INDEX(campsByItinerary,numericItinerary($A8),BH$3-1)=\"\",\"\",VLOOKUP(INDEX(campsByItinerary,numericItinerary($A8),BH$3-1),campInfo,12))","v":"South"},{"$f":"IF(INDEX(campsByItinerary,numericItinerary($A8),BI$3-1)=\"\",\"\",VLOOKUP(INDEX(campsByItinerary,numericItinerary($A8),BI$3-1),campInfo,12))","v":"South"},{"$f":"IF(INDEX(campsByItinerary,numericItinerary($A8),BJ$3-1)=\"\",\"\",VLOOKUP(INDEX(campsByItinerary,numericItinerary($A8),BJ$3-1),campInfo,12))","v":"South"},{"$f":"IF(INDEX(campsByItinerary,numericItinerary($A8),BK$3-1)=\"\",\"\",VLOOKUP(INDEX(campsByItinerary,numericItinerary($A8),BK$3-1),campInfo,12))","v":"South"},{"$f":"IF(INDEX(campsByItinerary,numericItinerary($A8),BL$3-1)=\"\",\"\",VLOOKUP(INDEX(campsByItinerary,numericItinerary($A8),BL$3-1),campInfo,12))","v":"South"},{"$f":"IF(INDEX(campsByItinerary,numericItinerary($A8),BM$3-1)=\"\",\"\",VLOOKUP(INDEX(campsByItinerary,numericItinerary($A8),BM$3-1),campInfo,12))","v":"South"},{"$f":"getfoodPU(\"First\",numericItinerary($A8))","v":4},{"$f":"getfoodPU(\"Max\",numericItinerary($A8))","v":4}]
["12-6","50 Miler","R",53,"Herradura","Miners Park","Ponderosa Park","Cimarroncito","Cimarroncita","Cimarroncita","Upper Dean Cow","Ewells Park","Ewells Park","Miranda","Camping HQ","Miners Park",null,null,"Ute Gulch",null,null,null,"Baldy Town",null,"Lovers Leap","Maxwell","",7,"Bear Canyon","N",{"$f":"IF(ItineraryPrograms!AD8=\"y\",\"y\",\"\")","v":"y"},{"$f":"IF(ItineraryPrograms!AE8=\"y\",\"y\",\"\")","v":""},{"$f":"IF(ItineraryPrograms!AF8=\"y\",\"y\",\"\")","v":""},null,{"$f":"checkTooth(AA9,LOWER(ItineraryPrograms!AH8))","v":""},null,7465,7977,8004,8137,7373,7373,8254,9373,9373,8898,512,27,133,764,0,881,1119,0,475,{"$f":"IF(INDEX(campsByItinerary,numericItinerary($A9),BD$3-1)=\"\",\"\",VLOOKUP(INDEX(campsByItinerary,numericItinerary($A9),BD$3-1),campInfo,8))","v":""},{"$f":"IF(INDEX(campsByItinerary,numericItinerary($A9),BE$3-1)=\"\",\"\",VLOOKUP(INDEX(campsByItinerary,numericItinerary($A9),BE$3-1),campInfo,8))","v":"Y"},{"$f":"IF(INDEX(campsByItinerary,numericItinerary($A9),BF$3-1)=\"\",\"\",VLOOKUP(INDEX(campsByItinerary,numericItinerary($A9),BF$3-1),campInfo,8))","v":""},{"$f":"IF(INDEX(campsByItinerary,numericItinerary($A9),BG$3-1)=\"\",\"\",VLOOKUP(INDEX(campsByItinerary,numericItinerary($A9),BG$3-1),campInfo,8))","v":"Y"},{"$f":"IF(INDEX(campsByItinerary,numericItinerary($A9),BH$3-1)=\"\",\"\",VLOOKUP(INDEX(campsByItinerary,numericItinerary($A9),BH$3-1),campInfo,8))","v":"Y"},{"$f":"IF(INDEX(campsByItinerary,numericItinerary($A9),BI$3-1)=\"\",\"\",VLOOKUP(INDEX(campsByItinerary,numericItinerary($A9),BI$3-1),campInfo,8))","v":"Y"},{"$f":"IF(INDEX(campsByItinerary,numericItinerary($A9),BJ$3-1)=\"\",\"\",VLOOKUP(INDEX(campsByItinerary,numericItinerary($A9),BJ$3-1),campInfo,8))","v":""},{"$f":"IF(INDEX(campsByItinerary,numericItinerary($A9),BK$3-1)=\"\",\"\",VLOOKUP(INDEX(campsByItinerary,numericItinerary($A9),BK$3-1),campInfo,8))","v":""},{"$f":"IF(INDEX(campsByItinerary,numericItinerary($A9),BL$3-1)=\"\",\"\",VLOOKUP(INDEX(campsByItinerary,numericItinerary($A9),BL$3-1),campInfo,8))","v":""},{"$f":"IF(INDEX(campsByItinerary,numericItinerary($A9),BM$3-1)=\"\",\"\",VLOOKUP(INDEX(campsByItinerary,numericItinerary($A9),BM$3-1),campInfo,8))","v":"Y"},"Y","","Y","","","","Y","Y","Y","",{"$f":"IF(INDEX(campsByItinerary,numericItinerary($A9),BD$3-1)=\"\",\"\",VLOOKUP(INDEX(campsByItinerary,numericItinerary($A9),BD$3-1),campInfo,10))","v":"Y"},{"$f":"IF(INDEX(campsByItinerary,numericItinerary($A9),BE$3-1)=\"\",\"\",VLOOKUP(INDEX(campsByItinerary,numericItinerary($A9),BE$3-1),campInfo,10))","v":""},{"$f":"IF(INDEX(campsByItinerary,numericItinerary($A9),BF$3-1)=\"\",\"\",VLOOKUP(INDEX(campsByItinerary,numericItinerary($A9),BF$3-1),campInfo,10))","v":"Y"},{"$f":"IF(INDEX(campsByItinerary,numericItinerary($A9),BG$3-1)=\"\",\"\",VLOOKUP(INDEX(campsByItinerary,numericItinerary($A9),BG$3-1),campInfo,10))","v":""},{"$f":"IF(INDEX(campsByItinerary,numericItinerary($A9),BH$3-1)=\"\",\"\",VLOOKUP(INDEX(campsByItinerary,numericItinerary($A9),BH$3-1),campInfo,10))","v":""},{"$f":"IF(INDEX(campsByItinerary,numericItinerary($A9),BI$3-1)=\"\",\"\",VLOOKUP(INDEX(campsByItinerary,numericItinerary($A9),BI$3-1),campInfo,10))","v":""},{"$f":"IF(INDEX(campsByItinerary,numericItinerary($A9),BJ$3-1)=\"\",\"\",VLOOKUP(INDEX(campsByItinerary,numericItinerary($A9),BJ$3-1),campInfo,10))","v":""},{"$f":"IF(INDEX(campsByItinerary,numericItinerary($A9),BK$3-1)=\"\",\"\",VLOOKUP(INDEX(campsByItinerary,numericItinerary($A9),BK$3-1),campInfo,10))","v":""},{"$f":"IF(INDEX(campsByItinerary,numericItinerary($A9),BL$3-1)=\"\",\"\",VLOOKUP(INDEX(campsByItinerary,numericItinerary($A9),BL$3-1),campInfo,10))","v":""},{"$f":"IF(INDEX(campsByItinerary,numericItinerary($A9),BM$3-1)=\"\",\"\",VLOOKUP(INDEX(campsByItinerary,numericItinerary($A9),BM$3-1),campInfo,10))","v":""},null,"","","","","Y","","","Y","",{"$f":"INDEX(campsByItinerary,numericItinerary($A9),BD$3-1)","v":"Herradura"},{"$f":"IF(INDEX(campsByItinerary,numericItinerary($A9),BE$3-1)=\"\",\"\",VLOOKUP(INDEX(campsByItinerary,numericItinerary($A9),BE$3-1),campInfo,2))","v":"South"},{"$f":"IF(INDEX(campsByItinerary,numericItinerary($A9),BF$3-1)=\"\",\"\",VLOOKUP(INDEX(campsByItinerary,numericItinerary($A9),BF$3-1),campInfo,2))","v":"Central"},{"$f":"IF(INDEX(campsByItinerary,numericItinerary($A9),BG$3-1)=\"\",\"\",VLOOKUP(INDEX(campsByItinerary,numericItinerary($A9),BG$3-1),campInfo,2))","v":"Central"},{"$f":"IF(INDEX(campsByItinerary,numericItinerary($A9),BH$3-1)=\"\",\"\",VLOOKUP(INDEX(campsByItinerary,numericItinerary($A9),BH$3-1),campInfo,2))","v":"Central"},{"$f":"IF(INDEX(campsByItinerary,numericItinerary($A9),BI$3-1)=\"\",\"\",VLOOKUP(INDEX(campsByItinerary,numericItinerary($A9),BI$3-1),campInfo,2))","v":"Central"},{"$f":"IF(INDEX(campsByItinerary,numericItinerary($A9),BJ$3-1)=\"\",\"\",VLOOKUP(INDEX(campsByItinerary,numericItinerary($A9),BJ$3-1),campInfo,2))","v":"North"},{"$f":"IF(INDEX(campsByItinerary,numericItinerary($A9),BK$3-1)=\"\",\"\",VLOOKUP(INDEX(campsByItinerary,numericItinerary($A9),BK$3-1),campInfo,2))","v":"North"},{"$f":"IF(INDEX(campsByItinerary,numericItinerary($A9),BL$3-1)=\"\",\"\",VLOOKUP(INDEX(campsByItinerary,numericItinerary($A9),BL$3-1),campInfo,2))","v":"North"},{"$f":"IF(INDEX(campsByItinerary,numericItinerary($A9),BM$3-1)=\"\",\"\",VLOOKUP(INDEX(campsByItinerary,numericItinerary($A9),BM$3-1),campInfo,2))","v":"North"},{"$f":"IF(INDEX(campsByItinerary,numericItinerary($A9),BD$3-1)=\"\",\"\",VLOOKUP(INDEX(campsByItinerary,numericItinerary($A9),BD$3-1),campInfo,12))","v":"South"},{"$f":"IF(INDEX(campsByItinerary,numericItinerary($A9),BE$3-1)=\"\",\"\",VLOOKUP(INDEX(campsByItinerary,numericItinerary($A9),BE$3-1),campInfo,12))","v":"South"},{"$f":"IF(INDEX(campsByItinerary,numericItinerary($A9),BF$3-1)=\"\",\"\",VLOOKUP(INDEX(campsByItinerary,numericItinerary($A9),BF$3-1),campInfo,12))","v":"South"},{"$f":"IF(INDEX(campsByItinerary,numericItinerary($A9),BG$3-1)=\"\",\"\",VLOOKUP(INDEX(campsByItinerary,numericItinerary($A9),BG$3-1),campInfo,12))","v":"South"},{"$f":"IF(INDEX(campsByItinerary,numericItinerary($A9),BH$3-1)=\"\",\"\",VLOOKUP(INDEX(campsByItinerary,numericItinerary($A9),BH$3-1),campInfo,12))","v":"North & South"},{"$f":"IF(INDEX(campsByItinerary,numericItinerary($A9),BI$3-1)=\"\",\"\",VLOOKUP(INDEX(campsByItinerary,numericItinerary($A9),BI$3-1),campInfo,12))","v":"North & South"},{"$f":"IF(INDEX(campsByItinerary,numericItinerary($A9),BJ$3-1)=\"\",\"\",VLOOKUP(INDEX(campsByItinerary,numericItinerary($A9),BJ$3-1),campInfo,12))","v":"North"},{"$f":"IF(INDEX(campsByItinerary,numericItinerary($A9),BK$3-1)=\"\",\"\",VLOOKUP(INDEX(campsByItinerary,numericItinerary($A9),BK$3-1),campInfo,12))","v":"North"},{"$f":"IF(INDEX(campsByItinerary,numericItinerary($A9),BL$3-1)=\"\",\"\",VLOOKUP(INDEX(campsByItinerary,numericItinerary($A9),BL$3-1),campInfo,12))","v":"North"},{"$f":"IF(INDEX(campsByItinerary,numericItinerary($A9),BM$3-1)=\"\",\"\",VLOOKUP(INDEX(campsByItinerary,numericItinerary($A9),BM$3-1),campInfo,12))","v":"North"},{"$f":"getfoodPU(\"First\",numericItinerary($A9))","v":1},{"$f":"getfoodPU(\"Max\",numericItinerary($A9))","v":3}]
["12-7",null,"R",69,"Sioux","Rich Cabins","Beatty Lakes","Whiteman Vega","Ring Place","Iris Park","Greenwood Canyon","Copper Park","Copper Park","Miranda","Camping HQ","Rich Cabins",null,null,"Ring Place",null,null,null,"Baldy Town",null,"Ponil","Maxwell","",null,null,null,{"$f":"IF(ItineraryPrograms!AD9=\"y\",\"y\",\"\")","v":"y"},{"$f":"IF(ItineraryPrograms!AE9=\"y\",\"y\",\"\")","v":""},{"$f":"IF(ItineraryPrograms!AF9=\"y\",\"y\",\"\")","v":""},null,{"$f":"checkTooth(AA10,LOWER(ItineraryPrograms!AH9))","v":""},null,7382,7728,8178.6580000000004,8061,8124,8571,8300,10530,10530,8898,346,450.65800000000036,117.65800000000036,63,447,271,2230,0,1632,{"$f":"IF(INDEX(campsByItinerary,numericItinerary($A10),BD$3-1)=\"\",\"\",VLOOKUP(INDEX(campsByItinerary,numericItinerary($A10),BD$3-1),campInfo,8))","v":""},{"$f":"IF(INDEX(campsByItinerary,numericItinerary($A10),BE$3-1)=\"\",\"\",VLOOKUP(INDEX(campsByItinerary,numericItinerary($A10),BE$3-1),campInfo,8))","v":"Y"},{"$f":"IF(INDEX(campsByItinerary,numericItinerary($A10),BF$3-1)=\"\",\"\",VLOOKUP(INDEX(campsByItinerary,numericItinerary($A10),BF$3-1),campInfo,8))","v":""},{"$f":"IF(INDEX(campsByItinerary,numericItinerary($A10),BG$3-1)=\"\",\"\",VLOOKUP(INDEX(campsByItinerary,numericItinerary($A10),BG$3-1),campInfo,8))","v":"Y"},{"$f":"IF(INDEX(campsByItinerary,numericItinerary($A10),BH$3-1)=\"\",\"\",VLOOKUP(INDEX(campsByItinerary,numericItinerary($A10),BH$3-1),campInfo,8))","v":"Y"},{"$f":"IF(INDEX(campsByItinerary,numericItinerary($A10),BI$3-1)=\"\",\"\",VLOOKUP(INDEX(campsByItinerary,numericItinerary($A10),BI$3-1),campInfo,8))","v":""},{"$f":"IF(INDEX(campsByItinerary,numericItinerary($A10),BJ$3-1)=\"\",\"\",VLOOKUP(INDEX(campsByItinerary,numericItinerary($A10),BJ$3-1),campInfo,8))","v":""},{"$f":"IF(INDEX(campsByItinerary,numericItinerary($A10),BK$3-1)=\"\",\"\",VLOOKUP(INDEX(campsByItinerary,numericItinerary($A10),BK$3-1),campInfo,8))","v":""},{"$f":"IF(INDEX(campsByItinerary,numericItinerary($A10),BL$3-1)=\"\",\"\",VLOOKUP(INDEX(campsByItinerary,numericItinerary($A10),BL$3-1),campInfo,8))","v":""},{"$f":"IF(INDEX(campsByItinerary,numericItinerary($A10),BM$3-1)=\"\",\"\",VLOOKUP(INDEX(campsByItinerary,numericItinerary($A10),BM$3-1),campInfo,8))","v":"Y"},"Y","","Y","","","Y","Y","Y","Y","",{"$f":"IF(INDEX(campsByItinerary,numericItinerary($A10),BD$3-1)=\"\",\"\",VLOOKUP(INDEX(campsByItinerary,numericItinerary($A10),BD$3-1),campInfo,10))","v":""},{"$f":"IF(INDEX(campsByItinerary,numericItinerary($A10),BE$3-1)=\"\",\"\",VLOOKUP(INDEX(campsByItinerary,numericItinerary($A10),BE$3-1),campInfo,10))","v":""},{"$f":"IF(INDEX(campsByItinerary,numericItinerary($A10),BF$3-1)=\"\",\"\",VLOOKUP(INDEX(campsByItinerary,numericItinerary($A10),BF$3-1),campInfo,10))","v":"Y"},{"$f":"IF(INDEX(campsByItinerary,numericItinerary($A10),BG$3-1)=\"\",\"\",VLOOKUP(INDEX(campsByItinerary,numericItinerary($A10),BG$3-1),campInfo,10))","v":""},{"$f":"IF(INDEX(campsByItinerary,numericItinerary($A10),BH$3-1)=\"\",\"\",VLOOKUP(INDEX(campsByItinerary,numericItinerary($A10),BH$3-1),campInfo,10))","v":""},{"$f":"IF(INDEX(campsByItinerary,numericItinerary($A10),BI$3-1)=\"\",\"\",VLOOKUP(INDEX(campsByItinerary,numericItinerary($A10),BI$3-1),campInfo,10))","v":""},{"$f":"IF(INDEX(campsByItinerary,numericItinerary($A10),BJ$3-1)=\"\",\"\",VLOOKUP(INDEX(campsByItinerary,numericItinerary($A10),BJ$3-1),campInfo,10))","v":""},{"$f":"IF(INDEX(campsByItinerary,numericItinerary($A10),BK$3-1)=\"\",\"\",VLOOKUP(INDEX(campsByItinerary,numericItinerary($A10),BK$3-1),campInfo,10))","v":""},{"$f":"IF(INDEX(campsByItinerary,numericItinerary($A10),BL$3-1)=\"\",\"\",VLOOKUP(INDEX(campsByItinerary,numericItinerary($A10),BL$3-1),campInfo,10))","v":""},{"$f":"IF(INDEX(campsByItinerary,numericItinerary($A10),BM$3-1)=\"\",\"\",VLOOKUP(INDEX(campsByItinerary,numericItinerary($A10),BM$3-1),campInfo,10))","v":""},null,"","","","","","","","Y","",{"$f":"INDEX(campsByItinerary,numericItinerary($A10),BD$3-1)","v":"Sioux"},{"$f":"IF(INDEX(campsByItinerary,numericItinerary($A10),BE$3-1)=\"\",\"\",VLOOKUP(INDEX(campsByItinerary,numericItinerary($A10),BE$3-1),campInfo,2))","v":"Valle Vidal"},{"$f":"IF(INDEX(campsByItinerary,numericItinerary($A10),BF$3-1)=\"\",\"\",VLOOKUP(INDEX(campsByItinerary,numericItinerary($A10),BF$3-1),campInfo,2))","v":"Valle Vidal"},{"$f":"IF(INDEX(campsByItinerary,numericItinerary($A10),BG$3-1)=\"\",\"\",VLOOKUP(INDEX(campsByItinerary,numericItinerary($A10),BG$3-1),campInfo,2))","v":"Valle Vidal"},{"$f":"IF(INDEX(campsByItinerary,numericItinerary($A10),BH$3-1)=\"\",\"\",VLOOKUP(INDEX(campsByItinerary,numericItinerary($A10),BH$3-1),campInfo,2))","v":"Valle Vidal"},{"$f":"IF(INDEX(campsByItinerary,numericItinerary($A10),BI$3-1)=\"\",\"\",VLOOKUP(INDEX(campsByItinerary,numericItinerary($A10),BI$3-1),campInfo,2))","v":"Valle Vidal"},{"$f":"IF(INDEX(campsByItinerary,numericItinerary($A10),BJ$3-1)=\"\",\"\",VLOOKUP(INDEX(campsByItinerary,numericItinerary($A10),BJ$3-1),campInfo,2))","v":"Valle Vidal"},{"$f":"IF(INDEX(campsByItinerary,numericItinerary($A10),BK$3-1)=\"\",\"\",VLOOKUP(INDEX(campsByItinerary,numericItinerary($A10),BK$3-1),campInfo,2))","v":"North"},{"$f":"IF(INDEX(campsByItinerary,numericItinerary($A10),BL$3-1)=\"\",\"\",VLOOKUP(INDEX(campsByItinerary,numericItinerary($A10),BL$3-1),campInfo,2))","v":"North"},{"$f":"IF(INDEX(campsByItinerary,numericItinerary($A10),BM$3-1)=\"\",\"\",VLOOKUP(INDEX(campsByItinerary,numericItinerary($A10),BM$3-1),campInfo,2))","v":"North"},{"$f":"IF(INDEX(campsByItinerary,numericItinerary($A10),BD$3-1)=\"\",\"\",VLOOKUP(INDEX(campsByItinerary,numericItinerary($A10),BD$3-1),campInfo,12))","v":"North"},{"$f":"IF(INDEX(campsByItinerary,numericItinerary($A10),BE$3-1)=\"\",\"\",VLOOKUP(INDEX(campsByItinerary,numericItinerary($A10),BE$3-1),campInfo,12))","v":"North"},{"$f":"IF(INDEX(campsByItinerary,numericItinerary($A10),BF$3-1)=\"\",\"\",VLOOKUP(INDEX(campsByItinerary,numericItinerary($A10),BF$3-1),campInfo,12))","v":"North"},{"$f":"IF(INDEX(campsByItinerary,numericItinerary($A10),BG$3-1)=\"\",\"\",VLOOKUP(INDEX(campsByItinerary,numericItinerary($A10),BG$3-1),campInfo,12))","v":"North"},{"$f":"IF(INDEX(campsByItinerary,numericItinerary($A10),BH$3-1)=\"\",\"\",VLOOKUP(INDEX(campsByItinerary,numericItinerary($A10),BH$3-1),campInfo,12))","v":"North"},{"$f":"IF(INDEX(campsByItinerary,numericItinerary($A10),BI$3-1)=\"\",\"\",VLOOKUP(INDEX(campsByItinerary,numericItinerary($A10),BI$3-1),campInfo,12))","v":"North"},{"$f":"IF(INDEX(campsByItinerary,numericItinerary($A10),BJ$3-1)=\"\",\"\",VLOOKUP(INDEX(campsByItinerary,numericItinerary($A10),BJ$3-1),campInfo,12))","v":"North"},{"$f":"IF(INDEX(campsByItinerary,numericItinerary($A10),BK$3-1)=\"\",\"\",VLOOKUP(INDEX(campsByItinerary,numericItinerary($A10),BK$3-1),campInfo,12))","v":"North"},{"$f":"IF(INDEX(campsByItinerary,numericItinerary($A10),BL$3-1)=\"\",\"\",VLOOKUP(INDEX(campsByItinerary,numericItinerary($A10),BL$3-1),campInfo,12))","v":"North"},{"$f":"IF(INDEX(campsByItinerary,numericItinerary($A10),BM$3-1)=\"\",\"\",VLOOKUP(INDEX(campsByItinerary,numericItinerary($A10),BM$3-1),campInfo,12))","v":"North"},{"$f":"getfoodPU(\"First\",numericItinerary($A10))","v":1},{"$f":"getfoodPU(\"Max\",numericItinerary($A10))","v":3}]
["12-8",null,"R",55,"House Canyon","Indian Writings","Horse Canyon","Dean Skyline","Pueblano","Placer","Placer","Head of Dean","New Dean","Cimarron River","Camping HQ",null,null,"Ponil",null,null,"Baldy Town",null,null,null,"Six Mile Gate","Ute Park","",11,"Bear Canyon","S",{"$f":"IF(ItineraryPrograms!AD10=\"y\",\"y\",\"\")","v":"y"},{"$f":"IF(ItineraryPrograms!AE10=\"y\",\"y\",\"\")","v":""},{"$f":"IF(ItineraryPrograms!AF10=\"y\",\"y\",\"\")","v":""},"y",{"$f":"checkTooth(AA11,LOWER(ItineraryPrograms!AH10))","v":""},null,7157,6979,8128,7967,8069,9483.43,9483.43,8754,7724,7282,178,1149,161,102,1414.4300000000003,0,729.43000000000029,1030,442,{"$f":"IF(INDEX(campsByItinerary,numericItinerary($A11),BD$3-1)=\"\",\"\",VLOOKUP(INDEX(campsByItinerary,numericItinerary($A11),BD$3-1),campInfo,8))","v":""},{"$f":"IF(INDEX(campsByItinerary,numericItinerary($A11),BE$3-1)=\"\",\"\",VLOOKUP(INDEX(campsByItinerary,numericItinerary($A11),BE$3-1),campInfo,8))","v":"Y"},{"$f":"IF(INDEX(campsByItinerary,numericItinerary($A11),BF$3-1)=\"\",\"\",VLOOKUP(INDEX(campsByItinerary,numericItinerary($A11),BF$3-1),campInfo,8))","v":""},{"$f":"IF(INDEX(campsByItinerary,numericItinerary($A11),BG$3-1)=\"\",\"\",VLOOKUP(INDEX(campsByItinerary,numericItinerary($A11),BG$3-1),campInfo,8))","v":""},{"$f":"IF(INDEX(campsByItinerary,numericItinerary($A11),BH$3-1)=\"\",\"\",VLOOKUP(INDEX(campsByItinerary,numericItinerary($A11),BH$3-1),campInfo,8))","v":"Y"},{"$f":"IF(INDEX(campsByItinerary,numericItinerary($A11),BI$3-1)=\"\",\"\",VLOOKUP(INDEX(campsByItinerary,numericItinerary($A11),BI$3-1),campInfo,8))","v":""},{"$f":"IF(INDEX(campsByItinerary,numericItinerary($A11),BJ$3-1)=\"\",\"\",VLOOKUP(INDEX(campsByItinerary,numericItinerary($A11),BJ$3-1),campInfo,8))","v":""},{"$f":"IF(INDEX(campsByItinerary,numericItinerary($A11),BK$3-1)=\"\",\"\",VLOOKUP(INDEX(campsByItinerary,numericItinerary($A11),BK$3-1),campInfo,8))","v":"Y"},{"$f":"IF(INDEX(campsByItinerary,numericItinerary($A11),BL$3-1)=\"\",\"\",VLOOKUP(INDEX(campsByItinerary,numericItinerary($A11),BL$3-1),campInfo,8))","v":""},{"$f":"IF(INDEX(campsByItinerary,numericItinerary($A11),BM$3-1)=\"\",\"\",VLOOKUP(INDEX(campsByItinerary,numericItinerary($A11),BM$3-1),campInfo,8))","v":""},"Y","","Y","Y","","Y","Y","","Y","Y",{"$f":"IF(INDEX(campsByItinerary,numericItinerary($A11),BD$3-1)=\"\",\"\",VLOOKUP(INDEX(campsByItinerary,numericItinerary($A11),BD$3-1),campInfo,10))","v":""},{"$f":"IF(INDEX(campsByItinerary,numericItinerary($A11),BE$3-1)=\"\",\"\",VLOOKUP(INDEX(campsByItinerary,numericItinerary($A11),BE$3-1),campInfo,10))","v":""},{"$f":"IF(INDEX(campsByItinerary,numericItinerary($A11),BF$3-1)=\"\",\"\",VLOOKUP(INDEX(campsByItinerary,numericItinerary($A11),BF$3-1),campInfo,10))","v":""},{"$f":"IF(INDEX(campsByItinerary,numericItinerary($A11),BG$3-1)=\"\",\"\",VLOOKUP(INDEX(campsByItinerary,numericItinerary($A11),BG$3-1),campInfo,10))","v":"Y"},{"$f":"IF(INDEX(campsByItinerary,numericItinerary($A11),BH$3-1)=\"\",\"\",VLOOKUP(INDEX(campsByItinerary,numericItinerary($A11),BH$3-1),campInfo,10))","v":""},{"$f":"IF(INDEX(campsByItinerary,numericItinerary($A11),BI$3-1)=\"\",\"\",VLOOKUP(INDEX(campsByItinerary,numericItinerary($A11),BI$3-1),campInfo,10))","v":""},{"$f":"IF(INDEX(campsByItinerary,numericItinerary($A11),BJ$3-1)=\"\",\"\",VLOOKUP(INDEX(campsByItinerary,numericItinerary($A11),BJ$3-1),campInfo,10))","v":""},{"$f":"IF(INDEX(campsByItinerary,numericItinerary($A11),BK$3-1)=\"\",\"\",VLOOKUP(INDEX(campsByItinerary,numericItinerary($A11),BK$3-1),campInfo,10))","v":""},{"$f":"IF(INDEX(campsByItinerary,numericItinerary($A11),BL$3-1)=\"\",\"\",VLOOKUP(INDEX(campsByItinerary,numericItinerary($A11),BL$3-1),campInfo,10))","v":""},{"$f":"IF(INDEX(campsByItinerary,numericItinerary($A11),BM$3-1)=\"\",\"\",VLOOKUP(INDEX(campsByItinerary,numericItinerary($A11),BM$3-1),campInfo,10))","v":""},null,"","","","","","Y","","","",{"$f":"INDEX(campsByItinerary,numericItinerary($A11),BD$3-1)","v":"House Canyon"},{"$f":"IF(INDEX(campsByItinerary,numericItinerary($A11),BE$3-1)=\"\",\"\",VLOOKUP(INDEX(campsByItinerary,numericItinerary($A11),BE$3-1),campInfo,2))","v":"North"},{"$f":"IF(INDEX(campsByItinerary,numericItinerary($A11),BF$3-1)=\"\",\"\",VLOOKUP(INDEX(campsByItinerary,numericItinerary($A11),BF$3-1),campInfo,2))","v":"North"},{"$f":"IF(INDEX(campsByItinerary,numericItinerary($A11),BG$3-1)=\"\",\"\",VLOOKUP(INDEX(campsByItinerary,numericItinerary($A11),BG$3-1),campInfo,2))","v":"North"},{"$f":"IF(INDEX(campsByItinerary,numericItinerary($A11),BH$3-1)=\"\",\"\",VLOOKUP(INDEX(campsByItinerary,numericItinerary($A11),BH$3-1),campInfo,2))","v":"North"},{"$f":"IF(INDEX(campsByItinerary,numericItinerary($A11),BI$3-1)=\"\",\"\",VLOOKUP(INDEX(campsByItinerary,numericItinerary($A11),BI$3-1),campInfo,2))","v":"North"},{"$f":"IF(INDEX(campsByItinerary,numericItinerary($A11),BJ$3-1)=\"\",\"\",VLOOKUP(INDEX(campsByItinerary,numericItinerary($A11),BJ$3-1),campInfo,2))","v":"North"},{"$f":"IF(INDEX(campsByItinerary,numericItinerary($A11),BK$3-1)=\"\",\"\",VLOOKUP(INDEX(campsByItinerary,numericItinerary($A11),BK$3-1),campInfo,2))","v":"North"},{"$f":"IF(INDEX(campsByItinerary,numericItinerary($A11),BL$3-1)=\"\",\"\",VLOOKUP(INDEX(campsByItinerary,numericItinerary($A11),BL$3-1),campInfo,2))","v":"North"},{"$f":"IF(INDEX(campsByItinerary,numericItinerary($A11),BM$3-1)=\"\",\"\",VLOOKUP(INDEX(campsByItinerary,numericItinerary($A11),BM$3-1),campInfo,2))","v":"Central"},{"$f":"IF(INDEX(campsByItinerary,numericItinerary($A11),BD$3-1)=\"\",\"\",VLOOKUP(INDEX(campsByItinerary,numericItinerary($A11),BD$3-1),campInfo,12))","v":"North"},{"$f":"IF(INDEX(campsByItinerary,numericItinerary($A11),BE$3-1)=\"\",\"\",VLOOKUP(INDEX(campsByItinerary,numericItinerary($A11),BE$3-1),campInfo,12))","v":"North"},{"$f":"IF(INDEX(campsByItinerary,numericItinerary($A11),BF$3-1)=\"\",\"\",VLOOKUP(INDEX(campsByItinerary,numericItinerary($A11),BF$3-1),campInfo,12))","v":"North"},{"$f":"IF(INDEX(campsByItinerary,numericItinerary($A11),BG$3-1)=\"\",\"\",VLOOKUP(INDEX(campsByItinerary,numericItinerary($A11),BG$3-1),campInfo,12))","v":"North"},{"$f":"IF(INDEX(campsByItinerary,numericItinerary($A11),BH$3-1)=\"\",\"\",VLOOKUP(INDEX(campsByItinerary,numericItinerary($A11),BH$3-1),campInfo,12))","v":"North"},{"$f":"IF(INDEX(campsByItinerary,numericItinerary($A11),BI$3-1)=\"\",\"\",VLOOKUP(INDEX(campsByItinerary,numericItinerary($A11),BI$3-1),campInfo,12))","v":"North"},{"$f":"IF(INDEX(campsByItinerary,numericItinerary($A11),BJ$3-1)=\"\",\"\",VLOOKUP(INDEX(campsByItinerary,numericItinerary($A11),BJ$3-1),campInfo,12))","v":"North"},{"$f":"IF(INDEX(campsByItinerary,numericItinerary($A11),BK$3-1)=\"\",\"\",VLOOKUP(INDEX(campsByItinerary,numericItinerary($A11),BK$3-1),campInfo,12))","v":"North"},{"$f":"IF(INDEX(campsByItinerary,numericItinerary($A11),BL$3-1)=\"\",\"\",VLOOKUP(INDEX(campsByItinerary,numericItinerary($A11),BL$3-1),campInfo,12))","v":"North"},{"$f":"IF(INDEX(campsByItinerary,numericItinerary($A11),BM$3-1)=\"\",\"\",VLOOKUP(INDEX(campsByItinerary,numericItinerary($A11),BM$3-1),campInfo,12))","v":"South"},{"$f":"getfoodPU(\"First\",numericItinerary($A11))","v":3},{"$f":"getfoodPU(\"Max\",numericItinerary($A11))","v":3}]
["12-9",null,"R",61,"Dean Cow","New Dean","Ponil","Flume Canyon","Miranda","Santa Claus","Cimarroncita","Cimarroncito","Hunting Lodge","Shaefers Pass","Camping HQ",null,"Ponil",null,null,null,null,"Ute Gulch",null,null,"Nine Mile","Hike In","y",8,"Bear Canyon","S",{"$f":"IF(ItineraryPrograms!AD11=\"y\",\"y\",\"\")","v":""},{"$f":"IF(ItineraryPrograms!AE11=\"y\",\"y\",\"\")","v":""},{"$f":"IF(ItineraryPrograms!AF11=\"y\",\"y\",\"\")","v":""},"y",{"$f":"checkTooth(AA12,LOWER(ItineraryPrograms!AH11))","v":"y"},null,7232,7724,7150,7715,8898,8438,7373,8137,7776,8724,492,574,565,1183,460,1065,764,361,948,{"$f":"IF(INDEX(campsByItinerary,numericItinerary($A12),BD$3-1)=\"\",\"\",VLOOKUP(INDEX(campsByItinerary,numericItinerary($A12),BD$3-1),campInfo,8))","v":"Y"},{"$f":"IF(INDEX(campsByItinerary,numericItinerary($A12),BE$3-1)=\"\",\"\",VLOOKUP(INDEX(campsByItinerary,numericItinerary($A12),BE$3-1),campInfo,8))","v":""},{"$f":"IF(INDEX(campsByItinerary,numericItinerary($A12),BF$3-1)=\"\",\"\",VLOOKUP(INDEX(campsByItinerary,numericItinerary($A12),BF$3-1),campInfo,8))","v":"Y"},{"$f":"IF(INDEX(campsByItinerary,numericItinerary($A12),BG$3-1)=\"\",\"\",VLOOKUP(INDEX(campsByItinerary,numericItinerary($A12),BG$3-1),campInfo,8))","v":""},{"$f":"IF(INDEX(campsByItinerary,numericItinerary($A12),BH$3-1)=\"\",\"\",VLOOKUP(INDEX(campsByItinerary,numericItinerary($A12),BH$3-1),campInfo,8))","v":"Y"},{"$f":"IF(INDEX(campsByItinerary,numericItinerary($A12),BI$3-1)=\"\",\"\",VLOOKUP(INDEX(campsByItinerary,numericItinerary($A12),BI$3-1),campInfo,8))","v":"Y"},{"$f":"IF(INDEX(campsByItinerary,numericItinerary($A12),BJ$3-1)=\"\",\"\",VLOOKUP(INDEX(campsByItinerary,numericItinerary($A12),BJ$3-1),campInfo,8))","v":"Y"},{"$f":"IF(INDEX(campsByItinerary,numericItinerary($A12),BK$3-1)=\"\",\"\",VLOOKUP(INDEX(campsByItinerary,numericItinerary($A12),BK$3-1),campInfo,8))","v":"Y"},{"$f":"IF(INDEX(campsByItinerary,numericItinerary($A12),BL$3-1)=\"\",\"\",VLOOKUP(INDEX(campsByItinerary,numericItinerary($A12),BL$3-1),campInfo,8))","v":"N"},{"$f":"IF(INDEX(campsByItinerary,numericItinerary($A12),BM$3-1)=\"\",\"\",VLOOKUP(INDEX(campsByItinerary,numericItinerary($A12),BM$3-1),campInfo,8))","v":""},"","Y","","Y","","","","","Y","Y",{"$f":"IF(INDEX(campsByItinerary,numericItinerary($A12),BD$3-1)=\"\",\"\",VLOOKUP(INDEX(campsByItinerary,numericItinerary($A12),BD$3-1),campInfo,10))","v":""},{"$f":"IF(INDEX(campsByItinerary,numericItinerary($A12),BE$3-1)=\"\",\"\",VLOOKUP(INDEX(campsByItinerary,numericItinerary($A12),BE$3-1),campInfo,10))","v":""},{"$f":"IF(INDEX(campsByItinerary,numericItinerary($A12),BF$3-1)=\"\",\"\",VLOOKUP(INDEX(campsByItinerary,numericItinerary($A12),BF$3-1),campInfo,10))","v":""},{"$f":"IF(INDEX(campsByItinerary,numericItinerary($A12),BG$3-1)=\"\",\"\",VLOOKUP(INDEX(campsByItinerary,numericItinerary($A12),BG$3-1),campInfo,10))","v":""},{"$f":"IF(INDEX(campsByItinerary,numericItinerary($A12),BH$3-1)=\"\",\"\",VLOOKUP(INDEX(campsByItinerary,numericItinerary($A12),BH$3-1),campInfo,10))","v":""},{"$f":"IF(INDEX(campsByItinerary,numericItinerary($A12),BI$3-1)=\"\",\"\",VLOOKUP(INDEX(campsByItinerary,numericItinerary($A12),BI$3-1),campInfo,10))","v":""},{"$f":"IF(INDEX(campsByItinerary,numericItinerary($A12),BJ$3-1)=\"\",\"\",VLOOKUP(INDEX(campsByItinerary,numericItinerary($A12),BJ$3-1),campInfo,10))","v":""},{"$f":"IF(INDEX(campsByItinerary,numericItinerary($A12),BK$3-1)=\"\",\"\",VLOOKUP(INDEX(campsByItinerary,numericItinerary($A12),BK$3-1),campInfo,10))","v":""},{"$f":"IF(INDEX(campsByItinerary,numericItinerary($A12),BL$3-1)=\"\",\"\",VLOOKUP(INDEX(campsByItinerary,numericItinerary($A12),BL$3-1),campInfo,10))","v":""},{"$f":"IF(INDEX(campsByItinerary,numericItinerary($A12),BM$3-1)=\"\",\"\",VLOOKUP(INDEX(campsByItinerary,numericItinerary($A12),BM$3-1),campInfo,10))","v":"Y"},null,"","","","","","","","","",{"$f":"INDEX(campsByItinerary,numericItinerary($A12),BD$3-1)","v":"Dean Cow"},{"$f":"IF(INDEX(campsByItinerary,numericItinerary($A12),BE$3-1)=\"\",\"\",VLOOKUP(INDEX(campsByItinerary,numericItinerary($A12),BE$3-1),campInfo,2))","v":"North"},{"$f":"IF(INDEX(campsByItinerary,numericItinerary($A12),BF$3-1)=\"\",\"\",VLOOKUP(INDEX(campsByItinerary,numericItinerary($A12),BF$3-1),campInfo,2))","v":"North"},{"$f":"IF(INDEX(campsByItinerary,numericItinerary($A12),BG$3-1)=\"\",\"\",VLOOKUP(INDEX(campsByItinerary,numericItinerary($A12),BG$3-1),campInfo,2))","v":"North"},{"$f":"IF(INDEX(campsByItinerary,numericItinerary($A12),BH$3-1)=\"\",\"\",VLOOKUP(INDEX(campsByItinerary,numericItinerary($A12),BH$3-1),campInfo,2))","v":"North"},{"$f":"IF(INDEX(campsByItinerary,numericItinerary($A12),BI$3-1)=\"\",\"\",VLOOKUP(INDEX(campsByItinerary,numericItinerary($A12),BI$3-1),campInfo,2))","v":"North"},{"$f":"IF(INDEX(campsByItinerary,numericItinerary($A12),BJ$3-1)=\"\",\"\",VLOOKUP(INDEX(campsByItinerary,numericItinerary($A12),BJ$3-1),campInfo,2))","v":"Central"},{"$f":"IF(INDEX(campsByItinerary,numericItinerary($A12),BK$3-1)=\"\",\"\",VLOOKUP(INDEX(campsByItinerary,numericItinerary($A12),BK$3-1),campInfo,2))","v":"Central"},{"$f":"IF(INDEX(campsByItinerary,numericItinerary($A12),BL$3-1)=\"\",\"\",VLOOKUP(INDEX(campsByItinerary,numericItinerary($A12),BL$3-1),campInfo,2))","v":"Central"},{"$f":"IF(INDEX(campsByItinerary,numericItinerary($A12),BM$3-1)=\"\",\"\",VLOOKUP(INDEX(campsByItinerary,numericItinerary($A12),BM$3-1),campInfo,2))","v":"Central"},{"$f":"IF(INDEX(campsByItinerary,numericItinerary($A12),BD$3-1)=\"\",\"\",VLOOKUP(INDEX(campsByItinerary,numericItinerary($A12),BD$3-1),campInfo,12))","v":"North"},{"$f":"IF(INDEX(campsByItinerary,numericItinerary($A12),BE$3-1)=\"\",\"\",VLOOKUP(INDEX(campsByItinerary,numericItinerary($A12),BE$3-1),campInfo,12))","v":"North"},{"$f":"IF(INDEX(campsByItinerary,numericItinerary($A12),BF$3-1)=\"\",\"\",VLOOKUP(INDEX(campsByItinerary,numericItinerary($A12),BF$3-1),campInfo,12))","v":"North"},{"$f":"IF(INDEX(campsByItinerary,numericItinerary($A12),BG$3-1)=\"\",\"\",VLOOKUP(INDEX(campsByItinerary,numericItinerary($A12),BG$3-1),campInfo,12))","v":"North"},{"$f":"IF(INDEX(campsByItinerary,numericItinerary($A12),BH$3-1)=\"\",\"\",VLOOKUP(INDEX(campsByItinerary,numericItinerary($A12),BH$3-1),campInfo,12))","v":"North"},{"$f":"IF(INDEX(campsByItinerary,numericItinerary($A12),BI$3-1)=\"\",\"\",VLOOKUP(INDEX(campsByItinerary,numericItinerary($A12),BI$3-1),campInfo,12))","v":"North"},{"$f":"IF(INDEX(campsByItinerary,numericItinerary($A12),BJ$3-1)=\"\",\"\",VLOOKUP(INDEX(campsByItinerary,numericItinerary($A12),BJ$3-1),campInfo,12))","v":"North & South"},{"$f":"IF(INDEX(campsByItinerary,numericItinerary($A12),BK$3-1)=\"\",\"\",VLOOKUP(INDEX(campsByItinerary,numericItinerary($A12),BK$3-1),campInfo,12))","v":"South"},{"$f":"IF(INDEX(campsByItinerary,numericItinerary($A12),BL$3-1)=\"\",\"\",VLOOKUP(INDEX(campsByItinerary,numericItinerary($A12),BL$3-1),campInfo,12))","v":"South"},{"$f":"IF(INDEX(campsByItinerary,numericItinerary($A12),BM$3-1)=\"\",\"\",VLOOKUP(INDEX(campsByItinerary,numericItinerary($A12),BM$3-1),campInfo,12))","v":"South"},{"$f":"getfoodPU(\"First\",numericItinerary($A12))","v":2},{"$f":"getfoodPU(\"Max\",numericItinerary($A12))","v":5}]
["12-10",null,"R",53,"Cimarron River","Black Jacks","Elkhorn","Ponil","Metcalf Station","Dan Beard","Pueblano Ruins","Ewells Park","Ewells Park","Miranda","Camping HQ",null,null,"Ponil",null,null,"Rich Cabins",null,null,null,"Ute Park","Maxwell","",2,"Turkey Creek","N",{"$f":"IF(ItineraryPrograms!AD12=\"y\",\"y\",\"\")","v":"y"},{"$f":"IF(ItineraryPrograms!AE12=\"y\",\"y\",\"\")","v":""},{"$f":"IF(ItineraryPrograms!AF12=\"y\",\"y\",\"\")","v":""},"y",{"$f":"checkTooth(AA13,LOWER(ItineraryPrograms!AH12))","v":""},null,7282,8211,8496,7150,7220,7896,8359,9373,9373,8898,929,285,1346,70,676,463,1014,0,475,{"$f":"IF(INDEX(campsByItinerary,numericItinerary($A13),BD$3-1)=\"\",\"\",VLOOKUP(INDEX(campsByItinerary,numericItinerary($A13),BD$3-1),campInfo,8))","v":""},{"$f":"IF(INDEX(campsByItinerary,numericItinerary($A13),BE$3-1)=\"\",\"\",VLOOKUP(INDEX(campsByItinerary,numericItinerary($A13),BE$3-1),campInfo,8))","v":""},{"$f":"IF(INDEX(campsByItinerary,numericItinerary($A13),BF$3-1)=\"\",\"\",VLOOKUP(INDEX(campsByItinerary,numericItinerary($A13),BF$3-1),campInfo,8))","v":""},{"$f":"IF(INDEX(campsByItinerary,numericItinerary($A13),BG$3-1)=\"\",\"\",VLOOKUP(INDEX(campsByItinerary,numericItinerary($A13),BG$3-1),campInfo,8))","v":"Y"},{"$f":"IF(INDEX(campsByItinerary,numericItinerary($A13),BH$3-1)=\"\",\"\",VLOOKUP(INDEX(campsByItinerary,numericItinerary($A13),BH$3-1),campInfo,8))","v":"Y"},{"$f":"IF(INDEX(campsByItinerary,numericItinerary($A13),BI$3-1)=\"\",\"\",VLOOKUP(INDEX(campsByItinerary,numericItinerary($A13),BI$3-1),campInfo,8))","v":"Y"},{"$f":"IF(INDEX(campsByItinerary,numericItinerary($A13),BJ$3-1)=\"\",\"\",VLOOKUP(INDEX(campsByItinerary,numericItinerary($A13),BJ$3-1),campInfo,8))","v":""},{"$f":"IF(INDEX(campsByItinerary,numericItinerary($A13),BK$3-1)=\"\",\"\",VLOOKUP(INDEX(campsByItinerary,numericItinerary($A13),BK$3-1),campInfo,8))","v":""},{"$f":"IF(INDEX(campsByItinerary,numericItinerary($A13),BL$3-1)=\"\",\"\",VLOOKUP(INDEX(campsByItinerary,numericItinerary($A13),BL$3-1),campInfo,8))","v":""},{"$f":"IF(INDEX(campsByItinerary,numericItinerary($A13),BM$3-1)=\"\",\"\",VLOOKUP(INDEX(campsByItinerary,numericItinerary($A13),BM$3-1),campInfo,8))","v":"Y"},"Y","Y","Y","","","","Y","Y","Y","",{"$f":"IF(INDEX(campsByItinerary,numericItinerary($A13),BD$3-1)=\"\",\"\",VLOOKUP(INDEX(campsByItinerary,numericItinerary($A13),BD$3-1),campInfo,10))","v":""},{"$f":"IF(INDEX(campsByItinerary,numericItinerary($A13),BE$3-1)=\"\",\"\",VLOOKUP(INDEX(campsByItinerary,numericItinerary($A13),BE$3-1),campInfo,10))","v":""},{"$f":"IF(INDEX(campsByItinerary,numericItinerary($A13),BF$3-1)=\"\",\"\",VLOOKUP(INDEX(campsByItinerary,numericItinerary($A13),BF$3-1),campInfo,10))","v":""},{"$f":"IF(INDEX(campsByItinerary,numericItinerary($A13),BG$3-1)=\"\",\"\",VLOOKUP(INDEX(campsByItinerary,numericItinerary($A13),BG$3-1),campInfo,10))","v":""},{"$f":"IF(INDEX(campsByItinerary,numericItinerary($A13),BH$3-1)=\"\",\"\",VLOOKUP(INDEX(campsByItinerary,numericItinerary($A13),BH$3-1),campInfo,10))","v":""},{"$f":"IF(INDEX(campsByItinerary,numericItinerary($A13),BI$3-1)=\"\",\"\",VLOOKUP(INDEX(campsByItinerary,numericItinerary($A13),BI$3-1),campInfo,10))","v":""},{"$f":"IF(INDEX(campsByItinerary,numericItinerary($A13),BJ$3-1)=\"\",\"\",VLOOKUP(INDEX(campsByItinerary,numericItinerary($A13),BJ$3-1),campInfo,10))","v":""},{"$f":"IF(INDEX(campsByItinerary,numericItinerary($A13),BK$3-1)=\"\",\"\",VLOOKUP(INDEX(campsByItinerary,numericItinerary($A13),BK$3-1),campInfo,10))","v":""},{"$f":"IF(INDEX(campsByItinerary,numericItinerary($A13),BL$3-1)=\"\",\"\",VLOOKUP(INDEX(campsByItinerary,numericItinerary($A13),BL$3-1),campInfo,10))","v":""},{"$f":"IF(INDEX(campsByItinerary,numericItinerary($A13),BM$3-1)=\"\",\"\",VLOOKUP(INDEX(campsByItinerary,numericItinerary($A13),BM$3-1),campInfo,10))","v":""},null,"","","","","","","","Y","",{"$f":"INDEX(campsByItinerary,numericItinerary($A13),BD$3-1)","v":"Cimarron River"},{"$f":"IF(INDEX(campsByItinerary,numericItinerary($A13),BE$3-1)=\"\",\"\",VLOOKUP(INDEX(campsByItinerary,numericItinerary($A13),BE$3-1),campInfo,2))","v":"North"},{"$f":"IF(INDEX(campsByItinerary,numericItinerary($A13),BF$3-1)=\"\",\"\",VLOOKUP(INDEX(campsByItinerary,numericItinerary($A13),BF$3-1),campInfo,2))","v":"North"},{"$f":"IF(INDEX(campsByItinerary,numericItinerary($A13),BG$3-1)=\"\",\"\",VLOOKUP(INDEX(campsByItinerary,numericItinerary($A13),BG$3-1),campInfo,2))","v":"North"},{"$f":"IF(INDEX(campsByItinerary,numericItinerary($A13),BH$3-1)=\"\",\"\",VLOOKUP(INDEX(campsByItinerary,numericItinerary($A13),BH$3-1),campInfo,2))","v":"North"},{"$f":"IF(INDEX(campsByItinerary,numericItinerary($A13),BI$3-1)=\"\",\"\",VLOOKUP(INDEX(campsByItinerary,numericItinerary($A13),BI$3-1),campInfo,2))","v":"North"},{"$f":"IF(INDEX(campsByItinerary,numericItinerary($A13),BJ$3-1)=\"\",\"\",VLOOKUP(INDEX(campsByItinerary,numericItinerary($A13),BJ$3-1),campInfo,2))","v":"North"},{"$f":"IF(INDEX(campsByItinerary,numericItinerary($A13),BK$3-1)=\"\",\"\",VLOOKUP(INDEX(campsByItinerary,numericItinerary($A13),BK$3-1),campInfo,2))","v":"North"},{"$f":"IF(INDEX(campsByItinerary,numericItinerary($A13),BL$3-1)=\"\",\"\",VLOOKUP(INDEX(campsByItinerary,numericItinerary($A13),BL$3-1),campInfo,2))","v":"North"},{"$f":"IF(INDEX(campsByItinerary,numericItinerary($A13),BM$3-1)=\"\",\"\",VLOOKUP(INDEX(campsByItinerary,numericItinerary($A13),BM$3-1),campInfo,2))","v":"North"},{"$f":"IF(INDEX(campsByItinerary,numericItinerary($A13),BD$3-1)=\"\",\"\",VLOOKUP(INDEX(campsByItinerary,numericItinerary($A13),BD$3-1),campInfo,12))","v":"South"},{"$f":"IF(INDEX(campsByItinerary,numericItinerary($A13),BE$3-1)=\"\",\"\",VLOOKUP(INDEX(campsByItinerary,numericItinerary($A13),BE$3-1),campInfo,12))","v":"North"},{"$f":"IF(INDEX(campsByItinerary,numericItinerary($A13),BF$3-1)=\"\",\"\",VLOOKUP(INDEX(campsByItinerary,numericItinerary($A13),BF$3-1),campInfo,12))","v":"North"},{"$f":"IF(INDEX(campsByItinerary,numericItinerary($A13),BG$3-1)=\"\",\"\",VLOOKUP(INDEX(campsByItinerary,numericItinerary($A13),BG$3-1),campInfo,12))","v":"North"},{"$f":"IF(INDEX(campsByItinerary,numericItinerary($A13),BH$3-1)=\"\",\"\",VLOOKUP(INDEX(campsByItinerary,numericItinerary($A13),BH$3-1),campInfo,12))","v":"North"},{"$f":"IF(INDEX(campsByItinerary,numericItinerary($A13),BI$3-1)=\"\",\"\",VLOOKUP(INDEX(campsByItinerary,numericItinerary($A13),BI$3-1),campInfo,12))","v":"North"},{"$f":"IF(INDEX(campsByItinerary,numericItinerary($A13),BJ$3-1)=\"\",\"\",VLOOKUP(INDEX(campsByItinerary,numericItinerary($A13),BJ$3-1),campInfo,12))","v":"North"},{"$f":"IF(INDEX(campsByItinerary,numericItinerary($A13),BK$3-1)=\"\",\"\",VLOOKUP(INDEX(campsByItinerary,numericItinerary($A13),BK$3-1),campInfo,12))","v":"North"},{"$f":"IF(INDEX(campsByItinerary,numericItinerary($A13),BL$3-1)=\"\",\"\",VLOOKUP(INDEX(campsByItinerary,numericItinerary($A13),BL$3-1),campInfo,12))","v":"North"},{"$f":"IF(INDEX(campsByItinerary,numericItinerary($A13),BM$3-1)=\"\",\"\",VLOOKUP(INDEX(campsByItinerary,numericItinerary($A13),BM$3-1),campInfo,12))","v":"North"},{"$f":"getfoodPU(\"First\",numericItinerary($A13))","v":3},{"$f":"getfoodPU(\"Max\",numericItinerary($A13))","v":3}]
["12-11",null,"R",64,"Abreu","Crater Lake","Beaubien","Beaubien","Bear Creek","Crooked Creek","Divide","Hunting Lodge","Clarks Fork","Tooth Ridge","Camping HQ",null,null,null,"Phillips Junction",null,null,null,"Ute Gulch",null,"Zastrow","Hike In","y",null,null,null,{"$f":"IF(ItineraryPrograms!AD13=\"y\",\"y\",\"\")","v":""},{"$f":"IF(ItineraryPrograms!AE13=\"y\",\"y\",\"\")","v":""},{"$f":"IF(ItineraryPrograms!AF13=\"y\",\"y\",\"\")","v":""},"y",{"$f":"checkTooth(AA14,LOWER(ItineraryPrograms!AH13))","v":"y"},null,7217,8398,9330,9330,9288,9360,10509,7776,7515,8240,1181,932,0,42,72,1149,2733,261,725,{"$f":"IF(INDEX(campsByItinerary,numericItinerary($A14),BD$3-1)=\"\",\"\",VLOOKUP(INDEX(campsByItinerary,numericItinerary($A14),BD$3-1),campInfo,8))","v":"Y"},{"$f":"IF(INDEX(campsByItinerary,numericItinerary($A14),BE$3-1)=\"\",\"\",VLOOKUP(INDEX(campsByItinerary,numericItinerary($A14),BE$3-1),campInfo,8))","v":"Y"},{"$f":"IF(INDEX(campsByItinerary,numericItinerary($A14),BF$3-1)=\"\",\"\",VLOOKUP(INDEX(campsByItinerary,numericItinerary($A14),BF$3-1),campInfo,8))","v":"Y"},{"$f":"IF(INDEX(campsByItinerary,numericItinerary($A14),BG$3-1)=\"\",\"\",VLOOKUP(INDEX(campsByItinerary,numericItinerary($A14),BG$3-1),campInfo,8))","v":"Y"},{"$f":"IF(INDEX(campsByItinerary,numericItinerary($A14),BH$3-1)=\"\",\"\",VLOOKUP(INDEX(campsByItinerary,numericItinerary($A14),BH$3-1),campInfo,8))","v":""},{"$f":"IF(INDEX(campsByItinerary,numericItinerary($A14),BI$3-1)=\"\",\"\",VLOOKUP(INDEX(campsByItinerary,numericItinerary($A14),BI$3-1),campInfo,8))","v":"Y"},{"$f":"IF(INDEX(campsByItinerary,numericItinerary($A14),BJ$3-1)=\"\",\"\",VLOOKUP(INDEX(campsByItinerary,numericItinerary($A14),BJ$3-1),campInfo,8))","v":""},{"$f":"IF(INDEX(campsByItinerary,numericItinerary($A14),BK$3-1)=\"\",\"\",VLOOKUP(INDEX(campsByItinerary,numericItinerary($A14),BK$3-1),campInfo,8))","v":"N"},{"$f":"IF(INDEX(campsByItinerary,numericItinerary($A14),BL$3-1)=\"\",\"\",VLOOKUP(INDEX(campsByItinerary,numericItinerary($A14),BL$3-1),campInfo,8))","v":"Y"},{"$f":"IF(INDEX(campsByItinerary,numericItinerary($A14),BM$3-1)=\"\",\"\",VLOOKUP(INDEX(campsByItinerary,numericItinerary($A14),BM$3-1),campInfo,8))","v":""},"","","","","Y","","Y","Y","","Y",{"$f":"IF(INDEX(campsByItinerary,numericItinerary($A14),BD$3-1)=\"\",\"\",VLOOKUP(INDEX(campsByItinerary,numericItinerary($A14),BD$3-1),campInfo,10))","v":""},{"$f":"IF(INDEX(campsByItinerary,numericItinerary($A14),BE$3-1)=\"\",\"\",VLOOKUP(INDEX(campsByItinerary,numericItinerary($A14),BE$3-1),campInfo,10))","v":""},{"$f":"IF(INDEX(campsByItinerary,numericItinerary($A14),BF$3-1)=\"\",\"\",VLOOKUP(INDEX(campsByItinerary,numericItinerary($A14),BF$3-1),campInfo,10))","v":""},{"$f":"IF(INDEX(campsByItinerary,numericItinerary($A14),BG$3-1)=\"\",\"\",VLOOKUP(INDEX(campsByItinerary,numericItinerary($A14),BG$3-1),campInfo,10))","v":""},{"$f":"IF(INDEX(campsByItinerary,numericItinerary($A14),BH$3-1)=\"\",\"\",VLOOKUP(INDEX(campsByItinerary,numericItinerary($A14),BH$3-1),campInfo,10))","v":""},{"$f":"IF(INDEX(campsByItinerary,numericItinerary($A14),BI$3-1)=\"\",\"\",VLOOKUP(INDEX(campsByItinerary,numericItinerary($A14),BI$3-1),campInfo,10))","v":""},{"$f":"IF(INDEX(campsByItinerary,numericItinerary($A14),BJ$3-1)=\"\",\"\",VLOOKUP(INDEX(campsByItinerary,numericItinerary($A14),BJ$3-1),campInfo,10))","v":"Y"},{"$f":"IF(INDEX(campsByItinerary,numericItinerary($A14),BK$3-1)=\"\",\"\",VLOOKUP(INDEX(campsByItinerary,numericItinerary($A14),BK$3-1),campInfo,10))","v":""},{"$f":"IF(INDEX(campsByItinerary,numericItinerary($A14),BL$3-1)=\"\",\"\",VLOOKUP(INDEX(campsByItinerary,numericItinerary($A14),BL$3-1),campInfo,10))","v":""},{"$f":"IF(INDEX(campsByItinerary,numericItinerary($A14),BM$3-1)=\"\",\"\",VLOOKUP(INDEX(campsByItinerary,numericItinerary($A14),BM$3-1),campInfo,10))","v":"Y"},null,"","","Y","","","","","","",{"$f":"INDEX(campsByItinerary,numericItinerary($A14),BD$3-1)","v":"Abreu"},{"$f":"IF(INDEX(campsByItinerary,numericItinerary($A14),BE$3-1)=\"\",\"\",VLOOKUP(INDEX(campsByItinerary,numericItinerary($A14),BE$3-1),campInfo,2))","v":"South"},{"$f":"IF(INDEX(campsByItinerary,numericItinerary($A14),BF$3-1)=\"\",\"\",VLOOKUP(INDEX(campsByItinerary,numericItinerary($A14),BF$3-1),campInfo,2))","v":"South"},{"$f":"IF(INDEX(campsByItinerary,numericItinerary($A14),BG$3-1)=\"\",\"\",VLOOKUP(INDEX(campsByItinerary,numericItinerary($A14),BG$3-1),campInfo,2))","v":"South"},{"$f":"IF(INDEX(campsByItinerary,numericItinerary($A14),BH$3-1)=\"\",\"\",VLOOKUP(INDEX(campsByItinerary,numericItinerary($A14),BH$3-1),campInfo,2))","v":"South"},{"$f":"IF(INDEX(campsByItinerary,numericItinerary($A14),BI$3-1)=\"\",\"\",VLOOKUP(INDEX(campsByItinerary,numericItinerary($A14),BI$3-1),campInfo,2))","v":"South"},{"$f":"IF(INDEX(campsByItinerary,numericItinerary($A14),BJ$3-1)=\"\",\"\",VLOOKUP(INDEX(campsByItinerary,numericItinerary($A14),BJ$3-1),campInfo,2))","v":"South"},{"$f":"IF(INDEX(campsByItinerary,numericItinerary($A14),BK$3-1)=\"\",\"\",VLOOKUP(INDEX(campsByItinerary,numericItinerary($A14),BK$3-1),campInfo,2))","v":"Central"},{"$f":"IF(INDEX(campsByItinerary,numericItinerary($A14),BL$3-1)=\"\",\"\",VLOOKUP(INDEX(campsByItinerary,numericItinerary($A14),BL$3-1),campInfo,2))","v":"Central"},{"$f":"IF(INDEX(campsByItinerary,numericItinerary($A14),BM$3-1)=\"\",\"\",VLOOKUP(INDEX(campsByItinerary,numericItinerary($A14),BM$3-1),campInfo,2))","v":"Central"},{"$f":"IF(INDEX(campsByItinerary,numericItinerary($A14),BD$3-1)=\"\",\"\",VLOOKUP(INDEX(campsByItinerary,numericItinerary($A14),BD$3-1),campInfo,12))","v":"South"},{"$f":"IF(INDEX(campsByItinerary,numericItinerary($A14),BE$3-1)=\"\",\"\",VLOOKUP(INDEX(campsByItinerary,numericItinerary($A14),BE$3-1),campInfo,12))","v":"South"},{"$f":"IF(INDEX(campsByItinerary,numericItinerary($A14),BF$3-1)=\"\",\"\",VLOOKUP(INDEX(campsByItinerary,numericItinerary($A14),BF$3-1),campInfo,12))","v":"South"},{"$f":"IF(INDEX(campsByItinerary,numericItinerary($A14),BG$3-1)=\"\",\"\",VLOOKUP(INDEX(campsByItinerary,numericItinerary($A14),BG$3-1),campInfo,12))","v":"South"},{"$f":"IF(INDEX(campsByItinerary,numericItinerary($A14),BH$3-1)=\"\",\"\",VLOOKUP(INDEX(campsByItinerary,numericItinerary($A14),BH$3-1),campInfo,12))","v":"South"},{"$f":"IF(INDEX(campsByItinerary,numericItinerary($A14),BI$3-1)=\"\",\"\",VLOOKUP(INDEX(campsByItinerary,numericItinerary($A14),BI$3-1),campInfo,12))","v":"South"},{"$f":"IF(INDEX(campsByItinerary,numericItinerary($A14),BJ$3-1)=\"\",\"\",VLOOKUP(INDEX(campsByItinerary,numericItinerary($A14),BJ$3-1),campInfo,12))","v":"South"},{"$f":"IF(INDEX(campsByItinerary,numericItinerary($A14),BK$3-1)=\"\",\"\",VLOOKUP(INDEX(campsByItinerary,numericItinerary($A14),BK$3-1),campInfo,12))","v":"South"},{"$f":"IF(INDEX(campsByItinerary,numericItinerary($A14),BL$3-1)=\"\",\"\",VLOOKUP(INDEX(campsByItinerary,numericItinerary($A14),BL$3-1),campInfo,12))","v":"South"},{"$f":"IF(INDEX(campsByItinerary,numericItinerary($A14),BM$3-1)=\"\",\"\",VLOOKUP(INDEX(campsByItinerary,numericItinerary($A14),BM$3-1),campInfo,12))","v":"South"},{"$f":"getfoodPU(\"First\",numericItinerary($A14))","v":4},{"$f":"getfoodPU(\"Max\",numericItinerary($A14))","v":4}]
["12-12",null,"R",61,"Rimrock Park","Carson Meadows","Fish Camp","Crooked Creek","Comanche Peak","Beaubien","Beaubien","Bear Caves","Miners Park","Shaefers Pass","Camping HQ",null,null,"Phillips Junction",null,null,"Phillips Junction",null,"Miners Park",null,"Zastrow","Hike In","y",null,null,null,{"$f":"IF(ItineraryPrograms!AD14=\"y\",\"y\",\"\")","v":""},{"$f":"IF(ItineraryPrograms!AE14=\"y\",\"y\",\"\")","v":""},{"$f":"IF(ItineraryPrograms!AF14=\"y\",\"y\",\"\")","v":"y"},"y",{"$f":"checkTooth(AA15,LOWER(ItineraryPrograms!AH14))","v":"y"},"y",7359,7758,8564,9360,11070,9330,9330,8423,7977,8724,399,806,796,1710,1740,0,907,446,747,{"$f":"IF(INDEX(campsByItinerary,numericItinerary($A15),BD$3-1)=\"\",\"\",VLOOKUP(INDEX(campsByItinerary,numericItinerary($A15),BD$3-1),campInfo,8))","v":""},{"$f":"IF(INDEX(campsByItinerary,numericItinerary($A15),BE$3-1)=\"\",\"\",VLOOKUP(INDEX(campsByItinerary,numericItinerary($A15),BE$3-1),campInfo,8))","v":"N"},{"$f":"IF(INDEX(campsByItinerary,numericItinerary($A15),BF$3-1)=\"\",\"\",VLOOKUP(INDEX(campsByItinerary,numericItinerary($A15),BF$3-1),campInfo,8))","v":"N"},{"$f":"IF(INDEX(campsByItinerary,numericItinerary($A15),BG$3-1)=\"\",\"\",VLOOKUP(INDEX(campsByItinerary,numericItinerary($A15),BG$3-1),campInfo,8))","v":"Y"},{"$f":"IF(INDEX(campsByItinerary,numericItinerary($A15),BH$3-1)=\"\",\"\",VLOOKUP(INDEX(campsByItinerary,numericItinerary($A15),BH$3-1),campInfo,8))","v":""},{"$f":"IF(INDEX(campsByItinerary,numericItinerary($A15),BI$3-1)=\"\",\"\",VLOOKUP(INDEX(campsByItinerary,numericItinerary($A15),BI$3-1),campInfo,8))","v":"Y"},{"$f":"IF(INDEX(campsByItinerary,numericItinerary($A15),BJ$3-1)=\"\",\"\",VLOOKUP(INDEX(campsByItinerary,numericItinerary($A15),BJ$3-1),campInfo,8))","v":"Y"},{"$f":"IF(INDEX(campsByItinerary,numericItinerary($A15),BK$3-1)=\"\",\"\",VLOOKUP(INDEX(campsByItinerary,numericItinerary($A15),BK$3-1),campInfo,8))","v":""},{"$f":"IF(INDEX(campsByItinerary,numericItinerary($A15),BL$3-1)=\"\",\"\",VLOOKUP(INDEX(campsByItinerary,numericItinerary($A15),BL$3-1),campInfo,8))","v":"Y"},{"$f":"IF(INDEX(campsByItinerary,numericItinerary($A15),BM$3-1)=\"\",\"\",VLOOKUP(INDEX(campsByItinerary,numericItinerary($A15),BM$3-1),campInfo,8))","v":""},"Y","Y","Y","","Y","","","Y","","Y",{"$f":"IF(INDEX(campsByItinerary,numericItinerary($A15),BD$3-1)=\"\",\"\",VLOOKUP(INDEX(campsByItinerary,numericItinerary($A15),BD$3-1),campInfo,10))","v":"Y"},{"$f":"IF(INDEX(campsByItinerary,numericItinerary($A15),BE$3-1)=\"\",\"\",VLOOKUP(INDEX(campsByItinerary,numericItinerary($A15),BE$3-1),campInfo,10))","v":""},{"$f":"IF(INDEX(campsByItinerary,numericItinerary($A15),BF$3-1)=\"\",\"\",VLOOKUP(INDEX(campsByItinerary,numericItinerary($A15),BF$3-1),campInfo,10))","v":""},{"$f":"IF(INDEX(campsByItinerary,numericItinerary($A15),BG$3-1)=\"\",\"\",VLOOKUP(INDEX(campsByItinerary,numericItinerary($A15),BG$3-1),campInfo,10))","v":""},{"$f":"IF(INDEX(campsByItinerary,numericItinerary($A15),BH$3-1)=\"\",\"\",VLOOKUP(INDEX(campsByItinerary,numericItinerary($A15),BH$3-1),campInfo,10))","v":"Y"},{"$f":"IF(INDEX(campsByItinerary,numericItinerary($A15),BI$3-1)=\"\",\"\",VLOOKUP(INDEX(campsByItinerary,numericItinerary($A15),BI$3-1),campInfo,10))","v":""},{"$f":"IF(INDEX(campsByItinerary,numericItinerary($A15),BJ$3-1)=\"\",\"\",VLOOKUP(INDEX(campsByItinerary,numericItinerary($A15),BJ$3-1),campInfo,10))","v":""},{"$f":"IF(INDEX(campsByItinerary,numericItinerary($A15),BK$3-1)=\"\",\"\",VLOOKUP(INDEX(campsByItinerary,numericItinerary($A15),BK$3-1),campInfo,10))","v":""},{"$f":"IF(INDEX(campsByItinerary,numericItinerary($A15),BL$3-1)=\"\",\"\",VLOOKUP(INDEX(campsByItinerary,numericItinerary($A15),BL$3-1),campInfo,10))","v":""},{"$f":"IF(INDEX(campsByItinerary,numericItinerary($A15),BM$3-1)=\"\",\"\",VLOOKUP(INDEX(campsByItinerary,numericItinerary($A15),BM$3-1),campInfo,10))","v":"Y"},null,"","","","","","Y","","","",{"$f":"INDEX(campsByItinerary,numericItinerary($A15),BD$3-1)","v":"Rimrock Park"},{"$f":"IF(INDEX(campsByItinerary,numericItinerary($A15),BE$3-1)=\"\",\"\",VLOOKUP(INDEX(campsByItinerary,numericItinerary($A15),BE$3-1),campInfo,2))","v":"South"},{"$f":"IF(INDEX(campsByItinerary,numericItinerary($A15),BF$3-1)=\"\",\"\",VLOOKUP(INDEX(campsByItinerary,numericItinerary($A15),BF$3-1),campInfo,2))","v":"South"},{"$f":"IF(INDEX(campsByItinerary,numericItinerary($A15),BG$3-1)=\"\",\"\",VLOOKUP(INDEX(campsByItinerary,numericItinerary($A15),BG$3-1),campInfo,2))","v":"South"},{"$f":"IF(INDEX(campsByItinerary,numericItinerary($A15),BH$3-1)=\"\",\"\",VLOOKUP(INDEX(campsByItinerary,numericItinerary($A15),BH$3-1),campInfo,2))","v":"Central"},{"$f":"IF(INDEX(campsByItinerary,numericItinerary($A15),BI$3-1)=\"\",\"\",VLOOKUP(INDEX(campsByItinerary,numericItinerary($A15),BI$3-1),campInfo,2))","v":"South"},{"$f":"IF(INDEX(campsByItinerary,numericItinerary($A15),BJ$3-1)=\"\",\"\",VLOOKUP(INDEX(campsByItinerary,numericItinerary($A15),BJ$3-1),campInfo,2))","v":"South"},{"$f":"IF(INDEX(campsByItinerary,numericItinerary($A15),BK$3-1)=\"\",\"\",VLOOKUP(INDEX(campsByItinerary,numericItinerary($A15),BK$3-1),campInfo,2))","v":"South"},{"$f":"IF(INDEX(campsByItinerary,numericItinerary($A15),BL$3-1)=\"\",\"\",VLOOKUP(INDEX(campsByItinerary,numericItinerary($A15),BL$3-1),campInfo,2))","v":"South"},{"$f":"IF(INDEX(campsByItinerary,numericItinerary($A15),BM$3-1)=\"\",\"\",VLOOKUP(INDEX(campsByItinerary,numericItinerary($A15),BM$3-1),campInfo,2))","v":"Central"},{"$f":"IF(INDEX(campsByItinerary,numericItinerary($A15),BD$3-1)=\"\",\"\",VLOOKUP(INDEX(campsByItinerary,numericItinerary($A15),BD$3-1),campInfo,12))","v":"South"},{"$f":"IF(INDEX(campsByItinerary,numericItinerary($A15),BE$3-1)=\"\",\"\",VLOOKUP(INDEX(campsByItinerary,numericItinerary($A15),BE$3-1),campInfo,12))","v":"South"},{"$f":"IF(INDEX(campsByItinerary,numericItinerary($A15),BF$3-1)=\"\",\"\",VLOOKUP(INDEX(campsByItinerary,numericItinerary($A15),BF$3-1),campInfo,12))","v":"South"},{"$f":"IF(INDEX(campsByItinerary,numericItinerary($A15),BG$3-1)=\"\",\"\",VLOOKUP(INDEX(campsByItinerary,numericItinerary($A15),BG$3-1),campInfo,12))","v":"South"},{"$f":"IF(INDEX(campsByItinerary,numericItinerary($A15),BH$3-1)=\"\",\"\",VLOOKUP(INDEX(campsByItinerary,numericItinerary($A15),BH$3-1),campInfo,12))","v":"South"},{"$f":"IF(INDEX(campsByItinerary,numericItinerary($A15),BI$3-1)=\"\",\"\",VLOOKUP(INDEX(campsByItinerary,numericItinerary($A15),BI$3-1),campInfo,12))","v":"South"},{"$f":"IF(INDEX(campsByItinerary,numericItinerary($A15),BJ$3-1)=\"\",\"\",VLOOKUP(INDEX(campsByItinerary,numericItinerary($A15),BJ$3-1),campInfo,12))","v":"South"},{"$f":"IF(INDEX(campsByItinerary,numericItinerary($A15),BK$3-1)=\"\",\"\",VLOOKUP(INDEX(campsByItinerary,numericItinerary($A15),BK$3-1),campInfo,12))","v":"South"},{"$f":"IF(INDEX(campsByItinerary,numericItinerary($A15),BL$3-1)=\"\",\"\",VLOOKUP(INDEX(campsByItinerary,numericItinerary($A15),BL$3-1),campInfo,12))","v":"South"},{"$f":"IF(INDEX(campsByItinerary,numericItinerary($A15),BM$3-1)=\"\",\"\",VLOOKUP(INDEX(campsByItinerary,numericItinerary($A15),BM$3-1),campInfo,12))","v":"South"},{"$f":"getfoodPU(\"First\",numericItinerary($A15))","v":3},{"$f":"getfoodPU(\"Max\",numericItinerary($A15))","v":3}]
["12-13","COPE & Climbing","R",59,"Toothache Springs","Magpie","Miners Park","Black Mountain","Divide","Lamberts Mine","Cimarroncito","Cimarroncito","Clarks Fork","Tooth Ridge","Camping HQ",null,"Miners Park",null,null,null,null,"Ute Gulch",null,null,"Zastrow","Hike In","y",null,null,null,{"$f":"IF(ItineraryPrograms!AD15=\"y\",\"y\",\"\")","v":""},{"$f":"IF(ItineraryPrograms!AE15=\"y\",\"y\",\"\")","v":""},{"$f":"IF(ItineraryPrograms!AF15=\"y\",\"y\",\"\")","v":"y"},"y",{"$f":"checkTooth(AA16,LOWER(ItineraryPrograms!AH15))","v":"y"},null,7870,7385,7977,8991,10509,8957,8137,8137,7515,8240,485,592,1014,1518,1552,820,0,622,725,{"$f":"IF(INDEX(campsByItinerary,numericItinerary($A16),BD$3-1)=\"\",\"\",VLOOKUP(INDEX(campsByItinerary,numericItinerary($A16),BD$3-1),campInfo,8))","v":""},{"$f":"IF(INDEX(campsByItinerary,numericItinerary($A16),BE$3-1)=\"\",\"\",VLOOKUP(INDEX(campsByItinerary,numericItinerary($A16),BE$3-1),campInfo,8))","v":""},{"$f":"IF(INDEX(campsByItinerary,numericItinerary($A16),BF$3-1)=\"\",\"\",VLOOKUP(INDEX(campsByItinerary,numericItinerary($A16),BF$3-1),campInfo,8))","v":"Y"},{"$f":"IF(INDEX(campsByItinerary,numericItinerary($A16),BG$3-1)=\"\",\"\",VLOOKUP(INDEX(campsByItinerary,numericItinerary($A16),BG$3-1),campInfo,8))","v":"Y"},{"$f":"IF(INDEX(campsByItinerary,numericItinerary($A16),BH$3-1)=\"\",\"\",VLOOKUP(INDEX(campsByItinerary,numericItinerary($A16),BH$3-1),campInfo,8))","v":""},{"$f":"IF(INDEX(campsByItinerary,numericItinerary($A16),BI$3-1)=\"\",\"\",VLOOKUP(INDEX(campsByItinerary,numericItinerary($A16),BI$3-1),campInfo,8))","v":""},{"$f":"IF(INDEX(campsByItinerary,numericItinerary($A16),BJ$3-1)=\"\",\"\",VLOOKUP(INDEX(campsByItinerary,numericItinerary($A16),BJ$3-1),campInfo,8))","v":"Y"},{"$f":"IF(INDEX(campsByItinerary,numericItinerary($A16),BK$3-1)=\"\",\"\",VLOOKUP(INDEX(campsByItinerary,numericItinerary($A16),BK$3-1),campInfo,8))","v":"Y"},{"$f":"IF(INDEX(campsByItinerary,numericItinerary($A16),BL$3-1)=\"\",\"\",VLOOKUP(INDEX(campsByItinerary,numericItinerary($A16),BL$3-1),campInfo,8))","v":"Y"},{"$f":"IF(INDEX(campsByItinerary,numericItinerary($A16),BM$3-1)=\"\",\"\",VLOOKUP(INDEX(campsByItinerary,numericItinerary($A16),BM$3-1),campInfo,8))","v":""},"Y","Y","","","Y","Y","","","","Y",{"$f":"IF(INDEX(campsByItinerary,numericItinerary($A16),BD$3-1)=\"\",\"\",VLOOKUP(INDEX(campsByItinerary,numericItinerary($A16),BD$3-1),campInfo,10))","v":""},{"$f":"IF(INDEX(campsByItinerary,numericItinerary($A16),BE$3-1)=\"\",\"\",VLOOKUP(INDEX(campsByItinerary,numericItinerary($A16),BE$3-1),campInfo,10))","v":"Y"},{"$f":"IF(INDEX(campsByItinerary,numericItinerary($A16),BF$3-1)=\"\",\"\",VLOOKUP(INDEX(campsByItinerary,numericItinerary($A16),BF$3-1),campInfo,10))","v":""},{"$f":"IF(INDEX(campsByItinerary,numericItinerary($A16),BG$3-1)=\"\",\"\",VLOOKUP(INDEX(campsByItinerary,numericItinerary($A16),BG$3-1),campInfo,10))","v":""},{"$f":"IF(INDEX(campsByItinerary,numericItinerary($A16),BH$3-1)=\"\",\"\",VLOOKUP(INDEX(campsByItinerary,numericItinerary($A16),BH$3-1),campInfo,10))","v":"Y"},{"$f":"IF(INDEX(campsByItinerary,numericItinerary($A16),BI$3-1)=\"\",\"\",VLOOKUP(INDEX(campsByItinerary,numericItinerary($A16),BI$3-1),campInfo,10))","v":""},{"$f":"IF(INDEX(campsByItinerary,numericItinerary($A16),BJ$3-1)=\"\",\"\",VLOOKUP(INDEX(campsByItinerary,numericItinerary($A16),BJ$3-1),campInfo,10))","v":""},{"$f":"IF(INDEX(campsByItinerary,numericItinerary($A16),BK$3-1)=\"\",\"\",VLOOKUP(INDEX(campsByItinerary,numericItinerary($A16),BK$3-1),campInfo,10))","v":""},{"$f":"IF(INDEX(campsByItinerary,numericItinerary($A16),BL$3-1)=\"\",\"\",VLOOKUP(INDEX(campsByItinerary,numericItinerary($A16),BL$3-1),campInfo,10))","v":""},{"$f":"IF(INDEX(campsByItinerary,numericItinerary($A16),BM$3-1)=\"\",\"\",VLOOKUP(INDEX(campsByItinerary,numericItinerary($A16),BM$3-1),campInfo,10))","v":"Y"},null,"","","","","","","Y","","",{"$f":"INDEX(campsByItinerary,numericItinerary($A16),BD$3-1)","v":"Toothache Springs"},{"$f":"IF(INDEX(campsByItinerary,numericItinerary($A16),BE$3-1)=\"\",\"\",VLOOKUP(INDEX(campsByItinerary,numericItinerary($A16),BE$3-1),campInfo,2))","v":"South"},{"$f":"IF(INDEX(campsByItinerary,numericItinerary($A16),BF$3-1)=\"\",\"\",VLOOKUP(INDEX(campsByItinerary,numericItinerary($A16),BF$3-1),campInfo,2))","v":"South"},{"$f":"IF(INDEX(campsByItinerary,numericItinerary($A16),BG$3-1)=\"\",\"\",VLOOKUP(INDEX(campsByItinerary,numericItinerary($A16),BG$3-1),campInfo,2))","v":"South"},{"$f":"IF(INDEX(campsByItinerary,numericItinerary($A16),BH$3-1)=\"\",\"\",VLOOKUP(INDEX(campsByItinerary,numericItinerary($A16),BH$3-1),campInfo,2))","v":"South"},{"$f":"IF(INDEX(campsByItinerary,numericItinerary($A16),BI$3-1)=\"\",\"\",VLOOKUP(INDEX(campsByItinerary,numericItinerary($A16),BI$3-1),campInfo,2))","v":"Central"},{"$f":"IF(INDEX(campsByItinerary,numericItinerary($A16),BJ$3-1)=\"\",\"\",VLOOKUP(INDEX(campsByItinerary,numericItinerary($A16),BJ$3-1),campInfo,2))","v":"Central"},{"$f":"IF(INDEX(campsByItinerary,numericItinerary($A16),BK$3-1)=\"\",\"\",VLOOKUP(INDEX(campsByItinerary,numericItinerary($A16),BK$3-1),campInfo,2))","v":"Central"},{"$f":"IF(INDEX(campsByItinerary,numericItinerary($A16),BL$3-1)=\"\",\"\",VLOOKUP(INDEX(campsByItinerary,numericItinerary($A16),BL$3-1),campInfo,2))","v":"Central"},{"$f":"IF(INDEX(campsByItinerary,numericItinerary($A16),BM$3-1)=\"\",\"\",VLOOKUP(INDEX(campsByItinerary,numericItinerary($A16),BM$3-1),campInfo,2))","v":"Central"},{"$f":"IF(INDEX(campsByItinerary,numericItinerary($A16),BD$3-1)=\"\",\"\",VLOOKUP(INDEX(campsByItinerary,numericItinerary($A16),BD$3-1),campInfo,12))","v":"South"},{"$f":"IF(INDEX(campsByItinerary,numericItinerary($A16),BE$3-1)=\"\",\"\",VLOOKUP(INDEX(campsByItinerary,numericItinerary($A16),BE$3-1),campInfo,12))","v":"South"},{"$f":"IF(INDEX(campsByItinerary,numericItinerary($A16),BF$3-1)=\"\",\"\",VLOOKUP(INDEX(campsByItinerary,numericItinerary($A16),BF$3-1),campInfo,12))","v":"South"},{"$f":"IF(INDEX(campsByItinerary,numericItinerary($A16),BG$3-1)=\"\",\"\",VLOOKUP(INDEX(campsByItinerary,numericItinerary($A16),BG$3-1),campInfo,12))","v":"South"},{"$f":"IF(INDEX(campsByItinerary,numericItinerary($A16),BH$3-1)=\"\",\"\",VLOOKUP(INDEX(campsByItinerary,numericItinerary($A16),BH$3-1),campInfo,12))","v":"South"},{"$f":"IF(INDEX(campsByItinerary,numericItinerary($A16),BI$3-1)=\"\",\"\",VLOOKUP(INDEX(campsByItinerary,numericItinerary($A16),BI$3-1),campInfo,12))","v":"South"},{"$f":"IF(INDEX(campsByItinerary,numericItinerary($A16),BJ$3-1)=\"\",\"\",VLOOKUP(INDEX(campsByItinerary,numericItinerary($A16),BJ$3-1),campInfo,12))","v":"South"},{"$f":"IF(INDEX(campsByItinerary,numericItinerary($A16),BK$3-1)=\"\",\"\",VLOOKUP(INDEX(campsByItinerary,numericItinerary($A16),BK$3-1),campInfo,12))","v":"South"},{"$f":"IF(INDEX(campsByItinerary,numericItinerary($A16),BL$3-1)=\"\",\"\",VLOOKUP(INDEX(campsByItinerary,numericItinerary($A16),BL$3-1),campInfo,12))","v":"South"},{"$f":"IF(INDEX(campsByItinerary,numericItinerary($A16),BM$3-1)=\"\",\"\",VLOOKUP(INDEX(campsByItinerary,numericItinerary($A16),BM$3-1),campInfo,12))","v":"South"},{"$f":"getfoodPU(\"First\",numericItinerary($A16))","v":2},{"$f":"getfoodPU(\"Max\",numericItinerary($A16))","v":5}]
["12-14",null,"S",78,"Sioux","Dan Beard","Ring Place","Whiteman Vega","Iris Park","Rich Cabins","Dean Skyline","Dean Cow","Harlan","Hunting Lodge","Camping HQ",null,"Ring Place",null,null,"Rich Cabins",null,null,null,"Ute Gulch","Ponil","Webster","",10,"Turkey Creek","S",{"$f":"IF(ItineraryPrograms!AD16=\"y\",\"y\",\"\")","v":""},{"$f":"IF(ItineraryPrograms!AE16=\"y\",\"y\",\"\")","v":""},{"$f":"IF(ItineraryPrograms!AF16=\"y\",\"y\",\"\")","v":""},null,{"$f":"checkTooth(AA17,LOWER(ItineraryPrograms!AH16))","v":""},null,7382,7896,8124,8061,8571,7728,7967,7232,7550,7776,514,228,63,510,843,239,735,318,226,{"$f":"IF(INDEX(campsByItinerary,numericItinerary($A17),BD$3-1)=\"\",\"\",VLOOKUP(INDEX(campsByItinerary,numericItinerary($A17),BD$3-1),campInfo,8))","v":""},{"$f":"IF(INDEX(campsByItinerary,numericItinerary($A17),BE$3-1)=\"\",\"\",VLOOKUP(INDEX(campsByItinerary,numericItinerary($A17),BE$3-1),campInfo,8))","v":"Y"},{"$f":"IF(INDEX(campsByItinerary,numericItinerary($A17),BF$3-1)=\"\",\"\",VLOOKUP(INDEX(campsByItinerary,numericItinerary($A17),BF$3-1),campInfo,8))","v":"Y"},{"$f":"IF(INDEX(campsByItinerary,numericItinerary($A17),BG$3-1)=\"\",\"\",VLOOKUP(INDEX(campsByItinerary,numericItinerary($A17),BG$3-1),campInfo,8))","v":"Y"},{"$f":"IF(INDEX(campsByItinerary,numericItinerary($A17),BH$3-1)=\"\",\"\",VLOOKUP(INDEX(campsByItinerary,numericItinerary($A17),BH$3-1),campInfo,8))","v":""},{"$f":"IF(INDEX(campsByItinerary,numericItinerary($A17),BI$3-1)=\"\",\"\",VLOOKUP(INDEX(campsByItinerary,numericItinerary($A17),BI$3-1),campInfo,8))","v":"Y"},{"$f":"IF(INDEX(campsByItinerary,numericItinerary($A17),BJ$3-1)=\"\",\"\",VLOOKUP(INDEX(campsByItinerary,numericItinerary($A17),BJ$3-1),campInfo,8))","v":""},{"$f":"IF(INDEX(campsByItinerary,numericItinerary($A17),BK$3-1)=\"\",\"\",VLOOKUP(INDEX(campsByItinerary,numericItinerary($A17),BK$3-1),campInfo,8))","v":"Y"},{"$f":"IF(INDEX(campsByItinerary,numericItinerary($A17),BL$3-1)=\"\",\"\",VLOOKUP(INDEX(campsByItinerary,numericItinerary($A17),BL$3-1),campInfo,8))","v":"Y"},{"$f":"IF(INDEX(campsByItinerary,numericItinerary($A17),BM$3-1)=\"\",\"\",VLOOKUP(INDEX(campsByItinerary,numericItinerary($A17),BM$3-1),campInfo,8))","v":"N"},"Y","","","","Y","","Y","","","Y",{"$f":"IF(INDEX(campsByItinerary,numericItinerary($A17),BD$3-1)=\"\",\"\",VLOOKUP(INDEX(campsByItinerary,numericItinerary($A17),BD$3-1),campInfo,10))","v":""},{"$f":"IF(INDEX(campsByItinerary,numericItinerary($A17),BE$3-1)=\"\",\"\",VLOOKUP(INDEX(campsByItinerary,numericItinerary($A17),BE$3-1),campInfo,10))","v":""},{"$f":"IF(INDEX(campsByItinerary,numericItinerary($A17),BF$3-1)=\"\",\"\",VLOOKUP(INDEX(campsByItinerary,numericItinerary($A17),BF$3-1),campInfo,10))","v":""},{"$f":"IF(INDEX(campsByItinerary,numericItinerary($A17),BG$3-1)=\"\",\"\",VLOOKUP(INDEX(campsByItinerary,numericItinerary($A17),BG$3-1),campInfo,10))","v":""},{"$f":"IF(INDEX(campsByItinerary,numericItinerary($A17),BH$3-1)=\"\",\"\",VLOOKUP(INDEX(campsByItinerary,numericItinerary($A17),BH$3-1),campInfo,10))","v":""},{"$f":"IF(INDEX(campsByItinerary,numericItinerary($A17),BI$3-1)=\"\",\"\",VLOOKUP(INDEX(campsByItinerary,numericItinerary($A17),BI$3-1),campInfo,10))","v":""},{"$f":"IF(INDEX(campsByItinerary,numericItinerary($A17),BJ$3-1)=\"\",\"\",VLOOKUP(INDEX(campsByItinerary,numericItinerary($A17),BJ$3-1),campInfo,10))","v":"Y"},{"$f":"IF(INDEX(campsByItinerary,numericItinerary($A17),BK$3-1)=\"\",\"\",VLOOKUP(INDEX(campsByItinerary,numericItinerary($A17),BK$3-1),campInfo,10))","v":""},{"$f":"IF(INDEX(campsByItinerary,numericItinerary($A17),BL$3-1)=\"\",\"\",VLOOKUP(INDEX(campsByItinerary,numericItinerary($A17),BL$3-1),campInfo,10))","v":""},{"$f":"IF(INDEX(campsByItinerary,numericItinerary($A17),BM$3-1)=\"\",\"\",VLOOKUP(INDEX(campsByItinerary,numericItinerary($A17),BM$3-1),campInfo,10))","v":""},null,"","","","","","","","","",{"$f":"INDEX(campsByItinerary,numericItinerary($A17),BD$3-1)","v":"Sioux"},{"$f":"IF(INDEX(campsByItinerary,numericItinerary($A17),BE$3-1)=\"\",\"\",VLOOKUP(INDEX(campsByItinerary,numericItinerary($A17),BE$3-1),campInfo,2))","v":"North"},{"$f":"IF(INDEX(campsByItinerary,numericItinerary($A17),BF$3-1)=\"\",\"\",VLOOKUP(INDEX(campsByItinerary,numericItinerary($A17),BF$3-1),campInfo,2))","v":"Valle Vidal"},{"$f":"IF(INDEX(campsByItinerary,numericItinerary($A17),BG$3-1)=\"\",\"\",VLOOKUP(INDEX(campsByItinerary,numericItinerary($A17),BG$3-1),campInfo,2))","v":"Valle Vidal"},{"$f":"IF(INDEX(campsByItinerary,numericItinerary($A17),BH$3-1)=\"\",\"\",VLOOKUP(INDEX(campsByItinerary,numericItinerary($A17),BH$3-1),campInfo,2))","v":"Valle Vidal"},{"$f":"IF(INDEX(campsByItinerary,numericItinerary($A17),BI$3-1)=\"\",\"\",VLOOKUP(INDEX(campsByItinerary,numericItinerary($A17),BI$3-1),campInfo,2))","v":"Valle Vidal"},{"$f":"IF(INDEX(campsByItinerary,numericItinerary($A17),BJ$3-1)=\"\",\"\",VLOOKUP(INDEX(campsByItinerary,numericItinerary($A17),BJ$3-1),campInfo,2))","v":"North"},{"$f":"IF(INDEX(campsByItinerary,numericItinerary($A17),BK$3-1)=\"\",\"\",VLOOKUP(INDEX(campsByItinerary,numericItinerary($A17),BK$3-1),campInfo,2))","v":"North"},{"$f":"IF(INDEX(campsByItinerary,numericItinerary($A17),BL$3-1)=\"\",\"\",VLOOKUP(INDEX(campsByItinerary,numericItinerary($A17),BL$3-1),campInfo,2))","v":"Central"},{"$f":"IF(INDEX(campsByItinerary,numericItinerary($A17),BM$3-1)=\"\",\"\",VLOOKUP(INDEX(campsByItinerary,numericItinerary($A17),BM$3-1),campInfo,2))","v":"Central"},{"$f":"IF(INDEX(campsByItinerary,numericItinerary($A17),BD$3-1)=\"\",\"\",VLOOKUP(INDEX(campsByItinerary,numericItinerary($A17),BD$3-1),campInfo,12))","v":"North"},{"$f":"IF(INDEX(campsByItinerary,numericItinerary($A17),BE$3-1)=\"\",\"\",VLOOKUP(INDEX(campsByItinerary,numericItinerary($A17),BE$3-1),campInfo,12))","v":"North"},{"$f":"IF(INDEX(campsByItinerary,numericItinerary($A17),BF$3-1)=\"\",\"\",VLOOKUP(INDEX(campsByItinerary,numericItinerary($A17),BF$3-1),campInfo,12))","v":"North"},{"$f":"IF(INDEX(campsByItinerary,numericItinerary($A17),BG$3-1)=\"\",\"\",VLOOKUP(INDEX(campsByItinerary,numericItinerary($A17),BG$3-1),campInfo,12))","v":"North"},{"$f":"IF(INDEX(campsByItinerary,numericItinerary($A17),BH$3-1)=\"\",\"\",VLOOKUP(INDEX(campsByItinerary,numericItinerary($A17),BH$3-1),campInfo,12))","v":"North"},{"$f":"IF(INDEX(campsByItinerary,numericItinerary($A17),BI$3-1)=\"\",\"\",VLOOKUP(INDEX(campsByItinerary,numericItinerary($A17),BI$3-1),campInfo,12))","v":"North"},{"$f":"IF(INDEX(campsByItinerary,numericItinerary($A17),BJ$3-1)=\"\",\"\",VLOOKUP(INDEX(campsByItinerary,numericItinerary($A17),BJ$3-1),campInfo,12))","v":"North"},{"$f":"IF(INDEX(campsByItinerary,numericItinerary($A17),BK$3-1)=\"\",\"\",VLOOKUP(INDEX(campsByItinerary,numericItinerary($A17),BK$3-1),campInfo,12))","v":"North"},{"$f":"IF(INDEX(campsByItinerary,numericItinerary($A17),BL$3-1)=\"\",\"\",VLOOKUP(INDEX(campsByItinerary,numericItinerary($A17),BL$3-1),campInfo,12))","v":"South"},{"$f":"IF(INDEX(campsByItinerary,numericItinerary($A17),BM$3-1)=\"\",\"\",VLOOKUP(INDEX(campsByItinerary,numericItinerary($A17),BM$3-1),campInfo,12))","v":"South"},{"$f":"getfoodPU(\"First\",numericItinerary($A17))","v":2},{"$f":"getfoodPU(\"Max\",numericItinerary($A17))","v":4}]
["12-15",null,"S",63,"Lovers Leap","Miners Park","Beaubien","Beaubien","Comanche Creek","Comanche Peak","Sawmill","Cyphers Mine","Cimarroncito","Shaefers Pass","Camping HQ","Miners Park",null,null,"Phillips Junction",null,null,null,"Ute Gulch",null,"Lovers Leap","Hike In","y",null,null,null,{"$f":"IF(ItineraryPrograms!AD17=\"y\",\"y\",\"\")","v":""},{"$f":"IF(ItineraryPrograms!AE17=\"y\",\"y\",\"\")","v":""},{"$f":"IF(ItineraryPrograms!AF17=\"y\",\"y\",\"\")","v":"y"},"y",{"$f":"checkTooth(AA18,LOWER(ItineraryPrograms!AH17))","v":"y"},"y",7469,7977,9330,9330,9600,11070,9193,9302,8137,8724,508,1353,0,270,1470,1877,109,1165,587,{"$f":"IF(INDEX(campsByItinerary,numericItinerary($A18),BD$3-1)=\"\",\"\",VLOOKUP(INDEX(campsByItinerary,numericItinerary($A18),BD$3-1),campInfo,8))","v":""},{"$f":"IF(INDEX(campsByItinerary,numericItinerary($A18),BE$3-1)=\"\",\"\",VLOOKUP(INDEX(campsByItinerary,numericItinerary($A18),BE$3-1),campInfo,8))","v":"Y"},{"$f":"IF(INDEX(campsByItinerary,numericItinerary($A18),BF$3-1)=\"\",\"\",VLOOKUP(INDEX(campsByItinerary,numericItinerary($A18),BF$3-1),campInfo,8))","v":"Y"},{"$f":"IF(INDEX(campsByItinerary,numericItinerary($A18),BG$3-1)=\"\",\"\",VLOOKUP(INDEX(campsByItinerary,numericItinerary($A18),BG$3-1),campInfo,8))","v":"Y"},{"$f":"IF(INDEX(campsByItinerary,numericItinerary($A18),BH$3-1)=\"\",\"\",VLOOKUP(INDEX(campsByItinerary,numericItinerary($A18),BH$3-1),campInfo,8))","v":""},{"$f":"IF(INDEX(campsByItinerary,numericItinerary($A18),BI$3-1)=\"\",\"\",VLOOKUP(INDEX(campsByItinerary,numericItinerary($A18),BI$3-1),campInfo,8))","v":""},{"$f":"IF(INDEX(campsByItinerary,numericItinerary($A18),BJ$3-1)=\"\",\"\",VLOOKUP(INDEX(campsByItinerary,numericItinerary($A18),BJ$3-1),campInfo,8))","v":"Y"},{"$f":"IF(INDEX(campsByItinerary,numericItinerary($A18),BK$3-1)=\"\",\"\",VLOOKUP(INDEX(campsByItinerary,numericItinerary($A18),BK$3-1),campInfo,8))","v":"Y"},{"$f":"IF(INDEX(campsByItinerary,numericItinerary($A18),BL$3-1)=\"\",\"\",VLOOKUP(INDEX(campsByItinerary,numericItinerary($A18),BL$3-1),campInfo,8))","v":"Y"},{"$f":"IF(INDEX(campsByItinerary,numericItinerary($A18),BM$3-1)=\"\",\"\",VLOOKUP(INDEX(campsByItinerary,numericItinerary($A18),BM$3-1),campInfo,8))","v":""},"Y","","","","Y","Y","","","","Y",{"$f":"IF(INDEX(campsByItinerary,numericItinerary($A18),BD$3-1)=\"\",\"\",VLOOKUP(INDEX(campsByItinerary,numericItinerary($A18),BD$3-1),campInfo,10))","v":""},{"$f":"IF(INDEX(campsByItinerary,numericItinerary($A18),BE$3-1)=\"\",\"\",VLOOKUP(INDEX(campsByItinerary,numericItinerary($A18),BE$3-1),campInfo,10))","v":""},{"$f":"IF(INDEX(campsByItinerary,numericItinerary($A18),BF$3-1)=\"\",\"\",VLOOKUP(INDEX(campsByItinerary,numericItinerary($A18),BF$3-1),campInfo,10))","v":""},{"$f":"IF(INDEX(campsByItinerary,numericItinerary($A18),BG$3-1)=\"\",\"\",VLOOKUP(INDEX(campsByItinerary,numericItinerary($A18),BG$3-1),campInfo,10))","v":""},{"$f":"IF(INDEX(campsByItinerary,numericItinerary($A18),BH$3-1)=\"\",\"\",VLOOKUP(INDEX(campsByItinerary,numericItinerary($A18),BH$3-1),campInfo,10))","v":""},{"$f":"IF(INDEX(campsByItinerary,numericItinerary($A18),BI$3-1)=\"\",\"\",VLOOKUP(INDEX(campsByItinerary,numericItinerary($A18),BI$3-1),campInfo,10))","v":"Y"},{"$f":"IF(INDEX(campsByItinerary,numericItinerary($A18),BJ$3-1)=\"\",\"\",VLOOKUP(INDEX(campsByItinerary,numericItinerary($A18),BJ$3-1),campInfo,10))","v":""},{"$f":"IF(INDEX(campsByItinerary,numericItinerary($A18),BK$3-1)=\"\",\"\",VLOOKUP(INDEX(campsByItinerary,numericItinerary($A18),BK$3-1),campInfo,10))","v":""},{"$f":"IF(INDEX(campsByItinerary,numericItinerary($A18),BL$3-1)=\"\",\"\",VLOOKUP(INDEX(campsByItinerary,numericItinerary($A18),BL$3-1),campInfo,10))","v":""},{"$f":"IF(INDEX(campsByItinerary,numericItinerary($A18),BM$3-1)=\"\",\"\",VLOOKUP(INDEX(campsByItinerary,numericItinerary($A18),BM$3-1),campInfo,10))","v":"Y"},null,"","","Y","","","","","","",{"$f":"INDEX(campsByItinerary,numericItinerary($A18),BD$3-1)","v":"Lovers Leap"},{"$f":"IF(INDEX(campsByItinerary,numericItinerary($A18),BE$3-1)=\"\",\"\",VLOOKUP(INDEX(campsByItinerary,numericItinerary($A18),BE$3-1),campInfo,2))","v":"South"},{"$f":"IF(INDEX(campsByItinerary,numericItinerary($A18),BF$3-1)=\"\",\"\",VLOOKUP(INDEX(campsByItinerary,numericItinerary($A18),BF$3-1),campInfo,2))","v":"South"},{"$f":"IF(INDEX(campsByItinerary,numericItinerary($A18),BG$3-1)=\"\",\"\",VLOOKUP(INDEX(campsByItinerary,numericItinerary($A18),BG$3-1),campInfo,2))","v":"South"},{"$f":"IF(INDEX(campsByItinerary,numericItinerary($A18),BH$3-1)=\"\",\"\",VLOOKUP(INDEX(campsByItinerary,numericItinerary($A18),BH$3-1),campInfo,2))","v":"South"},{"$f":"IF(INDEX(campsByItinerary,numericItinerary($A18),BI$3-1)=\"\",\"\",VLOOKUP(INDEX(campsByItinerary,numericItinerary($A18),BI$3-1),campInfo,2))","v":"Central"},{"$f":"IF(INDEX(campsByItinerary,numericItinerary($A18),BJ$3-1)=\"\",\"\",VLOOKUP(INDEX(campsByItinerary,numericItinerary($A18),BJ$3-1),campInfo,2))","v":"Central"},{"$f":"IF(INDEX(campsByItinerary,numericItinerary($A18),BK$3-1)=\"\",\"\",VLOOKUP(INDEX(campsByItinerary,numericItinerary($A18),BK$3-1),campInfo,2))","v":"Central"},{"$f":"IF(INDEX(campsByItinerary,numericItinerary($A18),BL$3-1)=\"\",\"\",VLOOKUP(INDEX(campsByItinerary,numericItinerary($A18),BL$3-1),campInfo,2))","v":"Central"},{"$f":"IF(INDEX(campsByItinerary,numericItinerary($A18),BM$3-1)=\"\",\"\",VLOOKUP(INDEX(campsByItinerary,numericItinerary($A18),BM$3-1),campInfo,2))","v":"Central"},{"$f":"IF(INDEX(campsByItinerary,numericItinerary($A18),BD$3-1)=\"\",\"\",VLOOKUP(INDEX(campsByItinerary,numericItinerary($A18),BD$3-1),campInfo,12))","v":"South"},{"$f":"IF(INDEX(campsByItinerary,numericItinerary($A18),BE$3-1)=\"\",\"\",VLOOKUP(INDEX(campsByItinerary,numericItinerary($A18),BE$3-1),campInfo,12))","v":"South"},{"$f":"IF(INDEX(campsByItinerary,numericItinerary($A18),BF$3-1)=\"\",\"\",VLOOKUP(INDEX(campsByItinerary,numericItinerary($A18),BF$3-1),campInfo,12))","v":"South"},{"$f":"IF(INDEX(campsByItinerary,numericItinerary($A18),BG$3-1)=\"\",\"\",VLOOKUP(INDEX(campsByItinerary,numericItinerary($A18),BG$3-1),campInfo,12))","v":"South"},{"$f":"IF(INDEX(campsByItinerary,numericItinerary($A18),BH$3-1)=\"\",\"\",VLOOKUP(INDEX(campsByItinerary,numericItinerary($A18),BH$3-1),campInfo,12))","v":"South"},{"$f":"IF(INDEX(campsByItinerary,numericItinerary($A18),BI$3-1)=\"\",\"\",VLOOKUP(INDEX(campsByItinerary,numericItinerary($A18),BI$3-1),campInfo,12))","v":"South"},{"$f":"IF(INDEX(campsByItinerary,numericItinerary($A18),BJ$3-1)=\"\",\"\",VLOOKUP(INDEX(campsByItinerary,numericItinerary($A18),BJ$3-1),campInfo,12))","v":"South"},{"$f":"IF(INDEX(campsByItinerary,numericItinerary($A18),BK$3-1)=\"\",\"\",VLOOKUP(INDEX(campsByItinerary,numericItinerary($A18),BK$3-1),campInfo,12))","v":"South"},{"$f":"IF(INDEX(campsByItinerary,numericItinerary($A18),BL$3-1)=\"\",\"\",VLOOKUP(INDEX(campsByItinerary,numericItinerary($A18),BL$3-1),campInfo,12))","v":"South"},{"$f":"IF(INDEX(campsByItinerary,numericItinerary($A18),BM$3-1)=\"\",\"\",VLOOKUP(INDEX(campsByItinerary,numericItinerary($A18),BM$3-1),campInfo,12))","v":"South"},{"$f":"getfoodPU(\"First\",numericItinerary($A18))","v":1},{"$f":"getfoodPU(\"Max\",numericItinerary($A18))","v":3}]
["12-16",null,"S",65,"Carson Meadows","Lower Bonito","Fish Camp","Apache Springs","Comanche Creek","Red Hills","Beaubien","Beaubien","Miners Park","Tooth Ridge","Camping HQ",null,null,"Apache Springs",null,null,null,"Phillips Junction",null,null,"Zastrow","Hike In","y",null,null,null,{"$f":"IF(ItineraryPrograms!AD18=\"y\",\"y\",\"\")","v":""},{"$f":"IF(ItineraryPrograms!AE18=\"y\",\"y\",\"\")","v":""},{"$f":"IF(ItineraryPrograms!AF18=\"y\",\"y\",\"\")","v":"y"},"y",{"$f":"checkTooth(AA19,LOWER(ItineraryPrograms!AH18))","v":"y"},null,7758,8962,8564,9409,9600,10280,9330,9330,7977,8240,1204,398,845,191,680,950,0,1353,263,{"$f":"IF(INDEX(campsByItinerary,numericItinerary($A19),BD$3-1)=\"\",\"\",VLOOKUP(INDEX(campsByItinerary,numericItinerary($A19),BD$3-1),campInfo,8))","v":"N"},{"$f":"IF(INDEX(campsByItinerary,numericItinerary($A19),BE$3-1)=\"\",\"\",VLOOKUP(INDEX(campsByItinerary,numericItinerary($A19),BE$3-1),campInfo,8))","v":""},{"$f":"IF(INDEX(campsByItinerary,numericItinerary($A19),BF$3-1)=\"\",\"\",VLOOKUP(INDEX(campsByItinerary,numericItinerary($A19),BF$3-1),campInfo,8))","v":"N"},{"$f":"IF(INDEX(campsByItinerary,numericItinerary($A19),BG$3-1)=\"\",\"\",VLOOKUP(INDEX(campsByItinerary,numericItinerary($A19),BG$3-1),campInfo,8))","v":"Y"},{"$f":"IF(INDEX(campsByItinerary,numericItinerary($A19),BH$3-1)=\"\",\"\",VLOOKUP(INDEX(campsByItinerary,numericItinerary($A19),BH$3-1),campInfo,8))","v":""},{"$f":"IF(INDEX(campsByItinerary,numericItinerary($A19),BI$3-1)=\"\",\"\",VLOOKUP(INDEX(campsByItinerary,numericItinerary($A19),BI$3-1),campInfo,8))","v":""},{"$f":"IF(INDEX(campsByItinerary,numericItinerary($A19),BJ$3-1)=\"\",\"\",VLOOKUP(INDEX(campsByItinerary,numericItinerary($A19),BJ$3-1),campInfo,8))","v":"Y"},{"$f":"IF(INDEX(campsByItinerary,numericItinerary($A19),BK$3-1)=\"\",\"\",VLOOKUP(INDEX(campsByItinerary,numericItinerary($A19),BK$3-1),campInfo,8))","v":"Y"},{"$f":"IF(INDEX(campsByItinerary,numericItinerary($A19),BL$3-1)=\"\",\"\",VLOOKUP(INDEX(campsByItinerary,numericItinerary($A19),BL$3-1),campInfo,8))","v":"Y"},{"$f":"IF(INDEX(campsByItinerary,numericItinerary($A19),BM$3-1)=\"\",\"\",VLOOKUP(INDEX(campsByItinerary,numericItinerary($A19),BM$3-1),campInfo,8))","v":""},"Y","Y","Y","","Y","Y","","","","Y",{"$f":"IF(INDEX(campsByItinerary,numericItinerary($A19),BD$3-1)=\"\",\"\",VLOOKUP(INDEX(campsByItinerary,numericItinerary($A19),BD$3-1),campInfo,10))","v":""},{"$f":"IF(INDEX(campsByItinerary,numericItinerary($A19),BE$3-1)=\"\",\"\",VLOOKUP(INDEX(campsByItinerary,numericItinerary($A19),BE$3-1),campInfo,10))","v":""},{"$f":"IF(INDEX(campsByItinerary,numericItinerary($A19),BF$3-1)=\"\",\"\",VLOOKUP(INDEX(campsByItinerary,numericItinerary($A19),BF$3-1),campInfo,10))","v":""},{"$f":"IF(INDEX(campsByItinerary,numericItinerary($A19),BG$3-1)=\"\",\"\",VLOOKUP(INDEX(campsByItinerary,numericItinerary($A19),BG$3-1),campInfo,10))","v":""},{"$f":"IF(INDEX(campsByItinerary,numericItinerary($A19),BH$3-1)=\"\",\"\",VLOOKUP(INDEX(campsByItinerary,numericItinerary($A19),BH$3-1),campInfo,10))","v":""},{"$f":"IF(INDEX(campsByItinerary,numericItinerary($A19),BI$3-1)=\"\",\"\",VLOOKUP(INDEX(campsByItinerary,numericItinerary($A19),BI$3-1),campInfo,10))","v":""},{"$f":"IF(INDEX(campsByItinerary,numericItinerary($A19),BJ$3-1)=\"\",\"\",VLOOKUP(INDEX(campsByItinerary,numericItinerary($A19),BJ$3-1),campInfo,10))","v":""},{"$f":"IF(INDEX(campsByItinerary,numericItinerary($A19),BK$3-1)=\"\",\"\",VLOOKUP(INDEX(campsByItinerary,numericItinerary($A19),BK$3-1),campInfo,10))","v":""},{"$f":"IF(INDEX(campsByItinerary,numericItinerary($A19),BL$3-1)=\"\",\"\",VLOOKUP(INDEX(campsByItinerary,numericItinerary($A19),BL$3-1),campInfo,10))","v":""},{"$f":"IF(INDEX(campsByItinerary,numericItinerary($A19),BM$3-1)=\"\",\"\",VLOOKUP(INDEX(campsByItinerary,numericItinerary($A19),BM$3-1),campInfo,10))","v":"Y"},null,"","","","","","","Y","","",{"$f":"INDEX(campsByItinerary,numericItinerary($A19),BD$3-1)","v":"Carson Meadows"},{"$f":"IF(INDEX(campsByItinerary,numericItinerary($A19),BE$3-1)=\"\",\"\",VLOOKUP(INDEX(campsByItinerary,numericItinerary($A19),BE$3-1),campInfo,2))","v":"South"},{"$f":"IF(INDEX(campsByItinerary,numericItinerary($A19),BF$3-1)=\"\",\"\",VLOOKUP(INDEX(campsByItinerary,numericItinerary($A19),BF$3-1),campInfo,2))","v":"South"},{"$f":"IF(INDEX(campsByItinerary,numericItinerary($A19),BG$3-1)=\"\",\"\",VLOOKUP(INDEX(campsByItinerary,numericItinerary($A19),BG$3-1),campInfo,2))","v":"South"},{"$f":"IF(INDEX(campsByItinerary,numericItinerary($A19),BH$3-1)=\"\",\"\",VLOOKUP(INDEX(campsByItinerary,numericItinerary($A19),BH$3-1),campInfo,2))","v":"South"},{"$f":"IF(INDEX(campsByItinerary,numericItinerary($A19),BI$3-1)=\"\",\"\",VLOOKUP(INDEX(campsByItinerary,numericItinerary($A19),BI$3-1),campInfo,2))","v":"South"},{"$f":"IF(INDEX(campsByItinerary,numericItinerary($A19),BJ$3-1)=\"\",\"\",VLOOKUP(INDEX(campsByItinerary,numericItinerary($A19),BJ$3-1),campInfo,2))","v":"South"},{"$f":"IF(INDEX(campsByItinerary,numericItinerary($A19),BK$3-1)=\"\",\"\",VLOOKUP(INDEX(campsByItinerary,numericItinerary($A19),BK$3-1),campInfo,2))","v":"South"},{"$f":"IF(INDEX(campsByItinerary,numericItinerary($A19),BL$3-1)=\"\",\"\",VLOOKUP(INDEX(campsByItinerary,numericItinerary($A19),BL$3-1),campInfo,2))","v":"South"},{"$f":"IF(INDEX(campsByItinerary,numericItinerary($A19),BM$3-1)=\"\",\"\",VLOOKUP(INDEX(campsByItinerary,numericItinerary($A19),BM$3-1),campInfo,2))","v":"Central"},{"$f":"IF(INDEX(campsByItinerary,numericItinerary($A19),BD$3-1)=\"\",\"\",VLOOKUP(INDEX(campsByItinerary,numericItinerary($A19),BD$3-1),campInfo,12))","v":"South"},{"$f":"IF(INDEX(campsByItinerary,numericItinerary($A19),BE$3-1)=\"\",\"\",VLOOKUP(INDEX(campsByItinerary,numericItinerary($A19),BE$3-1),campInfo,12))","v":"South"},{"$f":"IF(INDEX(campsByItinerary,numericItinerary($A19),BF$3-1)=\"\",\"\",VLOOKUP(INDEX(campsByItinerary,numericItinerary($A19),BF$3-1),campInfo,12))","v":"South"},{"$f":"IF(INDEX(campsByItinerary,numericItinerary($A19),BG$3-1)=\"\",\"\",VLOOKUP(INDEX(campsByItinerary,numericItinerary($A19),BG$3-1),campInfo,12))","v":"South"},{"$f":"IF(INDEX(campsByItinerary,numericItinerary($A19),BH$3-1)=\"\",\"\",VLOOKUP(INDEX(campsByItinerary,numericItinerary($A19),BH$3-1),campInfo,12))","v":"South"},{"$f":"IF(INDEX(campsByItinerary,numericItinerary($A19),BI$3-1)=\"\",\"\",VLOOKUP(INDEX(campsByItinerary,numericItinerary($A19),BI$3-1),campInfo,12))","v":"South"},{"$f":"IF(INDEX(campsByItinerary,numericItinerary($A19),BJ$3-1)=\"\",\"\",VLOOKUP(INDEX(campsByItinerary,numericItinerary($A19),BJ$3-1),campInfo,12))","v":"South"},{"$f":"IF(INDEX(campsByItinerary,numericItinerary($A19),BK$3-1)=\"\",\"\",VLOOKUP(INDEX(campsByItinerary,numericItinerary($A19),BK$3-1),campInfo,12))","v":"South"},{"$f":"IF(INDEX(campsByItinerary,numericItinerary($A19),BL$3-1)=\"\",\"\",VLOOKUP(INDEX(campsByItinerary,numericItinerary($A19),BL$3-1),campInfo,12))","v":"South"},{"$f":"IF(INDEX(campsByItinerary,numericItinerary($A19),BM$3-1)=\"\",\"\",VLOOKUP(INDEX(campsByItinerary,numericItinerary($A19),BM$3-1),campInfo,12))","v":"South"},{"$f":"getfoodPU(\"First\",numericItinerary($A19))","v":3},{"$f":"getfoodPU(\"Max\",numericItinerary($A19))","v":3}]
["12-17",null,"S",61,"Minnette Meadows","Cimarroncito","Cyphers Mine","Mount Phillips","Wild Horse","Apache Springs","Phillips Junction","Crater Lake","Miners Park","Tooth Ridge","Camping HQ","Ute Gulch",null,null,null,"Apache Springs","Phillips Junction",null,"Miners Park",null,"Ute Park","Hike In","y",null,null,null,{"$f":"IF(ItineraryPrograms!AD19=\"y\",\"y\",\"\")","v":""},{"$f":"IF(ItineraryPrograms!AE19=\"y\",\"y\",\"\")","v":""},{"$f":"IF(ItineraryPrograms!AF19=\"y\",\"y\",\"\")","v":"y"},"y",{"$f":"checkTooth(AA20,LOWER(ItineraryPrograms!AH19))","v":"y"},"y",7703,8137,9302,11650,10420,9409,8921,8398,7977,8240,434,1165,2348,1230,1011,488,523,421,263,{"$f":"IF(INDEX(campsByItinerary,numericItinerary($A20),BD$3-1)=\"\",\"\",VLOOKUP(INDEX(campsByItinerary,numericItinerary($A20),BD$3-1),campInfo,8))","v":""},{"$f":"IF(INDEX(campsByItinerary,numericItinerary($A20),BE$3-1)=\"\",\"\",VLOOKUP(INDEX(campsByItinerary,numericItinerary($A20),BE$3-1),campInfo,8))","v":"Y"},{"$f":"IF(INDEX(campsByItinerary,numericItinerary($A20),BF$3-1)=\"\",\"\",VLOOKUP(INDEX(campsByItinerary,numericItinerary($A20),BF$3-1),campInfo,8))","v":"Y"},{"$f":"IF(INDEX(campsByItinerary,numericItinerary($A20),BG$3-1)=\"\",\"\",VLOOKUP(INDEX(campsByItinerary,numericItinerary($A20),BG$3-1),campInfo,8))","v":""},{"$f":"IF(INDEX(campsByItinerary,numericItinerary($A20),BH$3-1)=\"\",\"\",VLOOKUP(INDEX(campsByItinerary,numericItinerary($A20),BH$3-1),campInfo,8))","v":""},{"$f":"IF(INDEX(campsByItinerary,numericItinerary($A20),BI$3-1)=\"\",\"\",VLOOKUP(INDEX(campsByItinerary,numericItinerary($A20),BI$3-1),campInfo,8))","v":"Y"},{"$f":"IF(INDEX(campsByItinerary,numericItinerary($A20),BJ$3-1)=\"\",\"\",VLOOKUP(INDEX(campsByItinerary,numericItinerary($A20),BJ$3-1),campInfo,8))","v":"Y"},{"$f":"IF(INDEX(campsByItinerary,numericItinerary($A20),BK$3-1)=\"\",\"\",VLOOKUP(INDEX(campsByItinerary,numericItinerary($A20),BK$3-1),campInfo,8))","v":"Y"},{"$f":"IF(INDEX(campsByItinerary,numericItinerary($A20),BL$3-1)=\"\",\"\",VLOOKUP(INDEX(campsByItinerary,numericItinerary($A20),BL$3-1),campInfo,8))","v":"Y"},{"$f":"IF(INDEX(campsByItinerary,numericItinerary($A20),BM$3-1)=\"\",\"\",VLOOKUP(INDEX(campsByItinerary,numericItinerary($A20),BM$3-1),campInfo,8))","v":""},"Y","","","Y","Y","","","","","Y",{"$f":"IF(INDEX(campsByItinerary,numericItinerary($A20),BD$3-1)=\"\",\"\",VLOOKUP(INDEX(campsByItinerary,numericItinerary($A20),BD$3-1),campInfo,10))","v":"Y"},{"$f":"IF(INDEX(campsByItinerary,numericItinerary($A20),BE$3-1)=\"\",\"\",VLOOKUP(INDEX(campsByItinerary,numericItinerary($A20),BE$3-1),campInfo,10))","v":""},{"$f":"IF(INDEX(campsByItinerary,numericItinerary($A20),BF$3-1)=\"\",\"\",VLOOKUP(INDEX(campsByItinerary,numericItinerary($A20),BF$3-1),campInfo,10))","v":""},{"$f":"IF(INDEX(campsByItinerary,numericItinerary($A20),BG$3-1)=\"\",\"\",VLOOKUP(INDEX(campsByItinerary,numericItinerary($A20),BG$3-1),campInfo,10))","v":"Y"},{"$f":"IF(INDEX(campsByItinerary,numericItinerary($A20),BH$3-1)=\"\",\"\",VLOOKUP(INDEX(campsByItinerary,numericItinerary($A20),BH$3-1),campInfo,10))","v":""},{"$f":"IF(INDEX(campsByItinerary,numericItinerary($A20),BI$3-1)=\"\",\"\",VLOOKUP(INDEX(campsByItinerary,numericItinerary($A20),BI$3-1),campInfo,10))","v":""},{"$f":"IF(INDEX(campsByItinerary,numericItinerary($A20),BJ$3-1)=\"\",\"\",VLOOKUP(INDEX(campsByItinerary,numericItinerary($A20),BJ$3-1),campInfo,10))","v":""},{"$f":"IF(INDEX(campsByItinerary,numericItinerary($A20),BK$3-1)=\"\",\"\",VLOOKUP(INDEX(campsByItinerary,numericItinerary($A20),BK$3-1),campInfo,10))","v":""},{"$f":"IF(INDEX(campsByItinerary,numericItinerary($A20),BL$3-1)=\"\",\"\",VLOOKUP(INDEX(campsByItinerary,numericItinerary($A20),BL$3-1),campInfo,10))","v":""},{"$f":"IF(INDEX(campsByItinerary,numericItinerary($A20),BM$3-1)=\"\",\"\",VLOOKUP(INDEX(campsByItinerary,numericItinerary($A20),BM$3-1),campInfo,10))","v":"Y"},null,"","","","","","","","","",{"$f":"INDEX(campsByItinerary,numericItinerary($A20),BD$3-1)","v":"Minnette Meadows"},{"$f":"IF(INDEX(campsByItinerary,numericItinerary($A20),BE$3-1)=\"\",\"\",VLOOKUP(INDEX(campsByItinerary,numericItinerary($A20),BE$3-1),campInfo,2))","v":"Central"},{"$f":"IF(INDEX(campsByItinerary,numericItinerary($A20),BF$3-1)=\"\",\"\",VLOOKUP(INDEX(campsByItinerary,numericItinerary($A20),BF$3-1),campInfo,2))","v":"Central"},{"$f":"IF(INDEX(campsByItinerary,numericItinerary($A20),BG$3-1)=\"\",\"\",VLOOKUP(INDEX(campsByItinerary,numericItinerary($A20),BG$3-1),campInfo,2))","v":"Central"},{"$f":"IF(INDEX(campsByItinerary,numericItinerary($A20),BH$3-1)=\"\",\"\",VLOOKUP(INDEX(campsByItinerary,numericItinerary($A20),BH$3-1),campInfo,2))","v":"South"},{"$f":"IF(INDEX(campsByItinerary,numericItinerary($A20),BI$3-1)=\"\",\"\",VLOOKUP(INDEX(campsByItinerary,numericItinerary($A20),BI$3-1),campInfo,2))","v":"South"},{"$f":"IF(INDEX(campsByItinerary,numericItinerary($A20),BJ$3-1)=\"\",\"\",VLOOKUP(INDEX(campsByItinerary,numericItinerary($A20),BJ$3-1),campInfo,2))","v":"South"},{"$f":"IF(INDEX(campsByItinerary,numericItinerary($A20),BK$3-1)=\"\",\"\",VLOOKUP(INDEX(campsByItinerary,numericItinerary($A20),BK$3-1),campInfo,2))","v":"South"},{"$f":"IF(INDEX(campsByItinerary,numericItinerary($A20),BL$3-1)=\"\",\"\",VLOOKUP(INDEX(campsByItinerary,numericItinerary($A20),BL$3-1),campInfo,2))","v":"South"},{"$f":"IF(INDEX(campsByItinerary,numericItinerary($A20),BM$3-1)=\"\",\"\",VLOOKUP(INDEX(campsByItinerary,numericItinerary($A20),BM$3-1),campInfo,2))","v":"Central"},{"$f":"IF(INDEX(campsByItinerary,numericItinerary($A20),BD$3-1)=\"\",\"\",VLOOKUP(INDEX(campsByItinerary,numericItinerary($A20),BD$3-1),campInfo,12))","v":"South"},{"$f":"IF(INDEX(campsByItinerary,numericItinerary($A20),BE$3-1)=\"\",\"\",VLOOKUP(INDEX(campsByItinerary,numericItinerary($A20),BE$3-1),campInfo,12))","v":"South"},{"$f":"IF(INDEX(campsByItinerary,numericItinerary($A20),BF$3-1)=\"\",\"\",VLOOKUP(INDEX(campsByItinerary,numericItinerary($A20),BF$3-1),campInfo,12))","v":"South"},{"$f":"IF(INDEX(campsByItinerary,numericItinerary($A20),BG$3-1)=\"\",\"\",VLOOKUP(INDEX(campsByItinerary,numericItinerary($A20),BG$3-1),campInfo,12))","v":"South"},{"$f":"IF(INDEX(campsByItinerary,numericItinerary($A20),BH$3-1)=\"\",\"\",VLOOKUP(INDEX(campsByItinerary,numericItinerary($A20),BH$3-1),campInfo,12))","v":"South"},{"$f":"IF(INDEX(campsByItinerary,numericItinerary($A20),BI$3-1)=\"\",\"\",VLOOKUP(INDEX(campsByItinerary,numericItinerary($A20),BI$3-1),campInfo,12))","v":"South"},{"$f":"IF(INDEX(campsByItinerary,numericItinerary($A20),BJ$3-1)=\"\",\"\",VLOOKUP(INDEX(campsByItinerary,numericItinerary($A20),BJ$3-1),campInfo,12))","v":"South"},{"$f":"IF(INDEX(campsByItinerary,numericItinerary($A20),BK$3-1)=\"\",\"\",VLOOKUP(INDEX(campsByItinerary,numericItinerary($A20),BK$3-1),campInfo,12))","v":"South"},{"$f":"IF(INDEX(campsByItinerary,numericItinerary($A20),BL$3-1)=\"\",\"\",VLOOKUP(INDEX(campsByItinerary,numericItinerary($A20),BL$3-1),campInfo,12))","v":"South"},{"$f":"IF(INDEX(campsByItinerary,numericItinerary($A20),BM$3-1)=\"\",\"\",VLOOKUP(INDEX(campsByItinerary,numericItinerary($A20),BM$3-1),campInfo,12))","v":"South"},{"$f":"getfoodPU(\"First\",numericItinerary($A20))","v":1},{"$f":"getfoodPU(\"Max\",numericItinerary($A20))","v":4}]
["12-18",null,"S",64,"Deer Lake","Minnette Meadows","Mistletoe","Head of Dean","Baldy Town","Baldy Town","Pueblano","Elkhorn","Ponil","Coyote Howl","Camping HQ","Ute Gulch",null,null,"Baldy Town",null,null,null,"Ponil",null,"Webster","Six Mile Gate","",4,"Bear Canyon","N",{"$f":"IF(ItineraryPrograms!AD20=\"y\",\"y\",\"\")","v":"y"},{"$f":"IF(ItineraryPrograms!AE20=\"y\",\"y\",\"\")","v":""},{"$f":"IF(ItineraryPrograms!AF20=\"y\",\"y\",\"\")","v":""},"y",{"$f":"checkTooth(AA21,LOWER(ItineraryPrograms!AH20))","v":""},null,8280,7703,8295,8754,9851,9851,8069,8496,7150,7560.52,577,592,459,1097,0,1782,427,1346,410.52000000000044,{"$f":"IF(INDEX(campsByItinerary,numericItinerary($A21),BD$3-1)=\"\",\"\",VLOOKUP(INDEX(campsByItinerary,numericItinerary($A21),BD$3-1),campInfo,8))","v":""},{"$f":"IF(INDEX(campsByItinerary,numericItinerary($A21),BE$3-1)=\"\",\"\",VLOOKUP(INDEX(campsByItinerary,numericItinerary($A21),BE$3-1),campInfo,8))","v":""},{"$f":"IF(INDEX(campsByItinerary,numericItinerary($A21),BF$3-1)=\"\",\"\",VLOOKUP(INDEX(campsByItinerary,numericItinerary($A21),BF$3-1),campInfo,8))","v":""},{"$f":"IF(INDEX(campsByItinerary,numericItinerary($A21),BG$3-1)=\"\",\"\",VLOOKUP(INDEX(campsByItinerary,numericItinerary($A21),BG$3-1),campInfo,8))","v":"Y"},{"$f":"IF(INDEX(campsByItinerary,numericItinerary($A21),BH$3-1)=\"\",\"\",VLOOKUP(INDEX(campsByItinerary,numericItinerary($A21),BH$3-1),campInfo,8))","v":"Y"},{"$f":"IF(INDEX(campsByItinerary,numericItinerary($A21),BI$3-1)=\"\",\"\",VLOOKUP(INDEX(campsByItinerary,numericItinerary($A21),BI$3-1),campInfo,8))","v":"Y"},{"$f":"IF(INDEX(campsByItinerary,numericItinerary($A21),BJ$3-1)=\"\",\"\",VLOOKUP(INDEX(campsByItinerary,numericItinerary($A21),BJ$3-1),campInfo,8))","v":"Y"},{"$f":"IF(INDEX(campsByItinerary,numericItinerary($A21),BK$3-1)=\"\",\"\",VLOOKUP(INDEX(campsByItinerary,numericItinerary($A21),BK$3-1),campInfo,8))","v":""},{"$f":"IF(INDEX(campsByItinerary,numericItinerary($A21),BL$3-1)=\"\",\"\",VLOOKUP(INDEX(campsByItinerary,numericItinerary($A21),BL$3-1),campInfo,8))","v":"Y"},{"$f":"IF(INDEX(campsByItinerary,numericItinerary($A21),BM$3-1)=\"\",\"\",VLOOKUP(INDEX(campsByItinerary,numericItinerary($A21),BM$3-1),campInfo,8))","v":""},"Y","Y","Y","","","","","Y","","Y",{"$f":"IF(INDEX(campsByItinerary,numericItinerary($A21),BD$3-1)=\"\",\"\",VLOOKUP(INDEX(campsByItinerary,numericItinerary($A21),BD$3-1),campInfo,10))","v":""},{"$f":"IF(INDEX(campsByItinerary,numericItinerary($A21),BE$3-1)=\"\",\"\",VLOOKUP(INDEX(campsByItinerary,numericItinerary($A21),BE$3-1),campInfo,10))","v":"Y"},{"$f":"IF(INDEX(campsByItinerary,numericItinerary($A21),BF$3-1)=\"\",\"\",VLOOKUP(INDEX(campsByItinerary,numericItinerary($A21),BF$3-1),campInfo,10))","v":"Y"},{"$f":"IF(INDEX(campsByItinerary,numericItinerary($A21),BG$3-1)=\"\",\"\",VLOOKUP(INDEX(campsByItinerary,numericItinerary($A21),BG$3-1),campInfo,10))","v":""},{"$f":"IF(INDEX(campsByItinerary,numericItinerary($A21),BH$3-1)=\"\",\"\",VLOOKUP(INDEX(campsByItinerary,numericItinerary($A21),BH$3-1),campInfo,10))","v":""},{"$f":"IF(INDEX(campsByItinerary,numericItinerary($A21),BI$3-1)=\"\",\"\",VLOOKUP(INDEX(campsByItinerary,numericItinerary($A21),BI$3-1),campInfo,10))","v":""},{"$f":"IF(INDEX(campsByItinerary,numericItinerary($A21),BJ$3-1)=\"\",\"\",VLOOKUP(INDEX(campsByItinerary,numericItinerary($A21),BJ$3-1),campInfo,10))","v":""},{"$f":"IF(INDEX(campsByItinerary,numericItinerary($A21),BK$3-1)=\"\",\"\",VLOOKUP(INDEX(campsByItinerary,numericItinerary($A21),BK$3-1),campInfo,10))","v":""},{"$f":"IF(INDEX(campsByItinerary,numericItinerary($A21),BL$3-1)=\"\",\"\",VLOOKUP(INDEX(campsByItinerary,numericItinerary($A21),BL$3-1),campInfo,10))","v":""},{"$f":"IF(INDEX(campsByItinerary,numericItinerary($A21),BM$3-1)=\"\",\"\",VLOOKUP(INDEX(campsByItinerary,numericItinerary($A21),BM$3-1),campInfo,10))","v":""},null,"","","","","Y","","","","",{"$f":"INDEX(campsByItinerary,numericItinerary($A21),BD$3-1)","v":"Deer Lake"},{"$f":"IF(INDEX(campsByItinerary,numericItinerary($A21),BE$3-1)=\"\",\"\",VLOOKUP(INDEX(campsByItinerary,numericItinerary($A21),BE$3-1),campInfo,2))","v":"Central"},{"$f":"IF(INDEX(campsByItinerary,numericItinerary($A21),BF$3-1)=\"\",\"\",VLOOKUP(INDEX(campsByItinerary,numericItinerary($A21),BF$3-1),campInfo,2))","v":"Central"},{"$f":"IF(INDEX(campsByItinerary,numericItinerary($A21),BG$3-1)=\"\",\"\",VLOOKUP(INDEX(campsByItinerary,numericItinerary($A21),BG$3-1),campInfo,2))","v":"North"},{"$f":"IF(INDEX(campsByItinerary,numericItinerary($A21),BH$3-1)=\"\",\"\",VLOOKUP(INDEX(campsByItinerary,numericItinerary($A21),BH$3-1),campInfo,2))","v":"North"},{"$f":"IF(INDEX(campsByItinerary,numericItinerary($A21),BI$3-1)=\"\",\"\",VLOOKUP(INDEX(campsByItinerary,numericItinerary($A21),BI$3-1),campInfo,2))","v":"North"},{"$f":"IF(INDEX(campsByItinerary,numericItinerary($A21),BJ$3-1)=\"\",\"\",VLOOKUP(INDEX(campsByItinerary,numericItinerary($A21),BJ$3-1),campInfo,2))","v":"North"},{"$f":"IF(INDEX(campsByItinerary,numericItinerary($A21),BK$3-1)=\"\",\"\",VLOOKUP(INDEX(campsByItinerary,numericItinerary($A21),BK$3-1),campInfo,2))","v":"North"},{"$f":"IF(INDEX(campsByItinerary,numericItinerary($A21),BL$3-1)=\"\",\"\",VLOOKUP(INDEX(campsByItinerary,numericItinerary($A21),BL$3-1),campInfo,2))","v":"North"},{"$f":"IF(INDEX(campsByItinerary,numericItinerary($A21),BM$3-1)=\"\",\"\",VLOOKUP(INDEX(campsByItinerary,numericItinerary($A21),BM$3-1),campInfo,2))","v":"North"},{"$f":"IF(INDEX(campsByItinerary,numericItinerary($A21),BD$3-1)=\"\",\"\",VLOOKUP(INDEX(campsByItinerary,numericItinerary($A21),BD$3-1),campInfo,12))","v":"South"},{"$f":"IF(INDEX(campsByItinerary,numericItinerary($A21),BE$3-1)=\"\",\"\",VLOOKUP(INDEX(campsByItinerary,numericItinerary($A21),BE$3-1),campInfo,12))","v":"South"},{"$f":"IF(INDEX(campsByItinerary,numericItinerary($A21),BF$3-1)=\"\",\"\",VLOOKUP(INDEX(campsByItinerary,numericItinerary($A21),BF$3-1),campInfo,12))","v":"North & South"},{"$f":"IF(INDEX(campsByItinerary,numericItinerary($A21),BG$3-1)=\"\",\"\",VLOOKUP(INDEX(campsByItinerary,numericItinerary($A21),BG$3-1),campInfo,12))","v":"North"},{"$f":"IF(INDEX(campsByItinerary,numericItinerary($A21),BH$3-1)=\"\",\"\",VLOOKUP(INDEX(campsByItinerary,numericItinerary($A21),BH$3-1),campInfo,12))","v":"North"},{"$f":"IF(INDEX(campsByItinerary,numericItinerary($A21),BI$3-1)=\"\",\"\",VLOOKUP(INDEX(campsByItinerary,numericItinerary($A21),BI$3-1),campInfo,12))","v":"North"},{"$f":"IF(INDEX(campsByItinerary,numericItinerary($A21),BJ$3-1)=\"\",\"\",VLOOKUP(INDEX(campsByItinerary,numericItinerary($A21),BJ$3-1),campInfo,12))","v":"North"},{"$f":"IF(INDEX(campsByItinerary,numericItinerary($A21),BK$3-1)=\"\",\"\",VLOOKUP(INDEX(campsByItinerary,numericItinerary($A21),BK$3-1),campInfo,12))","v":"North"},{"$f":"IF(INDEX(campsByItinerary,numericItinerary($A21),BL$3-1)=\"\",\"\",VLOOKUP(INDEX(campsByItinerary,numericItinerary($A21),BL$3-1),campInfo,12))","v":"North"},{"$f":"IF(INDEX(campsByItinerary,numericItinerary($A21),BM$3-1)=\"\",\"\",VLOOKUP(INDEX(campsByItinerary,numericItinerary($A21),BM$3-1),campInfo,12))","v":"North"},{"$f":"getfoodPU(\"First\",numericItinerary($A21))","v":1},{"$f":"getfoodPU(\"Max\",numericItinerary($A21))","v":3}]
["12-19",null,"S",69,"Magpie","Urraca","Lower Bonito","Apache Springs","Wild Horse","Mount Phillips","Whistle Punk","Sawmill","Clarks Fork","Tooth Ridge","Camping HQ",null,null,"Apache Springs",null,null,null,null,"Ute Gulch",null,"Hike Out","Hike In","y",null,null,null,{"$f":"IF(ItineraryPrograms!AD21=\"y\",\"y\",\"\")","v":""},{"$f":"IF(ItineraryPrograms!AE21=\"y\",\"y\",\"\")","v":"y"},{"$f":"IF(ItineraryPrograms!AF21=\"y\",\"y\",\"\")","v":"y"},"y",{"$f":"checkTooth(AA22,LOWER(ItineraryPrograms!AH21))","v":"y"},null,7385,7968,8962,9409,10420,11650,10052,9193,7515,8240,583,994,447,1011,1230,1598,859,1678,725,{"$f":"IF(INDEX(campsByItinerary,numericItinerary($A22),BD$3-1)=\"\",\"\",VLOOKUP(INDEX(campsByItinerary,numericItinerary($A22),BD$3-1),campInfo,8))","v":""},{"$f":"IF(INDEX(campsByItinerary,numericItinerary($A22),BE$3-1)=\"\",\"\",VLOOKUP(INDEX(campsByItinerary,numericItinerary($A22),BE$3-1),campInfo,8))","v":"Y"},{"$f":"IF(INDEX(campsByItinerary,numericItinerary($A22),BF$3-1)=\"\",\"\",VLOOKUP(INDEX(campsByItinerary,numericItinerary($A22),BF$3-1),campInfo,8))","v":""},{"$f":"IF(INDEX(campsByItinerary,numericItinerary($A22),BG$3-1)=\"\",\"\",VLOOKUP(INDEX(campsByItinerary,numericItinerary($A22),BG$3-1),campInfo,8))","v":"Y"},{"$f":"IF(INDEX(campsByItinerary,numericItinerary($A22),BH$3-1)=\"\",\"\",VLOOKUP(INDEX(campsByItinerary,numericItinerary($A22),BH$3-1),campInfo,8))","v":""},{"$f":"IF(INDEX(campsByItinerary,numericItinerary($A22),BI$3-1)=\"\",\"\",VLOOKUP(INDEX(campsByItinerary,numericItinerary($A22),BI$3-1),campInfo,8))","v":""},{"$f":"IF(INDEX(campsByItinerary,numericItinerary($A22),BJ$3-1)=\"\",\"\",VLOOKUP(INDEX(campsByItinerary,numericItinerary($A22),BJ$3-1),campInfo,8))","v":""},{"$f":"IF(INDEX(campsByItinerary,numericItinerary($A22),BK$3-1)=\"\",\"\",VLOOKUP(INDEX(campsByItinerary,numericItinerary($A22),BK$3-1),campInfo,8))","v":"Y"},{"$f":"IF(INDEX(campsByItinerary,numericItinerary($A22),BL$3-1)=\"\",\"\",VLOOKUP(INDEX(campsByItinerary,numericItinerary($A22),BL$3-1),campInfo,8))","v":"Y"},{"$f":"IF(INDEX(campsByItinerary,numericItinerary($A22),BM$3-1)=\"\",\"\",VLOOKUP(INDEX(campsByItinerary,numericItinerary($A22),BM$3-1),campInfo,8))","v":""},"Y","","Y","","Y","Y","Y","","","Y",{"$f":"IF(INDEX(campsByItinerary,numericItinerary($A22),BD$3-1)=\"\",\"\",VLOOKUP(INDEX(campsByItinerary,numericItinerary($A22),BD$3-1),campInfo,10))","v":"Y"},{"$f":"IF(INDEX(campsByItinerary,numericItinerary($A22),BE$3-1)=\"\",\"\",VLOOKUP(INDEX(campsByItinerary,numericItinerary($A22),BE$3-1),campInfo,10))","v":""},{"$f":"IF(INDEX(campsByItinerary,numericItinerary($A22),BF$3-1)=\"\",\"\",VLOOKUP(INDEX(campsByItinerary,numericItinerary($A22),BF$3-1),campInfo,10))","v":""},{"$f":"IF(INDEX(campsByItinerary,numericItinerary($A22),BG$3-1)=\"\",\"\",VLOOKUP(INDEX(campsByItinerary,numericItinerary($A22),BG$3-1),campInfo,10))","v":""},{"$f":"IF(INDEX(campsByItinerary,numericItinerary($A22),BH$3-1)=\"\",\"\",VLOOKUP(INDEX(campsByItinerary,numericItinerary($A22),BH$3-1),campInfo,10))","v":""},{"$f":"IF(INDEX(campsByItinerary,numericItinerary($A22),BI$3-1)=\"\",\"\",VLOOKUP(INDEX(campsByItinerary,numericItinerary($A22),BI$3-1),campInfo,10))","v":"Y"},{"$f":"IF(INDEX(campsByItinerary,numericItinerary($A22),BJ$3-1)=\"\",\"\",VLOOKUP(INDEX(campsByItinerary,numericItinerary($A22),BJ$3-1),campInfo,10))","v":""},{"$f":"IF(INDEX(campsByItinerary,numericItinerary($A22),BK$3-1)=\"\",\"\",VLOOKUP(INDEX(campsByItinerary,numericItinerary($A22),BK$3-1),campInfo,10))","v":""},{"$f":"IF(INDEX(campsByItinerary,numericItinerary($A22),BL$3-1)=\"\",\"\",VLOOKUP(INDEX(campsByItinerary,numericItinerary($A22),BL$3-1),campInfo,10))","v":""},{"$f":"IF(INDEX(campsByItinerary,numericItinerary($A22),BM$3-1)=\"\",\"\",VLOOKUP(INDEX(campsByItinerary,numericItinerary($A22),BM$3-1),campInfo,10))","v":"Y"},null,"","","","","","","","","",{"$f":"INDEX(campsByItinerary,numericItinerary($A22),BD$3-1)","v":"Magpie"},{"$f":"IF(INDEX(campsByItinerary,numericItinerary($A22),BE$3-1)=\"\",\"\",VLOOKUP(INDEX(campsByItinerary,numericItinerary($A22),BE$3-1),campInfo,2))","v":"South"},{"$f":"IF(INDEX(campsByItinerary,numericItinerary($A22),BF$3-1)=\"\",\"\",VLOOKUP(INDEX(campsByItinerary,numericItinerary($A22),BF$3-1),campInfo,2))","v":"South"},{"$f":"IF(INDEX(campsByItinerary,numericItinerary($A22),BG$3-1)=\"\",\"\",VLOOKUP(INDEX(campsByItinerary,numericItinerary($A22),BG$3-1),campInfo,2))","v":"South"},{"$f":"IF(INDEX(campsByItinerary,numericItinerary($A22),BH$3-1)=\"\",\"\",VLOOKUP(INDEX(campsByItinerary,numericItinerary($A22),BH$3-1),campInfo,2))","v":"South"},{"$f":"IF(INDEX(campsByItinerary,numericItinerary($A22),BI$3-1)=\"\",\"\",VLOOKUP(INDEX(campsByItinerary,numericItinerary($A22),BI$3-1),campInfo,2))","v":"Central"},{"$f":"IF(INDEX(campsByItinerary,numericItinerary($A22),BJ$3-1)=\"\",\"\",VLOOKUP(INDEX(campsByItinerary,numericItinerary($A22),BJ$3-1),campInfo,2))","v":"Central"},{"$f":"IF(INDEX(campsByItinerary,numericItinerary($A22),BK$3-1)=\"\",\"\",VLOOKUP(INDEX(campsByItinerary,numericItinerary($A22),BK$3-1),campInfo,2))","v":"Central"},{"$f":"IF(INDEX(campsByItinerary,numericItinerary($A22),BL$3-1)=\"\",\"\",VLOOKUP(INDEX(campsByItinerary,numericItinerary($A22),BL$3-1),campInfo,2))","v":"Central"},{"$f":"IF(INDEX(campsByItinerary,numericItinerary($A22),BM$3-1)=\"\",\"\",VLOOKUP(INDEX(campsByItinerary,numericItinerary($A22),BM$3-1),campInfo,2))","v":"Central"},{"$f":"IF(INDEX(campsByItinerary,numericItinerary($A22),BD$3-1)=\"\",\"\",VLOOKUP(INDEX(campsByItinerary,numericItinerary($A22),BD$3-1),campInfo,12))","v":"South"},{"$f":"IF(INDEX(campsByItinerary,numericItinerary($A22),BE$3-1)=\"\",\"\",VLOOKUP(INDEX(campsByItinerary,numericItinerary($A22),BE$3-1),campInfo,12))","v":"South"},{"$f":"IF(INDEX(campsByItinerary,numericItinerary($A22),BF$3-1)=\"\",\"\",VLOOKUP(INDEX(campsByItinerary,numericItinerary($A22),BF$3-1),campInfo,12))","v":"South"},{"$f":"IF(INDEX(campsByItinerary,numericItinerary($A22),BG$3-1)=\"\",\"\",VLOOKUP(INDEX(campsByItinerary,numericItinerary($A22),BG$3-1),campInfo,12))","v":"South"},{"$f":"IF(INDEX(campsByItinerary,numericItinerary($A22),BH$3-1)=\"\",\"\",VLOOKUP(INDEX(campsByItinerary,numericItinerary($A22),BH$3-1),campInfo,12))","v":"South"},{"$f":"IF(INDEX(campsByItinerary,numericItinerary($A22),BI$3-1)=\"\",\"\",VLOOKUP(INDEX(campsByItinerary,numericItinerary($A22),BI$3-1),campInfo,12))","v":"South"},{"$f":"IF(INDEX(campsByItinerary,numericItinerary($A22),BJ$3-1)=\"\",\"\",VLOOKUP(INDEX(campsByItinerary,numericItinerary($A22),BJ$3-1),campInfo,12))","v":"South"},{"$f":"IF(INDEX(campsByItinerary,numericItinerary($A22),BK$3-1)=\"\",\"\",VLOOKUP(INDEX(campsByItinerary,numericItinerary($A22),BK$3-1),campInfo,12))","v":"South"},{"$f":"IF(INDEX(campsByItinerary,numericItinerary($A22),BL$3-1)=\"\",\"\",VLOOKUP(INDEX(campsByItinerary,numericItinerary($A22),BL$3-1),campInfo,12))","v":"South"},{"$f":"IF(INDEX(campsByItinerary,numericItinerary($A22),BM$3-1)=\"\",\"\",VLOOKUP(INDEX(campsByItinerary,numericItinerary($A22),BM$3-1),campInfo,12))","v":"South"},{"$f":"getfoodPU(\"First\",numericItinerary($A22))","v":3},{"$f":"getfoodPU(\"Max\",numericItinerary($A22))","v":5}]
["12-20",null,"SS",76,"Horse Canyon","Dan Beard","Ring Place","Whiteman Vega","Iris Park","Copper Park","Copper Park","Miranda","Baldy Skyline","Ponil","Camping HQ",null,"Ring Place",null,null,null,"Baldy Town",null,null,null,"Ponil","Ponil","",null,null,null,{"$f":"IF(ItineraryPrograms!AD22=\"y\",\"y\",\"\")","v":"y"},{"$f":"IF(ItineraryPrograms!AE22=\"y\",\"y\",\"\")","v":""},{"$f":"IF(ItineraryPrograms!AF22=\"y\",\"y\",\"\")","v":""},null,{"$f":"checkTooth(AA23,LOWER(ItineraryPrograms!AH22))","v":""},null,8128,7896,8124,8061,8571,10530,10530,8898,9140,7150,232,228,63,510,1959,0,1632,242,1990,{"$f":"IF(INDEX(campsByItinerary,numericItinerary($A23),BD$3-1)=\"\",\"\",VLOOKUP(INDEX(campsByItinerary,numericItinerary($A23),BD$3-1),campInfo,8))","v":""},{"$f":"IF(INDEX(campsByItinerary,numericItinerary($A23),BE$3-1)=\"\",\"\",VLOOKUP(INDEX(campsByItinerary,numericItinerary($A23),BE$3-1),campInfo,8))","v":"Y"},{"$f":"IF(INDEX(campsByItinerary,numericItinerary($A23),BF$3-1)=\"\",\"\",VLOOKUP(INDEX(campsByItinerary,numericItinerary($A23),BF$3-1),campInfo,8))","v":"Y"},{"$f":"IF(INDEX(campsByItinerary,numericItinerary($A23),BG$3-1)=\"\",\"\",VLOOKUP(INDEX(campsByItinerary,numericItinerary($A23),BG$3-1),campInfo,8))","v":"Y"},{"$f":"IF(INDEX(campsByItinerary,numericItinerary($A23),BH$3-1)=\"\",\"\",VLOOKUP(INDEX(campsByItinerary,numericItinerary($A23),BH$3-1),campInfo,8))","v":""},{"$f":"IF(INDEX(campsByItinerary,numericItinerary($A23),BI$3-1)=\"\",\"\",VLOOKUP(INDEX(campsByItinerary,numericItinerary($A23),BI$3-1),campInfo,8))","v":""},{"$f":"IF(INDEX(campsByItinerary,numericItinerary($A23),BJ$3-1)=\"\",\"\",VLOOKUP(INDEX(campsByItinerary,numericItinerary($A23),BJ$3-1),campInfo,8))","v":""},{"$f":"IF(INDEX(campsByItinerary,numericItinerary($A23),BK$3-1)=\"\",\"\",VLOOKUP(INDEX(campsByItinerary,numericItinerary($A23),BK$3-1),campInfo,8))","v":"Y"},{"$f":"IF(INDEX(campsByItinerary,numericItinerary($A23),BL$3-1)=\"\",\"\",VLOOKUP(INDEX(campsByItinerary,numericItinerary($A23),BL$3-1),campInfo,8))","v":""},{"$f":"IF(INDEX(campsByItinerary,numericItinerary($A23),BM$3-1)=\"\",\"\",VLOOKUP(INDEX(campsByItinerary,numericItinerary($A23),BM$3-1),campInfo,8))","v":"Y"},"Y","","","","Y","Y","Y","","Y","",{"$f":"IF(INDEX(campsByItinerary,numericItinerary($A23),BD$3-1)=\"\",\"\",VLOOKUP(INDEX(campsByItinerary,numericItinerary($A23),BD$3-1),campInfo,10))","v":""},{"$f":"IF(INDEX(campsByItinerary,numericItinerary($A23),BE$3-1)=\"\",\"\",VLOOKUP(INDEX(campsByItinerary,numericItinerary($A23),BE$3-1),campInfo,10))","v":""},{"$f":"IF(INDEX(campsByItinerary,numericItinerary($A23),BF$3-1)=\"\",\"\",VLOOKUP(INDEX(campsByItinerary,numericItinerary($A23),BF$3-1),campInfo,10))","v":""},{"$f":"IF(INDEX(campsByItinerary,numericItinerary($A23),BG$3-1)=\"\",\"\",VLOOKUP(INDEX(campsByItinerary,numericItinerary($A23),BG$3-1),campInfo,10))","v":""},{"$f":"IF(INDEX(campsByItinerary,numericItinerary($A23),BH$3-1)=\"\",\"\",VLOOKUP(INDEX(campsByItinerary,numericItinerary($A23),BH$3-1),campInfo,10))","v":""},{"$f":"IF(INDEX(campsByItinerary,numericItinerary($A23),BI$3-1)=\"\",\"\",VLOOKUP(INDEX(campsByItinerary,numericItinerary($A23),BI$3-1),campInfo,10))","v":""},{"$f":"IF(INDEX(campsByItinerary,numericItinerary($A23),BJ$3-1)=\"\",\"\",VLOOKUP(INDEX(campsByItinerary,numericItinerary($A23),BJ$3-1),campInfo,10))","v":""},{"$f":"IF(INDEX(campsByItinerary,numericItinerary($A23),BK$3-1)=\"\",\"\",VLOOKUP(INDEX(campsByItinerary,numericItinerary($A23),BK$3-1),campInfo,10))","v":""},{"$f":"IF(INDEX(campsByItinerary,numericItinerary($A23),BL$3-1)=\"\",\"\",VLOOKUP(INDEX(campsByItinerary,numericItinerary($A23),BL$3-1),campInfo,10))","v":""},{"$f":"IF(INDEX(campsByItinerary,numericItinerary($A23),BM$3-1)=\"\",\"\",VLOOKUP(INDEX(campsByItinerary,numericItinerary($A23),BM$3-1),campInfo,10))","v":""},null,"","","","","","Y","","","",{"$f":"INDEX(campsByItinerary,numericItinerary($A23),BD$3-1)","v":"Horse Canyon"},{"$f":"IF(INDEX(campsByItinerary,numericItinerary($A23),BE$3-1)=\"\",\"\",VLOOKUP(INDEX(campsByItinerary,numericItinerary($A23),BE$3-1),campInfo,2))","v":"North"},{"$f":"IF(INDEX(campsByItinerary,numericItinerary($A23),BF$3-1)=\"\",\"\",VLOOKUP(INDEX(campsByItinerary,numericItinerary($A23),BF$3-1),campInfo,2))","v":"Valle Vidal"},{"$f":"IF(INDEX(campsByItinerary,numericItinerary($A23),BG$3-1)=\"\",\"\",VLOOKUP(INDEX(campsByItinerary,numericItinerary($A23),BG$3-1),campInfo,2))","v":"Valle Vidal"},{"$f":"IF(INDEX(campsByItinerary,numericItinerary($A23),BH$3-1)=\"\",\"\",VLOOKUP(INDEX(campsByItinerary,numericItinerary($A23),BH$3-1),campInfo,2))","v":"Valle Vidal"},{"$f":"IF(INDEX(campsByItinerary,numericItinerary($A23),BI$3-1)=\"\",\"\",VLOOKUP(INDEX(campsByItinerary,numericItinerary($A23),BI$3-1),campInfo,2))","v":"North"},{"$f":"IF(INDEX(campsByItinerary,numericItinerary($A23),BJ$3-1)=\"\",\"\",VLOOKUP(INDEX(campsByItinerary,numericItinerary($A23),BJ$3-1),campInfo,2))","v":"North"},{"$f":"IF(INDEX(campsByItinerary,numericItinerary($A23),BK$3-1)=\"\",\"\",VLOOKUP(INDEX(campsByItinerary,numericItinerary($A23),BK$3-1),campInfo,2))","v":"North"},{"$f":"IF(INDEX(campsByItinerary,numericItinerary($A23),BL$3-1)=\"\",\"\",VLOOKUP(INDEX(campsByItinerary,numericItinerary($A23),BL$3-1),campInfo,2))","v":"North"},{"$f":"IF(INDEX(campsByItinerary,numericItinerary($A23),BM$3-1)=\"\",\"\",VLOOKUP(INDEX(campsByItinerary,numericItinerary($A23),BM$3-1),campInfo,2))","v":"North"},{"$f":"IF(INDEX(campsByItinerary,numericItinerary($A23),BD$3-1)=\"\",\"\",VLOOKUP(INDEX(campsByItinerary,numericItinerary($A23),BD$3-1),campInfo,12))","v":"North"},{"$f":"IF(INDEX(campsByItinerary,numericItinerary($A23),BE$3-1)=\"\",\"\",VLOOKUP(INDEX(campsByItinerary,numericItinerary($A23),BE$3-1),campInfo,12))","v":"North"},{"$f":"IF(INDEX(campsByItinerary,numericItinerary($A23),BF$3-1)=\"\",\"\",VLOOKUP(INDEX(campsByItinerary,numericItinerary($A23),BF$3-1),campInfo,12))","v":"North"},{"$f":"IF(INDEX(campsByItinerary,numericItinerary($A23),BG$3-1)=\"\",\"\",VLOOKUP(INDEX(campsByItinerary,numericItinerary($A23),BG$3-1),campInfo,12))","v":"North"},{"$f":"IF(INDEX(campsByItinerary,numericItinerary($A23),BH$3-1)=\"\",\"\",VLOOKUP(INDEX(campsByItinerary,numericItinerary($A23),BH$3-1),campInfo,12))","v":"North"},{"$f":"IF(INDEX(campsByItinerary,numericItinerary($A23),BI$3-1)=\"\",\"\",VLOOKUP(INDEX(campsByItinerary,numericItinerary($A23),BI$3-1),campInfo,12))","v":"North"},{"$f":"IF(INDEX(campsByItinerary,numericItinerary($A23),BJ$3-1)=\"\",\"\",VLOOKUP(INDEX(campsByItinerary,numericItinerary($A23),BJ$3-1),campInfo,12))","v":"North"},{"$f":"IF(INDEX(campsByItinerary,numericItinerary($A23),BK$3-1)=\"\",\"\",VLOOKUP(INDEX(campsByItinerary,numericItinerary($A23),BK$3-1),campInfo,12))","v":"North"},{"$f":"IF(INDEX(campsByItinerary,numericItinerary($A23),BL$3-1)=\"\",\"\",VLOOKUP(INDEX(campsByItinerary,numericItinerary($A23),BL$3-1),campInfo,12))","v":"North"},{"$f":"IF(INDEX(campsByItinerary,numericItinerary($A23),BM$3-1)=\"\",\"\",VLOOKUP(INDEX(campsByItinerary,numericItinerary($A23),BM$3-1),campInfo,12))","v":"North"},{"$f":"getfoodPU(\"First\",numericItinerary($A23))","v":2},{"$f":"getfoodPU(\"Max\",numericItinerary($A23))","v":4}]
["12-21",null,"SS",70,"Magpie","Abreu","Miners Park","Black Mountain","Crooked Creek","Mount Phillips","Cyphers Mine","Cimarroncito","Cimarroncito","Ponderosa Park","Camping HQ",null,null,null,"Phillips Junction",null,null,null,"Ute Gulch",null,"Lovers Leap","Hike In","y",null,null,null,{"$f":"IF(ItineraryPrograms!AD23=\"y\",\"y\",\"\")","v":""},{"$f":"IF(ItineraryPrograms!AE23=\"y\",\"y\",\"\")","v":""},{"$f":"IF(ItineraryPrograms!AF23=\"y\",\"y\",\"\")","v":"y"},"y",{"$f":"checkTooth(AA24,LOWER(ItineraryPrograms!AH23))","v":"y"},null,7385,7217,7977,8991,9360,11650,9302,8137,8137,8004,168,760,1014,369,2290,2348,1165,0,133,{"$f":"IF(INDEX(campsByItinerary,numericItinerary($A24),BD$3-1)=\"\",\"\",VLOOKUP(INDEX(campsByItinerary,numericItinerary($A24),BD$3-1),campInfo,8))","v":""},{"$f":"IF(INDEX(campsByItinerary,numericItinerary($A24),BE$3-1)=\"\",\"\",VLOOKUP(INDEX(campsByItinerary,numericItinerary($A24),BE$3-1),campInfo,8))","v":"Y"},{"$f":"IF(INDEX(campsByItinerary,numericItinerary($A24),BF$3-1)=\"\",\"\",VLOOKUP(INDEX(campsByItinerary,numericItinerary($A24),BF$3-1),campInfo,8))","v":"Y"},{"$f":"IF(INDEX(campsByItinerary,numericItinerary($A24),BG$3-1)=\"\",\"\",VLOOKUP(INDEX(campsByItinerary,numericItinerary($A24),BG$3-1),campInfo,8))","v":"Y"},{"$f":"IF(INDEX(campsByItinerary,numericItinerary($A24),BH$3-1)=\"\",\"\",VLOOKUP(INDEX(campsByItinerary,numericItinerary($A24),BH$3-1),campInfo,8))","v":"Y"},{"$f":"IF(INDEX(campsByItinerary,numericItinerary($A24),BI$3-1)=\"\",\"\",VLOOKUP(INDEX(campsByItinerary,numericItinerary($A24),BI$3-1),campInfo,8))","v":""},{"$f":"IF(INDEX(campsByItinerary,numericItinerary($A24),BJ$3-1)=\"\",\"\",VLOOKUP(INDEX(campsByItinerary,numericItinerary($A24),BJ$3-1),campInfo,8))","v":"Y"},{"$f":"IF(INDEX(campsByItinerary,numericItinerary($A24),BK$3-1)=\"\",\"\",VLOOKUP(INDEX(campsByItinerary,numericItinerary($A24),BK$3-1),campInfo,8))","v":"Y"},{"$f":"IF(INDEX(campsByItinerary,numericItinerary($A24),BL$3-1)=\"\",\"\",VLOOKUP(INDEX(campsByItinerary,numericItinerary($A24),BL$3-1),campInfo,8))","v":"Y"},{"$f":"IF(INDEX(campsByItinerary,numericItinerary($A24),BM$3-1)=\"\",\"\",VLOOKUP(INDEX(campsByItinerary,numericItinerary($A24),BM$3-1),campInfo,8))","v":""},"Y","","","","","Y","","","","Y",{"$f":"IF(INDEX(campsByItinerary,numericItinerary($A24),BD$3-1)=\"\",\"\",VLOOKUP(INDEX(campsByItinerary,numericItinerary($A24),BD$3-1),campInfo,10))","v":"Y"},{"$f":"IF(INDEX(campsByItinerary,numericItinerary($A24),BE$3-1)=\"\",\"\",VLOOKUP(INDEX(campsByItinerary,numericItinerary($A24),BE$3-1),campInfo,10))","v":""},{"$f":"IF(INDEX(campsByItinerary,numericItinerary($A24),BF$3-1)=\"\",\"\",VLOOKUP(INDEX(campsByItinerary,numericItinerary($A24),BF$3-1),campInfo,10))","v":""},{"$f":"IF(INDEX(campsByItinerary,numericItinerary($A24),BG$3-1)=\"\",\"\",VLOOKUP(INDEX(campsByItinerary,numericItinerary($A24),BG$3-1),campInfo,10))","v":""},{"$f":"IF(INDEX(campsByItinerary,numericItinerary($A24),BH$3-1)=\"\",\"\",VLOOKUP(INDEX(campsByItinerary,numericItinerary($A24),BH$3-1),campInfo,10))","v":""},{"$f":"IF(INDEX(campsByItinerary,numericItinerary($A24),BI$3-1)=\"\",\"\",VLOOKUP(INDEX(campsByItinerary,numericItinerary($A24),BI$3-1),campInfo,10))","v":"Y"},{"$f":"IF(INDEX(campsByItinerary,numericItinerary($A24),BJ$3-1)=\"\",\"\",VLOOKUP(INDEX(campsByItinerary,numericItinerary($A24),BJ$3-1),campInfo,10))","v":""},{"$f":"IF(INDEX(campsByItinerary,numericItinerary($A24),BK$3-1)=\"\",\"\",VLOOKUP(INDEX(campsByItinerary,numericItinerary($A24),BK$3-1),campInfo,10))","v":""},{"$f":"IF(INDEX(campsByItinerary,numericItinerary($A24),BL$3-1)=\"\",\"\",VLOOKUP(INDEX(campsByItinerary,numericItinerary($A24),BL$3-1),campInfo,10))","v":""},{"$f":"IF(INDEX(campsByItinerary,numericItinerary($A24),BM$3-1)=\"\",\"\",VLOOKUP(INDEX(campsByItinerary,numericItinerary($A24),BM$3-1),campInfo,10))","v":"Y"},null,"","","","","","","","Y","",{"$f":"INDEX(campsByItinerary,numericItinerary($A24),BD$3-1)","v":"Magpie"},{"$f":"IF(INDEX(campsByItinerary,numericItinerary($A24),BE$3-1)=\"\",\"\",VLOOKUP(INDEX(campsByItinerary,numericItinerary($A24),BE$3-1),campInfo,2))","v":"South"},{"$f":"IF(INDEX(campsByItinerary,numericItinerary($A24),BF$3-1)=\"\",\"\",VLOOKUP(INDEX(campsByItinerary,numericItinerary($A24),BF$3-1),campInfo,2))","v":"South"},{"$f":"IF(INDEX(campsByItinerary,numericItinerary($A24),BG$3-1)=\"\",\"\",VLOOKUP(INDEX(campsByItinerary,numericItinerary($A24),BG$3-1),campInfo,2))","v":"South"},{"$f":"IF(INDEX(campsByItinerary,numericItinerary($A24),BH$3-1)=\"\",\"\",VLOOKUP(INDEX(campsByItinerary,numericItinerary($A24),BH$3-1),campInfo,2))","v":"South"},{"$f":"IF(INDEX(campsByItinerary,numericItinerary($A24),BI$3-1)=\"\",\"\",VLOOKUP(INDEX(campsByItinerary,numericItinerary($A24),BI$3-1),campInfo,2))","v":"Central"},{"$f":"IF(INDEX(campsByItinerary,numericItinerary($A24),BJ$3-1)=\"\",\"\",VLOOKUP(INDEX(campsByItinerary,numericItinerary($A24),BJ$3-1),campInfo,2))","v":"Central"},{"$f":"IF(INDEX(campsByItinerary,numericItinerary($A24),BK$3-1)=\"\",\"\",VLOOKUP(INDEX(campsByItinerary,numericItinerary($A24),BK$3-1),campInfo,2))","v":"Central"},{"$f":"IF(INDEX(campsByItinerary,numericItinerary($A24),BL$3-1)=\"\",\"\",VLOOKUP(INDEX(campsByItinerary,numericItinerary($A24),BL$3-1),campInfo,2))","v":"Central"},{"$f":"IF(INDEX(campsByItinerary,numericItinerary($A24),BM$3-1)=\"\",\"\",VLOOKUP(INDEX(campsByItinerary,numericItinerary($A24),BM$3-1),campInfo,2))","v":"Central"},{"$f":"IF(INDEX(campsByItinerary,numericItinerary($A24),BD$3-1)=\"\",\"\",VLOOKUP(INDEX(campsByItinerary,numericItinerary($A24),BD$3-1),campInfo,12))","v":"South"},{"$f":"IF(INDEX(campsByItinerary,numericItinerary($A24),BE$3-1)=\"\",\"\",VLOOKUP(INDEX(campsByItinerary,numericItinerary($A24),BE$3-1),campInfo,12))","v":"South"},{"$f":"IF(INDEX(campsByItinerary,numericItinerary($A24),BF$3-1)=\"\",\"\",VLOOKUP(INDEX(campsByItinerary,numericItinerary($A24),BF$3-1),campInfo,12))","v":"South"},{"$f":"IF(INDEX(campsByItinerary,numericItinerary($A24),BG$3-1)=\"\",\"\",VLOOKUP(INDEX(campsByItinerary,numericItinerary($A24),BG$3-1),campInfo,12))","v":"South"},{"$f":"IF(INDEX(campsByItinerary,numericItinerary($A24),BH$3-1)=\"\",\"\",VLOOKUP(INDEX(campsByItinerary,numericItinerary($A24),BH$3-1),campInfo,12))","v":"South"},{"$f":"IF(INDEX(campsByItinerary,numericItinerary($A24),BI$3-1)=\"\",\"\",VLOOKUP(INDEX(campsByItinerary,numericItinerary($A24),BI$3-1),campInfo,12))","v":"South"},{"$f":"IF(INDEX(campsByItinerary,numericItinerary($A24),BJ$3-1)=\"\",\"\",VLOOKUP(INDEX(campsByItinerary,numericItinerary($A24),BJ$3-1),campInfo,12))","v":"South"},{"$f":"IF(INDEX(campsByItinerary,numericItinerary($A24),BK$3-1)=\"\",\"\",VLOOKUP(INDEX(campsByItinerary,numericItinerary($A24),BK$3-1),campInfo,12))","v":"South"},{"$f":"IF(INDEX(campsByItinerary,numericItinerary($A24),BL$3-1)=\"\",\"\",VLOOKUP(INDEX(campsByItinerary,numericItinerary($A24),BL$3-1),campInfo,12))","v":"South"},{"$f":"IF(INDEX(campsByItinerary,numericItinerary($A24),BM$3-1)=\"\",\"\",VLOOKUP(INDEX(campsByItinerary,numericItinerary($A24),BM$3-1),campInfo,12))","v":"South"},{"$f":"getfoodPU(\"First\",numericItinerary($A24))","v":4},{"$f":"getfoodPU(\"Max\",numericItinerary($A24))","v":4}]
["12-22",null,"SS",68,"Deer Lake","Harlan","Dean Cow","Ponil","Pueblano","Azurite","Azurite","Miranda","Head of Dean","Mistletoe","Camping HQ",null,null,"Ponil",null,null,"Baldy Town",null,null,null,"Webster","Ute Park","",4,"Turkey Creek","N",{"$f":"IF(ItineraryPrograms!AD24=\"y\",\"y\",\"\")","v":"y"},{"$f":"IF(ItineraryPrograms!AE24=\"y\",\"y\",\"\")","v":""},{"$f":"IF(ItineraryPrograms!AF24=\"y\",\"y\",\"\")","v":""},null,{"$f":"checkTooth(AA25,LOWER(ItineraryPrograms!AH24))","v":""},null,8280,7550,7232,7150,8069,10640,10640,8898,8754,8295,730,318,82,919,2571,0,1742,144,459,{"$f":"IF(INDEX(campsByItinerary,numericItinerary($A25),BD$3-1)=\"\",\"\",VLOOKUP(INDEX(campsByItinerary,numericItinerary($A25),BD$3-1),campInfo,8))","v":""},{"$f":"IF(INDEX(campsByItinerary,numericItinerary($A25),BE$3-1)=\"\",\"\",VLOOKUP(INDEX(campsByItinerary,numericItinerary($A25),BE$3-1),campInfo,8))","v":"Y"},{"$f":"IF(INDEX(campsByItinerary,numericItinerary($A25),BF$3-1)=\"\",\"\",VLOOKUP(INDEX(campsByItinerary,numericItinerary($A25),BF$3-1),campInfo,8))","v":"Y"},{"$f":"IF(INDEX(campsByItinerary,numericItinerary($A25),BG$3-1)=\"\",\"\",VLOOKUP(INDEX(campsByItinerary,numericItinerary($A25),BG$3-1),campInfo,8))","v":"Y"},{"$f":"IF(INDEX(campsByItinerary,numericItinerary($A25),BH$3-1)=\"\",\"\",VLOOKUP(INDEX(campsByItinerary,numericItinerary($A25),BH$3-1),campInfo,8))","v":"Y"},{"$f":"IF(INDEX(campsByItinerary,numericItinerary($A25),BI$3-1)=\"\",\"\",VLOOKUP(INDEX(campsByItinerary,numericItinerary($A25),BI$3-1),campInfo,8))","v":""},{"$f":"IF(INDEX(campsByItinerary,numericItinerary($A25),BJ$3-1)=\"\",\"\",VLOOKUP(INDEX(campsByItinerary,numericItinerary($A25),BJ$3-1),campInfo,8))","v":""},{"$f":"IF(INDEX(campsByItinerary,numericItinerary($A25),BK$3-1)=\"\",\"\",VLOOKUP(INDEX(campsByItinerary,numericItinerary($A25),BK$3-1),campInfo,8))","v":"Y"},{"$f":"IF(INDEX(campsByItinerary,numericItinerary($A25),BL$3-1)=\"\",\"\",VLOOKUP(INDEX(campsByItinerary,numericItinerary($A25),BL$3-1),campInfo,8))","v":"Y"},{"$f":"IF(INDEX(campsByItinerary,numericItinerary($A25),BM$3-1)=\"\",\"\",VLOOKUP(INDEX(campsByItinerary,numericItinerary($A25),BM$3-1),campInfo,8))","v":""},"Y","","","","","Y","Y","","","Y",{"$f":"IF(INDEX(campsByItinerary,numericItinerary($A25),BD$3-1)=\"\",\"\",VLOOKUP(INDEX(campsByItinerary,numericItinerary($A25),BD$3-1),campInfo,10))","v":""},{"$f":"IF(INDEX(campsByItinerary,numericItinerary($A25),BE$3-1)=\"\",\"\",VLOOKUP(INDEX(campsByItinerary,numericItinerary($A25),BE$3-1),campInfo,10))","v":""},{"$f":"IF(INDEX(campsByItinerary,numericItinerary($A25),BF$3-1)=\"\",\"\",VLOOKUP(INDEX(campsByItinerary,numericItinerary($A25),BF$3-1),campInfo,10))","v":""},{"$f":"IF(INDEX(campsByItinerary,numericItinerary($A25),BG$3-1)=\"\",\"\",VLOOKUP(INDEX(campsByItinerary,numericItinerary($A25),BG$3-1),campInfo,10))","v":""},{"$f":"IF(INDEX(campsByItinerary,numericItinerary($A25),BH$3-1)=\"\",\"\",VLOOKUP(INDEX(campsByItinerary,numericItinerary($A25),BH$3-1),campInfo,10))","v":""},{"$f":"IF(INDEX(campsByItinerary,numericItinerary($A25),BI$3-1)=\"\",\"\",VLOOKUP(INDEX(campsByItinerary,numericItinerary($A25),BI$3-1),campInfo,10))","v":"Y"},{"$f":"IF(INDEX(campsByItinerary,numericItinerary($A25),BJ$3-1)=\"\",\"\",VLOOKUP(INDEX(campsByItinerary,numericItinerary($A25),BJ$3-1),campInfo,10))","v":"Y"},{"$f":"IF(INDEX(campsByItinerary,numericItinerary($A25),BK$3-1)=\"\",\"\",VLOOKUP(INDEX(campsByItinerary,numericItinerary($A25),BK$3-1),campInfo,10))","v":""},{"$f":"IF(INDEX(campsByItinerary,numericItinerary($A25),BL$3-1)=\"\",\"\",VLOOKUP(INDEX(campsByItinerary,numericItinerary($A25),BL$3-1),campInfo,10))","v":""},{"$f":"IF(INDEX(campsByItinerary,numericItinerary($A25),BM$3-1)=\"\",\"\",VLOOKUP(INDEX(campsByItinerary,numericItinerary($A25),BM$3-1),campInfo,10))","v":"Y"},null,"","","","","","Y","","","",{"$f":"INDEX(campsByItinerary,numericItinerary($A25),BD$3-1)","v":"Deer Lake"},{"$f":"IF(INDEX(campsByItinerary,numericItinerary($A25),BE$3-1)=\"\",\"\",VLOOKUP(INDEX(campsByItinerary,numericItinerary($A25),BE$3-1),campInfo,2))","v":"Central"},{"$f":"IF(INDEX(campsByItinerary,numericItinerary($A25),BF$3-1)=\"\",\"\",VLOOKUP(INDEX(campsByItinerary,numericItinerary($A25),BF$3-1),campInfo,2))","v":"North"},{"$f":"IF(INDEX(campsByItinerary,numericItinerary($A25),BG$3-1)=\"\",\"\",VLOOKUP(INDEX(campsByItinerary,numericItinerary($A25),BG$3-1),campInfo,2))","v":"North"},{"$f":"IF(INDEX(campsByItinerary,numericItinerary($A25),BH$3-1)=\"\",\"\",VLOOKUP(INDEX(campsByItinerary,numericItinerary($A25),BH$3-1),campInfo,2))","v":"North"},{"$f":"IF(INDEX(campsByItinerary,numericItinerary($A25),BI$3-1)=\"\",\"\",VLOOKUP(INDEX(campsByItinerary,numericItinerary($A25),BI$3-1),campInfo,2))","v":"North"},{"$f":"IF(INDEX(campsByItinerary,numericItinerary($A25),BJ$3-1)=\"\",\"\",VLOOKUP(INDEX(campsByItinerary,numericItinerary($A25),BJ$3-1),campInfo,2))","v":"North"},{"$f":"IF(INDEX(campsByItinerary,numericItinerary($A25),BK$3-1)=\"\",\"\",VLOOKUP(INDEX(campsByItinerary,numericItinerary($A25),BK$3-1),campInfo,2))","v":"North"},{"$f":"IF(INDEX(campsByItinerary,numericItinerary($A25),BL$3-1)=\"\",\"\",VLOOKUP(INDEX(campsByItinerary,numericItinerary($A25),BL$3-1),campInfo,2))","v":"North"},{"$f":"IF(INDEX(campsByItinerary,numericItinerary($A25),BM$3-1)=\"\",\"\",VLOOKUP(INDEX(campsByItinerary,numericItinerary($A25),BM$3-1),campInfo,2))","v":"Central"},{"$f":"IF(INDEX(campsByItinerary,numericItinerary($A25),BD$3-1)=\"\",\"\",VLOOKUP(INDEX(campsByItinerary,numericItinerary($A25),BD$3-1),campInfo,12))","v":"South"},{"$f":"IF(INDEX(campsByItinerary,numericItinerary($A25),BE$3-1)=\"\",\"\",VLOOKUP(INDEX(campsByItinerary,numericItinerary($A25),BE$3-1),campInfo,12))","v":"South"},{"$f":"IF(INDEX(campsByItinerary,numericItinerary($A25),BF$3-1)=\"\",\"\",VLOOKUP(INDEX(campsByItinerary,numericItinerary($A25),BF$3-1),campInfo,12))","v":"North"},{"$f":"IF(INDEX(campsByItinerary,numericItinerary($A25),BG$3-1)=\"\",\"\",VLOOKUP(INDEX(campsByItinerary,numericItinerary($A25),BG$3-1),campInfo,12))","v":"North"},{"$f":"IF(INDEX(campsByItinerary,numericItinerary($A25),BH$3-1)=\"\",\"\",VLOOKUP(INDEX(campsByItinerary,numericItinerary($A25),BH$3-1),campInfo,12))","v":"North"},{"$f":"IF(INDEX(campsByItinerary,numericItinerary($A25),BI$3-1)=\"\",\"\",VLOOKUP(INDEX(campsByItinerary,numericItinerary($A25),BI$3-1),campInfo,12))","v":"North"},{"$f":"IF(INDEX(campsByItinerary,numericItinerary($A25),BJ$3-1)=\"\",\"\",VLOOKUP(INDEX(campsByItinerary,numericItinerary($A25),BJ$3-1),campInfo,12))","v":"North"},{"$f":"IF(INDEX(campsByItinerary,numericItinerary($A25),BK$3-1)=\"\",\"\",VLOOKUP(INDEX(campsByItinerary,numericItinerary($A25),BK$3-1),campInfo,12))","v":"North"},{"$f":"IF(INDEX(campsByItinerary,numericItinerary($A25),BL$3-1)=\"\",\"\",VLOOKUP(INDEX(campsByItinerary,numericItinerary($A25),BL$3-1),campInfo,12))","v":"North"},{"$f":"IF(INDEX(campsByItinerary,numericItinerary($A25),BM$3-1)=\"\",\"\",VLOOKUP(INDEX(campsByItinerary,numericItinerary($A25),BM$3-1),campInfo,12))","v":"North & South"},{"$f":"getfoodPU(\"First\",numericItinerary($A25))","v":3},{"$f":"getfoodPU(\"Max\",numericItinerary($A25))","v":3}]
["12-23",null,"SS",76,"Herradura","Miners Park","Clarks Fork","Vaca","Cimarroncita","Head of Dean","Black Horse Creek","Black Horse Creek","Pueblano","Trail Canyon","Camping HQ",null,"Miners Park",null,"Ute Gulch",null,null,"Baldy Town",null,null,"Lovers Leap","Nine Mile","y",7,"Bear Canyon","S",{"$f":"IF(ItineraryPrograms!AD25=\"y\",\"y\",\"\")","v":"y"},{"$f":"IF(ItineraryPrograms!AE25=\"y\",\"y\",\"\")","v":""},{"$f":"IF(ItineraryPrograms!AF25=\"y\",\"y\",\"\")","v":""},"y",{"$f":"checkTooth(AA26,LOWER(ItineraryPrograms!AH25))","v":"y"},null,7465,7977,7515,7415,7373,8754,9619,9619,8069,7070,512,462,100,42,1381,865,0,1550,999,{"$f":"IF(INDEX(campsByItinerary,numericItinerary($A26),BD$3-1)=\"\",\"\",VLOOKUP(INDEX(campsByItinerary,numericItinerary($A26),BD$3-1),campInfo,8))","v":""},{"$f":"IF(INDEX(campsByItinerary,numericItinerary($A26),BE$3-1)=\"\",\"\",VLOOKUP(INDEX(campsByItinerary,numericItinerary($A26),BE$3-1),campInfo,8))","v":"Y"},{"$f":"IF(INDEX(campsByItinerary,numericItinerary($A26),BF$3-1)=\"\",\"\",VLOOKUP(INDEX(campsByItinerary,numericItinerary($A26),BF$3-1),campInfo,8))","v":"Y"},{"$f":"IF(INDEX(campsByItinerary,numericItinerary($A26),BG$3-1)=\"\",\"\",VLOOKUP(INDEX(campsByItinerary,numericItinerary($A26),BG$3-1),campInfo,8))","v":""},{"$f":"IF(INDEX(campsByItinerary,numericItinerary($A26),BH$3-1)=\"\",\"\",VLOOKUP(INDEX(campsByItinerary,numericItinerary($A26),BH$3-1),campInfo,8))","v":"Y"},{"$f":"IF(INDEX(campsByItinerary,numericItinerary($A26),BI$3-1)=\"\",\"\",VLOOKUP(INDEX(campsByItinerary,numericItinerary($A26),BI$3-1),campInfo,8))","v":"Y"},{"$f":"IF(INDEX(campsByItinerary,numericItinerary($A26),BJ$3-1)=\"\",\"\",VLOOKUP(INDEX(campsByItinerary,numericItinerary($A26),BJ$3-1),campInfo,8))","v":""},{"$f":"IF(INDEX(campsByItinerary,numericItinerary($A26),BK$3-1)=\"\",\"\",VLOOKUP(INDEX(campsByItinerary,numericItinerary($A26),BK$3-1),campInfo,8))","v":""},{"$f":"IF(INDEX(campsByItinerary,numericItinerary($A26),BL$3-1)=\"\",\"\",VLOOKUP(INDEX(campsByItinerary,numericItinerary($A26),BL$3-1),campInfo,8))","v":"Y"},{"$f":"IF(INDEX(campsByItinerary,numericItinerary($A26),BM$3-1)=\"\",\"\",VLOOKUP(INDEX(campsByItinerary,numericItinerary($A26),BM$3-1),campInfo,8))","v":""},{"$f":"IF(BD26=\"Y\",\"\",\"Y\")","v":"Y"},{"$f":"IF(BE26=\"Y\",\"\",\"Y\")","v":""},{"$f":"IF(BF26=\"Y\",\"\",\"Y\")","v":""},{"$f":"IF(BG26=\"Y\",\"\",\"Y\")","v":"Y"},{"$f":"IF(BH26=\"Y\",\"\",\"Y\")","v":""},{"$f":"IF(BI26=\"Y\",\"\",\"Y\")","v":""},{"$f":"IF(BJ26=\"Y\",\"\",\"Y\")","v":"Y"},{"$f":"IF(BK26=\"Y\",\"\",\"Y\")","v":"Y"},{"$f":"IF(BL26=\"Y\",\"\",\"Y\")","v":""},{"$f":"IF(BM26=\"Y\",\"\",\"Y\")","v":"Y"},{"$f":"IF(INDEX(campsByItinerary,numericItinerary($A26),BD$3-1)=\"\",\"\",VLOOKUP(INDEX(campsByItinerary,numericItinerary($A26),BD$3-1),campInfo,10))","v":"Y"},{"$f":"IF(INDEX(campsByItinerary,numericItinerary($A26),BE$3-1)=\"\",\"\",VLOOKUP(INDEX(campsByItinerary,numericItinerary($A26),BE$3-1),campInfo,10))","v":""},{"$f":"IF(INDEX(campsByItinerary,numericItinerary($A26),BF$3-1)=\"\",\"\",VLOOKUP(INDEX(campsByItinerary,numericItinerary($A26),BF$3-1),campInfo,10))","v":""},{"$f":"IF(INDEX(campsByItinerary,numericItinerary($A26),BG$3-1)=\"\",\"\",VLOOKUP(INDEX(campsByItinerary,numericItinerary($A26),BG$3-1),campInfo,10))","v":""},{"$f":"IF(INDEX(campsByItinerary,numericItinerary($A26),BH$3-1)=\"\",\"\",VLOOKUP(INDEX(campsByItinerary,numericItinerary($A26),BH$3-1),campInfo,10))","v":""},{"$f":"IF(INDEX(campsByItinerary,numericItinerary($A26),BI$3-1)=\"\",\"\",VLOOKUP(INDEX(campsByItinerary,numericItinerary($A26),BI$3-1),campInfo,10))","v":""},{"$f":"IF(INDEX(campsByItinerary,numericItinerary($A26),BJ$3-1)=\"\",\"\",VLOOKUP(INDEX(campsByItinerary,numericItinerary($A26),BJ$3-1),campInfo,10))","v":""},{"$f":"IF(INDEX(campsByItinerary,numericItinerary($A26),BK$3-1)=\"\",\"\",VLOOKUP(INDEX(campsByItinerary,numericItinerary($A26),BK$3-1),campInfo,10))","v":""},{"$f":"IF(INDEX(campsByItinerary,numericItinerary($A26),BL$3-1)=\"\",\"\",VLOOKUP(INDEX(campsByItinerary,numericItinerary($A26),BL$3-1),campInfo,10))","v":""},{"$f":"IF(INDEX(campsByItinerary,numericItinerary($A26),BM$3-1)=\"\",\"\",VLOOKUP(INDEX(campsByItinerary,numericItinerary($A26),BM$3-1),campInfo,10))","v":""},null,{"$f":"IF(E26=F26,\"Y\",\"\")","v":""},{"$f":"IF(F26=G26,\"Y\",\"\")","v":""},{"$f":"IF(G26=H26,\"Y\",\"\")","v":""},{"$f":"IF(H26=I26,\"Y\",\"\")","v":""},{"$f":"IF(I26=J26,\"Y\",\"\")","v":""},{"$f":"IF(J26=K26,\"Y\",\"\")","v":""},{"$f":"IF(K26=L26,\"Y\",\"\")","v":"Y"},{"$f":"IF(L26=M26,\"Y\",\"\")","v":""},{"$f":"IF(M26=N26,\"Y\",\"\")","v":""},{"$f":"INDEX(campsByItinerary,numericItinerary($A26),BD$3-1)","v":"Herradura"},{"$f":"IF(INDEX(campsByItinerary,numericItinerary($A26),BE$3-1)=\"\",\"\",VLOOKUP(INDEX(campsByItinerary,numericItinerary($A26),BE$3-1),campInfo,2))","v":"South"},{"$f":"IF(INDEX(campsByItinerary,numericItinerary($A26),BF$3-1)=\"\",\"\",VLOOKUP(INDEX(campsByItinerary,numericItinerary($A26),BF$3-1),campInfo,2))","v":"Central"},{"$f":"IF(INDEX(campsByItinerary,numericItinerary($A26),BG$3-1)=\"\",\"\",VLOOKUP(INDEX(campsByItinerary,numericItinerary($A26),BG$3-1),campInfo,2))","v":"Central"},{"$f":"IF(INDEX(campsByItinerary,numericItinerary($A26),BH$3-1)=\"\",\"\",VLOOKUP(INDEX(campsByItinerary,numericItinerary($A26),BH$3-1),campInfo,2))","v":"Central"},{"$f":"IF(INDEX(campsByItinerary,numericItinerary($A26),BI$3-1)=\"\",\"\",VLOOKUP(INDEX(campsByItinerary,numericItinerary($A26),BI$3-1),campInfo,2))","v":"North"},{"$f":"IF(INDEX(campsByItinerary,numericItinerary($A26),BJ$3-1)=\"\",\"\",VLOOKUP(INDEX(campsByItinerary,numericItinerary($A26),BJ$3-1),campInfo,2))","v":"North"},{"$f":"IF(INDEX(campsByItinerary,numericItinerary($A26),BK$3-1)=\"\",\"\",VLOOKUP(INDEX(campsByItinerary,numericItinerary($A26),BK$3-1),campInfo,2))","v":"North"},{"$f":"IF(INDEX(campsByItinerary,numericItinerary($A26),BL$3-1)=\"\",\"\",VLOOKUP(INDEX(campsByItinerary,numericItinerary($A26),BL$3-1),campInfo,2))","v":"North"},{"$f":"IF(INDEX(campsByItinerary,numericItinerary($A26),BM$3-1)=\"\",\"\",VLOOKUP(INDEX(campsByItinerary,numericItinerary($A26),BM$3-1),campInfo,2))","v":"North"},{"$f":"IF(INDEX(campsByItinerary,numericItinerary($A26),BD$3-1)=\"\",\"\",VLOOKUP(INDEX(campsByItinerary,numericItinerary($A26),BD$3-1),campInfo,12))","v":"South"},{"$f":"IF(INDEX(campsByItinerary,numericItinerary($A26),BE$3-1)=\"\",\"\",VLOOKUP(INDEX(campsByItinerary,numericItinerary($A26),BE$3-1),campInfo,12))","v":"South"},{"$f":"IF(INDEX(campsByItinerary,numericItinerary($A26),BF$3-1)=\"\",\"\",VLOOKUP(INDEX(campsByItinerary,numericItinerary($A26),BF$3-1),campInfo,12))","v":"South"},{"$f":"IF(INDEX(campsByItinerary,numericItinerary($A26),BG$3-1)=\"\",\"\",VLOOKUP(INDEX(campsByItinerary,numericItinerary($A26),BG$3-1),campInfo,12))","v":"South"},{"$f":"IF(INDEX(campsByItinerary,numericItinerary($A26),BH$3-1)=\"\",\"\",VLOOKUP(INDEX(campsByItinerary,numericItinerary($A26),BH$3-1),campInfo,12))","v":"North & South"},{"$f":"IF(INDEX(campsByItinerary,numericItinerary($A26),BI$3-1)=\"\",\"\",VLOOKUP(INDEX(campsByItinerary,numericItinerary($A26),BI$3-1),campInfo,12))","v":"North"},{"$f":"IF(INDEX(campsByItinerary,numericItinerary($A26),BJ$3-1)=\"\",\"\",VLOOKUP(INDEX(campsByItinerary,numericItinerary($A26),BJ$3-1),campInfo,12))","v":"North"},{"$f":"IF(INDEX(campsByItinerary,numericItinerary($A26),BK$3-1)=\"\",\"\",VLOOKUP(INDEX(campsByItinerary,numericItinerary($A26),BK$3-1),campInfo,12))","v":"North"},{"$f":"IF(INDEX(campsByItinerary,numericItinerary($A26),BL$3-1)=\"\",\"\",VLOOKUP(INDEX(campsByItinerary,numericItinerary($A26),BL$3-1),campInfo,12))","v":"North"},{"$f":"IF(INDEX(campsByItinerary,numericItinerary($A26),BM$3-1)=\"\",\"\",VLOOKUP(INDEX(campsByItinerary,numericItinerary($A26),BM$3-1),campInfo,12))","v":"North"},{"$f":"getfoodPU(\"First\",numericItinerary($A26))","v":2},{"$f":"getfoodPU(\"Max\",numericItinerary($A26))","v":2}]
["12-24",null,"SS",77,"Bluestem","Pueblano","Placer","Placer","Mistletoe","Cimarron River","Sawmill","Cyphers Mine","Cimarroncito","Shaefers Pass","Camping HQ",null,null,"Baldy Town",null,null,null,null,"Ute Gulch",null,"Ponil","Hike In","y",null,null,null,{"$f":"IF(ItineraryPrograms!AD26=\"y\",\"y\",\"\")","v":"y"},{"$f":"IF(ItineraryPrograms!AE26=\"y\",\"y\",\"\")","v":""},{"$f":"IF(ItineraryPrograms!AF26=\"y\",\"y\",\"\")","v":""},"y",{"$f":"checkTooth(AA27,LOWER(ItineraryPrograms!AH26))","v":"y"},null,7495,8069,9483.43,9483.43,8295,7282,9193,9302,8137,8724,574,1414.4300000000003,0,1188.4300000000003,1013,1911,109,1165,587,{"$f":"IF(INDEX(campsByItinerary,numericItinerary($A27),BD$3-1)=\"\",\"\",VLOOKUP(INDEX(campsByItinerary,numericItinerary($A27),BD$3-1),campInfo,8))","v":""},{"$f":"IF(INDEX(campsByItinerary,numericItinerary($A27),BE$3-1)=\"\",\"\",VLOOKUP(INDEX(campsByItinerary,numericItinerary($A27),BE$3-1),campInfo,8))","v":"Y"},{"$f":"IF(INDEX(campsByItinerary,numericItinerary($A27),BF$3-1)=\"\",\"\",VLOOKUP(INDEX(campsByItinerary,numericItinerary($A27),BF$3-1),campInfo,8))","v":""},{"$f":"IF(INDEX(campsByItinerary,numericItinerary($A27),BG$3-1)=\"\",\"\",VLOOKUP(INDEX(campsByItinerary,numericItinerary($A27),BG$3-1),campInfo,8))","v":""},{"$f":"IF(INDEX(campsByItinerary,numericItinerary($A27),BH$3-1)=\"\",\"\",VLOOKUP(INDEX(campsByItinerary,numericItinerary($A27),BH$3-1),campInfo,8))","v":""},{"$f":"IF(INDEX(campsByItinerary,numericItinerary($A27),BI$3-1)=\"\",\"\",VLOOKUP(INDEX(campsByItinerary,numericItinerary($A27),BI$3-1),campInfo,8))","v":""},{"$f":"IF(INDEX(campsByItinerary,numericItinerary($A27),BJ$3-1)=\"\",\"\",VLOOKUP(INDEX(campsByItinerary,numericItinerary($A27),BJ$3-1),campInfo,8))","v":"Y"},{"$f":"IF(INDEX(campsByItinerary,numericItinerary($A27),BK$3-1)=\"\",\"\",VLOOKUP(INDEX(campsByItinerary,numericItinerary($A27),BK$3-1),campInfo,8))","v":"Y"},{"$f":"IF(INDEX(campsByItinerary,numericItinerary($A27),BL$3-1)=\"\",\"\",VLOOKUP(INDEX(campsByItinerary,numericItinerary($A27),BL$3-1),campInfo,8))","v":"Y"},{"$f":"IF(INDEX(campsByItinerary,numericItinerary($A27),BM$3-1)=\"\",\"\",VLOOKUP(INDEX(campsByItinerary,numericItinerary($A27),BM$3-1),campInfo,8))","v":""},"Y","","Y","Y","Y","Y","","","","Y",{"$f":"IF(INDEX(campsByItinerary,numericItinerary($A27),BD$3-1)=\"\",\"\",VLOOKUP(INDEX(campsByItinerary,numericItinerary($A27),BD$3-1),campInfo,10))","v":"Y"},{"$f":"IF(INDEX(campsByItinerary,numericItinerary($A27),BE$3-1)=\"\",\"\",VLOOKUP(INDEX(campsByItinerary,numericItinerary($A27),BE$3-1),campInfo,10))","v":""},{"$f":"IF(INDEX(campsByItinerary,numericItinerary($A27),BF$3-1)=\"\",\"\",VLOOKUP(INDEX(campsByItinerary,numericItinerary($A27),BF$3-1),campInfo,10))","v":""},{"$f":"IF(INDEX(campsByItinerary,numericItinerary($A27),BG$3-1)=\"\",\"\",VLOOKUP(INDEX(campsByItinerary,numericItinerary($A27),BG$3-1),campInfo,10))","v":""},{"$f":"IF(INDEX(campsByItinerary,numericItinerary($A27),BH$3-1)=\"\",\"\",VLOOKUP(INDEX(campsByItinerary,numericItinerary($A27),BH$3-1),campInfo,10))","v":"Y"},{"$f":"IF(INDEX(campsByItinerary,numericItinerary($A27),BI$3-1)=\"\",\"\",VLOOKUP(INDEX(campsByItinerary,numericItinerary($A27),BI$3-1),campInfo,10))","v":""},{"$f":"IF(INDEX(campsByItinerary,numericItinerary($A27),BJ$3-1)=\"\",\"\",VLOOKUP(INDEX(campsByItinerary,numericItinerary($A27),BJ$3-1),campInfo,10))","v":""},{"$f":"IF(INDEX(campsByItinerary,numericItinerary($A27),BK$3-1)=\"\",\"\",VLOOKUP(INDEX(campsByItinerary,numericItinerary($A27),BK$3-1),campInfo,10))","v":""},{"$f":"IF(INDEX(campsByItinerary,numericItinerary($A27),BL$3-1)=\"\",\"\",VLOOKUP(INDEX(campsByItinerary,numericItinerary($A27),BL$3-1),campInfo,10))","v":""},{"$f":"IF(INDEX(campsByItinerary,numericItinerary($A27),BM$3-1)=\"\",\"\",VLOOKUP(INDEX(campsByItinerary,numericItinerary($A27),BM$3-1),campInfo,10))","v":"Y"},null,"","","Y","","","","","","",{"$f":"INDEX(campsByItinerary,numericItinerary($A27),BD$3-1)","v":"Bluestem"},{"$f":"IF(INDEX(campsByItinerary,numericItinerary($A27),BE$3-1)=\"\",\"\",VLOOKUP(INDEX(campsByItinerary,numericItinerary($A27),BE$3-1),campInfo,2))","v":"North"},{"$f":"IF(INDEX(campsByItinerary,numericItinerary($A27),BF$3-1)=\"\",\"\",VLOOKUP(INDEX(campsByItinerary,numericItinerary($A27),BF$3-1),campInfo,2))","v":"North"},{"$f":"IF(INDEX(campsByItinerary,numericItinerary($A27),BG$3-1)=\"\",\"\",VLOOKUP(INDEX(campsByItinerary,numericItinerary($A27),BG$3-1),campInfo,2))","v":"North"},{"$f":"IF(INDEX(campsByItinerary,numericItinerary($A27),BH$3-1)=\"\",\"\",VLOOKUP(INDEX(campsByItinerary,numericItinerary($A27),BH$3-1),campInfo,2))","v":"Central"},{"$f":"IF(INDEX(campsByItinerary,numericItinerary($A27),BI$3-1)=\"\",\"\",VLOOKUP(INDEX(campsByItinerary,numericItinerary($A27),BI$3-1),campInfo,2))","v":"Central"},{"$f":"IF(INDEX(campsByItinerary,numericItinerary($A27),BJ$3-1)=\"\",\"\",VLOOKUP(INDEX(campsByItinerary,numericItinerary($A27),BJ$3-1),campInfo,2))","v":"Central"},{"$f":"IF(INDEX(campsByItinerary,numericItinerary($A27),BK$3-1)=\"\",\"\",VLOOKUP(INDEX(campsByItinerary,numericItinerary($A27),BK$3-1),campInfo,2))","v":"Central"},{"$f":"IF(INDEX(campsByItinerary,numericItinerary($A27),BL$3-1)=\"\",\"\",VLOOKUP(INDEX(campsByItinerary,numericItinerary($A27),BL$3-1),campInfo,2))","v":"Central"},{"$f":"IF(INDEX(campsByItinerary,numericItinerary($A27),BM$3-1)=\"\",\"\",VLOOKUP(INDEX(campsByItinerary,numericItinerary($A27),BM$3-1),campInfo,2))","v":"Central"},{"$f":"IF(INDEX(campsByItinerary,numericItinerary($A27),BD$3-1)=\"\",\"\",VLOOKUP(INDEX(campsByItinerary,numericItinerary($A27),BD$3-1),campInfo,12))","v":"North"},{"$f":"IF(INDEX(campsByItinerary,numericItinerary($A27),BE$3-1)=\"\",\"\",VLOOKUP(INDEX(campsByItinerary,numericItinerary($A27),BE$3-1),campInfo,12))","v":"North"},{"$f":"IF(INDEX(campsByItinerary,numericItinerary($A27),BF$3-1)=\"\",\"\",VLOOKUP(INDEX(campsByItinerary,numericItinerary($A27),BF$3-1),campInfo,12))","v":"North"},{"$f":"IF(INDEX(campsByItinerary,numericItinerary($A27),BG$3-1)=\"\",\"\",VLOOKUP(INDEX(campsByItinerary,numericItinerary($A27),BG$3-1),campInfo,12))","v":"North"},{"$f":"IF(INDEX(campsByItinerary,numericItinerary($A27),BH$3-1)=\"\",\"\",VLOOKUP(INDEX(campsByItinerary,numericItinerary($A27),BH$3-1),campInfo,12))","v":"North & South"},{"$f":"IF(INDEX(campsByItinerary,numericItinerary($A27),BI$3-1)=\"\",\"\",VLOOKUP(INDEX(campsByItinerary,numericItinerary($A27),BI$3-1),campInfo,12))","v":"South"},{"$f":"IF(INDEX(campsByItinerary,numericItinerary($A27),BJ$3-1)=\"\",\"\",VLOOKUP(INDEX(campsByItinerary,numericItinerary($A27),BJ$3-1),campInfo,12))","v":"South"},{"$f":"IF(INDEX(campsByItinerary,numericItinerary($A27),BK$3-1)=\"\",\"\",VLOOKUP(INDEX(campsByItinerary,numericItinerary($A27),BK$3-1),campInfo,12))","v":"South"},{"$f":"IF(INDEX(campsByItinerary,numericItinerary($A27),BL$3-1)=\"\",\"\",VLOOKUP(INDEX(campsByItinerary,numericItinerary($A27),BL$3-1),campInfo,12))","v":"South"},{"$f":"IF(INDEX(campsByItinerary,numericItinerary($A27),BM$3-1)=\"\",\"\",VLOOKUP(INDEX(campsByItinerary,numericItinerary($A27),BM$3-1),campInfo,12))","v":"South"},{"$f":"getfoodPU(\"First\",numericItinerary($A27))","v":3},{"$f":"getfoodPU(\"Max\",numericItinerary($A27))","v":5}]
[null,null,null,null,null,null,null,null,null,null,null,null,null,null,null,null,null,null,null,null,null,null,null,null,null,null,null,null,null,null,{"$f":"COUNTIF(AE4:AE27,\"y\")","v":11},{"$f":"COUNTIF(AF4:AF27,\"y\")","v":2},8,15,12,3]
[null,null,null,null,null,null,null,null,null,null,null,null,null,null,null,null,null,null,null,null,null,null,null,null,null,null,null,null,null,null,"Mountaineering includes itineraries that climb Big Red, Black Mountain, Bonito Peak, Comanche Peak, Hart Mountain, Little Costilla Peak, Lookout Peak, or Shaefers Peak.",null,null,null,null,null," ",null,null,null,null,null,null,null,null,null,null,null,null,null,null,null,null,null,null,null,null,null,null,null,null,null,null,null,null,null,null,null,null,null,null,null,null,null,null,null,null,null,null,null,null,null,null,null,null,null,null,null,null,null,null,null,null,null,null,null,null,null,null,null,null,null,null,null,null,null,null,null,null,null,null,null,null,"Min",{"$f":"MIN(foodPUfirst)","v":1},{"$f":"MIN(foodPUdays)","v":2}]
[null,null,null,null,null,null,null,null,null,null,null,null,null,null,null,null,null,null,null,null,null,null,null,null,null,null,null,null,null,null,null,null,null,null,null,null," ",null,null,null,null,null,null,null,null,null,null,null,null,null,null,null,null,null,null,null,null,null,null,null,null,null,null,null,null,null,null,null,null,null,null,null,null,null,null,null,null,null,null,null,null,null,null,null,null,null,null,null,null,null,null,null,null,null,null,null,null,null,null,null,null,null,null,null,null,null,null,null,null,null,null,null,null,"Max",{"$f":"MAX(DL5:DL27)","v":4},{"$f":"MAX(foodPUdays)","v":5}]

{"sheet":"ItineraryPrograms","index":11,"n_rows":29,"n_cols":58,"rows_kept":29,"cut":false,"hidden":true,"merged":[[0,0,1,0]]}
["Itinerary",null,1,{"$f":"C1+1","v":2},{"$f":"D1+1","v":3},4,5,6,7,8,9,10,11,12,13,14,15,16,17,18,19,20,21,22,23,24,25,26,27,28,29,30,31,32,33,34,35,36,37,38,39,40,41,42,43,44,45,46,47,48,{"$f":"AX1+1","v":49},{"$f":"AY1+1","v":50},{"$f":"AZ1+1","v":51},{"$f":"BA1+1","v":52},{"$f":"BB1+1","v":53},{"$f":"BC1+1","v":54},{"$f":"BD1+1","v":55},{"$f":"BE1+1","v":56}]
[null,null,{"$f":"INDEX(program_table,C1,1)","v":"Climbing: Bouldering Gym"},"Climbing: Climbing Wall/Tower",{"$f":"INDEX(program_table,E1,1)","v":"Climbing: Crate Stacking"},"Climbing: Rock Climbing","COPE: High Challenge Course","COPE: Initiative Games","COPE: Low Challenge Course","Ecology: Demonstration Forest","Ecology: Self-Guided Fishing","Evening: Abreu Family Dinner","Evening: Advisor Coffee","Evening: Campfire Show","Evening: Chuckwagon Dinner","Historical: Adobe Brick-Making","Historical: Blacksmithing","Historical: Cabin Restoration","Historical: Cabin/House Tour","Historical: Crafting","Historical: Crosscut & Tie Making","Historical: Flint Knapping","Historical: Fur Trapper Rendezvous","Historical: Gold Panning","Historical: Mine Tour","Historical: Petroglyph Tour","Historical: Pump Car Rides","Historical: Railroad Construction","Historical: Spar Pole Climbing","Landmarks: Baldy Mountain","Landmarks: Inspiration Point","Landmarks: Mount Phillips","Landmarks: Mountaineering","Landmarks: Tooth of Time","Landmarks: Trail Peak","Livestock: Animal Husbandry","Livestock: Burro Packing","Livestock: Chicken Tending","Livestock: Horse Rides","Low Impact Camping","Range Sports: 3D Archery","Range Sports: Aerial Archery","Range Sports: Atlatl Throwing","Range Sports: Cartridge Reloading","Range Sports: Cowboy Action Shooting","Range Sports: Field Archery","Range Sports: Muzzleloader Shooting","Range Sports: Rifle Shooting","Range Sports: Shotgun Shooting","Range Sports: Shotshell Reloading",{"$f":"INDEX(program_table,AY1,1)","v":"Range Sports: Tomahawk Throwing"},"STEM: Archeology","STEM: Astronomy",{"$f":"INDEX(program_table,BB1,1)","v":"STEM: Geology"},"y","Western Lore: Cantina","Western Lore: Roping","Wheeled: Mountain Biking"]
[{"$f":"Itineraries!A3","v":"12-1"},{"$f":"COUNTIF(C3:BF3,\"y\")","v":23},null,"y",null,null,"y","y","y",null,"y","y","y","y",null,"y",null,null,"y","y","y","y",null,null,null,null,null,null,"y",null,"Y",null,null,"Y",null,"y",null,"y",null,null,"y","y",null,null,null,null,null,null,null,null,null,null,null,null,"y","y","y"]
[{"$f":"Itineraries!A4","v":"12-2"},{"$f":"COUNTIF(C4:BF4,\"y\")","v":18},null,null,null,"y",null,"y","y",null,null,null,"y","y",null,null,"y",null,null,null,"y",null,"y","y",null,null,null,null,"y","Y",null,null,null,null,null,null,null,null,null,null,"y","y",null,null,null,"y",null,null,null,null,"y",null,null,"y",null,"y","y"]
[{"$f":"Itineraries!A5","v":"12-3"},15,null,null,null,null,null,"y","y",null,null,null,"y","y",null,null,"y",null,"y",null,null,null,null,null,null,"y",null,"y",null,null,null,null,null,null,null,"y",null,"y",null,"y",null,null,null,null,null,null,null,null,null,null,null,"y","y",null,"y",null,null,"y"]
[{"$f":"Itineraries!A6","v":"12-4"},21,null,null,null,null,null,"y","y",null,null,null,"y","y","y",null,"y",null,null,null,"y",null,"y","y",null,null,"y","y",null,"Y",null,null,null,null,null,null,"y",null,"y",null,null,null,null,null,"y",null,"y",null,null,null,"y",null,null,"y","y","y","y"]
[{"$f":"Itineraries!A7","v":"12-5"},20,null,null,null,null,null,null,null,null,"y","N","y",null,null,"y",null,"y","y","y","y","y",null,null,null,null,null,null,null,null,null,"Y","Y",null,null,"y",null,"y",null,"y","y","y",null,null,null,null,"y",null,null,null,"y",null,null,null,"y","y","y"]
[{"$f":"Itineraries!A8","v":"12-6"},17,"y","y","y","y","y",null,null,"y",null,null,"y",null,null,null,null,null,null,null,null,null,"y","y",null,null,null,null,null,"Y",null,null,null,null,null,null,"n",null,null,null,"y","y",null,null,null,"y","y",null,null,null,"y",null,null,"y",null,null,"y"]
[{"$f":"Itineraries!A9","v":"12-7"},18,null,null,null,null,null,"y","y",null,null,null,"y","y",null,null,"y",null,"y",null,null,null,"y","y",null,null,null,null,null,"Y",null,null,null,null,null,"y","n","y",null,"y",null,null,null,null,null,null,"y",null,null,null,"y",null,"y","y","y",null,null,"y"]
[{"$f":"Itineraries!A10","v":"12-8"},22,null,null,null,null,null,"y","y",null,null,null,"y","y",null,null,"y",null,null,null,"y",null,null,"y",null,"y","y","y","y","Y",null,null,"Y",null,null,null,null,null,null,null,"y","y","y",null,null,"y",null,null,null,null,null,"y","N","y","y","y","y","N"]
[{"$f":"Itineraries!A11","v":"12-9"},24,"y",null,null,"y",null,"y","y","y","y",null,"y","y","y",null,null,null,null,null,"y",null,"y",null,null,null,null,null,null,null,null,null,"Y","Y",null,null,"y",null,"y",null,"y","y",null,null,"y","y","y",null,null,null,"y",null,null,null,"y","y","y"]
[{"$f":"Itineraries!A12","v":"12-10"},27,null,null,null,null,null,"y","y",null,null,null,"y","y","y",null,"y",null,"y",null,"y",null,"y","y",null,null,"y","y",null,"Y",null,null,"Y",null,null,"y","y","y","y",null,"y","y",null,null,"y","y","y",null,null,null,"y",null,null,"y","y","y"]
[{"$f":"Itineraries!A13","v":"12-11"},20,"y",null,null,null,null,null,null,"y","y","N","y","y","y","y",null,"y","y","y","y",null,null,null,null,null,null,null,"y",null,null,null,"Y","Y",null,"y",null,"y","y",null,null,null,null,null,null,null,null,null,null,null,null,null,null,null,"y","y","y"]
[{"$f":"Itineraries!A14","v":"12-12"},23,"y","y","y","y",null,null,null,null,"y",null,"y","y","y","y",null,"y","y","y","y",null,null,null,null,null,null,null,null,null,null,"Y","Y","Y","Y","y",null,"y","y",null,null,null,null,null,null,null,null,null,null,null,"y",null,null,null,null,"y","y"]
[{"$f":"Itineraries!A15","v":"12-13"},18,"y","y","y","y",null,"y","y","y",null,null,"y","y","y",null,"y",null,null,null,null,null,null,"y","y",null,null,null,null,null,null,"Y","Y","Y",null,"y",null,null,"n",null,null,null,null,null,null,null,"y"]
[{"$f":"Itineraries!A16","v":"12-14"},19,"y",null,null,"y",null,"y","y","y","y",null,"y","y",null,null,null,null,"y",null,"y",null,null,null,null,null,null,null,null,null,null,null,null,null,null,"y",null,"y","y","y",null,null,null,null,null,null,null,null,"y","y",null,null,"y",null,"y",null,null,"y"]
[{"$f":"Itineraries!A17","v":"12-15"},24,"y","y","y","y",null,null,null,null,null,null,"y","y","y",null,"y",null,"y",null,"y",null,null,"y","y",null,null,null,null,null,null,"Y","Y","Y","Y","y",null,"y","n",null,null,null,null,"y",null,null,null,"y",null,null,"y",null,null,"y","y",null,"y"]
[{"$f":"Itineraries!A18","v":"12-16"},24,"y","y","y","y",null,null,null,null,"y",null,"y","y","y","y","y",null,"y","y",null,"y",null,null,null,null,null,null,null,null,null,"Y","Y","Y",null,"y",null,"y","n",null,"y","y",null,null,null,null,null,null,null,null,"y",null,null,null,"y","y","y"]
[{"$f":"Itineraries!A19","v":"12-17"},28,"y","y","y","y",null,null,null,null,"y",null,"y","y",null,null,"y",null,"y",null,"y","y",null,"y","y",null,null,null,"y",null,null,"Y","Y","Y","Y","y",null,"y",null,"y","y","y",null,null,null,"y",null,null,null,null,"y",null,null,"y","y",null,"y"]
[{"$f":"Itineraries!A20","v":"12-18"},19,null,null,null,null,null,"y","y",null,null,null,"y","y","y",null,"y",null,null,null,"y",null,null,"y",null,null,null,null,"y","Y",null,null,"Y",null,null,null,"n",null,"n",null,"y","y",null,null,"y","y",null,null,null,null,null,null,null,"y","y","y","y"]
[{"$f":"Itineraries!A21","v":"12-19"},21,"y",null,null,null,null,"y","y",null,null,null,"y","y","y",null,null,null,"y",null,null,"y",null,null,null,null,null,null,null,null,"Y","Y","Y","Y",null,"y",null,"y","n",null,"y","y",null,"y",null,null,null,"y",null,null,"y",null,null,null,"y",null,"y"]
[{"$f":"Itineraries!A22","v":"12-20"},19,null,null,null,null,null,"y","y",null,null,null,"y","y","y",null,null,null,null,null,null,null,"y","y",null,null,null,null,null,"Y",null,null,null,null,null,null,"y",null,"n","y",null,null,null,null,"y",null,"y",null,null,null,"y",null,"y","y","y","y","y","y"]
[{"$f":"Itineraries!A23","v":"12-21"},29,"y","y","y","y","y",null,null,"y","y","y","y","y",null,"y","y","y","y","y","y",null,null,"y","y",null,null,null,null,null,null,"Y","Y","Y",null,"y",null,"y",null,null,null,null,null,null,null,null,"y",null,null,null,"y",null,null,"y","y","y","y"]
[{"$f":"Itineraries!A24","v":"12-22"},24,null,null,null,"y",null,"y","y",null,null,null,"y","y","y",null,"y",null,null,null,"y",null,"y","y",null,null,null,null,"y","Y",null,null,null,null,null,null,"n",null,"n",null,"y","y",null,null,"y","y","y",null,"y","y","y",null,null,"y","y","y","y"]
[{"$f":"Itineraries!A25","v":"12-23"},22,"y","y","y","y",null,"y","y",null,null,null,"y","y","y",null,null,null,null,null,"y",null,"y",null,null,null,null,null,"y","Y",null,null,"Y","Y",null,null,null,null,"y",null,"y","y",null,null,null,"y",null,null,null,null,"y",null,null,null,"y",null,"y"]
[{"$f":"Itineraries!A26","v":"12-24"},23,"y",null,null,"y",null,"y","y","y",null,null,"y","y",null,null,"y",null,null,null,"y",null,"y","y","y",null,null,null,"y","Y",null,null,"Y","Y",null,null,null,null,null,null,null,null,null,"y",null,null,null,"y",null,null,"y",null,null,"y","y","y","y"]
[null,null,{"$f":"COUNTIF(C3:C26,\"y\")","v":13},9,8,13,3,16,16,7,9,2,24,22,13,6,14,4,13,6,17,5,10,14,5,2,3,4,9,11,2,8,15,12,{"$f":"COUNTIF(AI3:AI26,\"y\")","v":3},14,4,13,7,6,13,13,1,3,6,9,10,3,2,2,17,2,4,13,20,15,19,4]
[null,null,{"$f":"C2","v":"Climbing: Bouldering Gym"},"Climbing: Climbing Wall/Tower","Climbing: Crate Stacking","Climbing: Rock Climbing","COPE: High Challenge Course","COPE: Initiative Games","COPE: Low Challenge Course","Ecology: Demonstration Forest","Ecology: Self-Guided Fishing","Evening: Abreu Family Dinner","Evening: Advisor Coffee","Evening: Campfire Show","Evening: Chuckwagon Dinner","Historical: Adobe Brick-Making","Historical: Blacksmithing","Historical: Cabin Restoration","Historical: Cabin/House Tour","Historical: Crafting","Historical: Crosscut & Tie Making","Historical: Flint Knapping","Historical: Fur Trapper Rendezvous","Historical: Gold Panning","Historical: Mine Tour","Historical: Petroglyph Tour","Historical: Pump Car Rides","Historical: Railroad Construction","Historical: Spar Pole Climbing","Landmarks: Baldy Mountain","Landmarks: Inspiration Point","Landmarks: Mount Phillips",{"$f":"AG2","v":"Landmarks: Mountaineering"},{"$f":"AH2","v":"Landmarks: Tooth of Time"},"Landmarks: Trail Peak","Livestock: Animal Husbandry","Livestock: Burro Packing","Livestock: Chicken Tending","Livestock: Horse Rides","Low Impact Camping","Range Sports: 3D Archery","Range Sports: Aerial Archery",{"$f":"AQ2","v":"Range Sports: Atlatl Throwing"},"Range Sports: Cartridge Reloading","Range Sports: Cowboy Action Shooting","Range Sports: Field Archery",{"$f":"AU2","v":"Range Sports: Muzzleloader Shooting"},"Range Sports: Rifle Shooting","Range Sports: Shotgun Shooting",{"$f":"AX2","v":"Range Sports: Shotshell Reloading"},"Range Sports: Tomahawk Throwing","STEM: Archeology","STEM: Astronomy","STEM: Geology","y","Western Lore: Cantina","Western Lore: Roping","Wheeled: Mountain Biking"]
[null,null,null,null,null,null,null,null,null,null,null,null,null,null,null,null,null,null,null,null,null,null,null,null,null,null,null,null,null,null,null,null,null,null,null,null,null,null,0]

{"sheet":"Descriptions","index":12,"n_rows":25,"n_cols":4,"rows_kept":25,"cut":false,"hidden":true,"merged":[]}
["Length","Itinerary","Description"," "]
[{"$f":"LEN(C2)","v":824},{"$f":"Itineraries!A3","v":"12-1"},"Introduce yourself to much of Philmont's South Country in this twelve day program-focused expedition. You'll have plenty of opportunity to take advantage of a mix of high adventure and living history programs while taking in beautiful views of rivers, meadows, mesas, and peaks. Starting at the Zastrow Trailhead you'll head up in elevation and make your way to Stonewall pass with views into the plains. From there you'll continue into the mountains reaching the beautiful Beaubien Meadow and traverse the canyons to Philmont's Southwest region. Follow the Rayado river back east and head and over Urraca Mesa to enjoy scenic views of the Tooth of Time from the Lover's Leap region. If the crew is up to it, you'll have the opportunity to hike to the very top of this iconic rock formation before heading back to base camp!"," "]
[{"$f":"LEN(C3)","v":377},{"$f":"Itineraries!A4","v":"12-2"},"This is a north-country program-focused itinerary that incorporates the popular and scenic Baldy Mountain region. Mileage is relatively low to allow plenty of time to take advantage of a mix of living history and adventure program. There is quite a bit of elevation gain in this itinerary, so be sure your crew is physically prepared and ready for an early start on summit day!"," "]
[556,{"$f":"Itineraries!A5","v":"12-3"},"Enjoy the Philmont's north-country along with the scenic Valle Vidal in this program focused itinerary. You'll start just north of the 2018 Ute Park Fire recovery area and traverse Dean Skyline and the iconic Wilson Mesa before heading up the Middle Ponil River into the Valle Vidal of the Carson National Forest. Explore Shuree Ponds, Windy Gap, old homesteads, and abandoned boom towns before heading back into Philmont's North Country. On your final days you'll have the opportunity to explore the rich history and pre-history of the North Ponil Canyon."," "]
[465,{"$f":"Itineraries!A6","v":"12-4"},"This North Country itinerary offers more opportunity for program while still having the chance to summit Philmont’s highest peak. Before and after making your way up down the summit of Baldy Mountain you will have the opportunity to take part in a wide variety of western lore, living history, and teambuilding programs in the North Ponil, South Ponil, Dean Skyline, and Miranda regions. You will also have the addition of a helpful burro for a leg of your journey!"," "]
[631,{"$f":"Itineraries!A7","v":"12-5"},"This south-country itinerary offers several scenic peaks along with the opportunity to learn about early settlers of northern New Mexico. Take time to enjoy the history and views of the area as you hike along the Rayado creek far into Philmont's western mountains. You'll be following in the footsteps of fur trappers, pioneer homesteaders, loggers, and cowboys with plenty of opportunities to learn about their lives while taking part in unique living history programs. Enjoy the scenic vistas along the Beaubien meadow before taking in the views from Fowler Pass and Stonewall Pass and wrapping up your adventure at Lover's Leap."," "]
[538,{"$f":"Itineraries!A8","v":"12-6"},"This rugged conservation-focused itinerary traverses from the South country to the North country and provides the opportunity to earn the prestigious 50-Miler Award. You will be able to discover the ecological diversity of Philmont's backcountry while keeping a good balance of hiking and program opportunities traversing rivers, mountain ridges, canyons, burn scars, and peaks. Program opportunities include a mix of living history and rock climbing and the whole trek culminates with a Summit of Philmont's highest peak, Baldy Mountain."," "]
[535,{"$f":"Itineraries!A9","v":"12-7"},"This itinerary begins by heading far north from the Ponil country into the breathtaking Valle Vidal of the Carson National Forest. There you will have the opportunity to visit historic homesteads and take part in Mountain Biking program. From there you'll enter the remote canyons of the Greenwood Tract on your way to the bustling Baldy Mining District. After an early summit to the12,441 foot summit of Baldy Mountain, you'll descend along Ute Creek to the scenic meadows surrounding Miranda to take part in a fur trapper rendezvous."," "]
[634,{"$f":"Itineraries!A10","v":"12-8"},"This rugged itinerary provides a wealth of living history experiences with a little bit of high adventure program mixed in as well. Start your journey with prehistoric dinosaur tracks and petroglyphs as you head deep into the North Ponil Canyon. Move forward in time and learn from railroaders, loggers, and cowboys as you traverse canyons and ridges making your way towards Baldy Mountain, Philmont's highest summit at 12,441 feet. Swing by the Fur Trapper Rendezvous at Miranda before transitioning to the present day with some high adventure programs. Be sure to soak up the iconic views of Baldy as you wrap things up in Ute Park."," "]
[663,{"$f":"Itineraries!A11","v":"12-9"},"This rugged itinerary winds North to South allowing you to experience the diverse environments and programs of the Philmont backcountry. Start your journey in the historic Ponil canyon, make a quick visit into the 2018 Ute Park burn scar and wind your way up canyons and ridges to the peak of Baldy Mountain. Along the way you will pick up a friendly burro and experience a variety of high adventure and living history programs. Head back across the burn scar over Ute Park Pass to enjoy climbing program and central country views around Cimarroncito. Finally your trek will culminate with an exciting summit of the famous Tooth of Time and a hike into base camp."," "]
[674,{"$f":"Itineraries!A12","v":"12-10"},"Experience the beauty of Philmont’s North Country as you loop around the region on this rugged journey. Offering a good mix of hiking and program, this itinerary provides opportunities to see this land from the perspective of those living in the late 1800s through today! Start in Ute Park previewing your route with iconic views of Baldy Mountain. Hike through the site of an old west shootout and over ridges into the historic Ponil Region where you'll encounter cowboys, homesteaders, railroads, and the loggers that supported them. As you approach the Summit of Baldy Mountain, you'll visit the mining districts before wrapping things up at the beautiful Miranda Meadow."," "]
[616,{"$f":"Itineraries!A13","v":"12-11"},"This South Country tour of Philmont summits iconic peaks, spans beautiful meadows, follows waterways, and traverses picturesque ridges while providing opportunities for unique historical programs. Experience this unique and diverse area of New Mexico as homesteaders, ranchers, and loggers as you take full advantage of the geography and ecology of this region. Be sure to look back at what you've accomplished as you crest the Tooth of Time on your hike back into base camp. Ensure your crew can enjoy all of the views offered by this itinerary by being physically prepared for the elevation gained on this journey."," "]
[615,{"$f":"Itineraries!A14","v":"12-12"},"If your crew enjoys taking in views from high peaks, this might be an itinerary to consider. Explore over seven named peaks in Philmont's south country with a program focused on living history from different eras of Philmont's past. You'll make your way up the Rayado Creek and further into the mountains until reaching the top of Mount Phillips. From there you'll traverse many other peaks including the Tooth of Time and hike back into base camp. While mileage is relatively low on this itinerary, there are significant elevation gains which your crew will need to be physically and mentally prepared to overcome."," "]
[464,{"$f":"Itineraries!A15","v":"12-13"},"This south country itinerary is all about ascending to height! This trek offers multiple opportunities for rock climbing programs, Low COPE, High COPE, over five named peaks, and some living history program mixed in there as well. If your crew is physically and mentally prepared for the challenge of elevation gain and can get early starts, they should have ample time to take part in the unique backcountry experiences offered all around this region of Philmont."," "]
[731,{"$f":"Itineraries!A16","v":"12-14"},"This itinerary provides a unique mix of program opportunities as your crew explores the Valle Vidal as well as Philmont's North Country and Central Country. Head North from the Ponil region high into the Valle Vidal of the Carson National Forest to take part in mountain biking program at Whiteman Vega. Then you'll head south along the Middle Ponil Canyon and over the beautiful Wilson Mesa taking part in living history programs along the way as time allows. From there you'll head into the Dean Country and into the 2018 Ute Park Burn Scar where there will be opportunities for rock climbing and shotgun shooting. As things wrap up you'll encounter varying landscapes through Ute Gulch, Hidden Valley and Cimarroncito Reservoir."," "]
[429,{"$f":"Itineraries!#REF!","v":{"$error":"#REF!"}},"While strenuous due to elevation gain, this itinerary is a Philmont South Country classic. Starting at Lover's Leap and hiking into base over the Tooth of Time, it includes multiple iconic peaks and opportunities for rock climbing, western lore, living history, and shooting sports along the way. If your crew is prepared for a physical challenge, this itinerary will provide opportunities for much of what Philmont has to offer."," "]
[568,{"$f":"Itineraries!#REF!","v":{"$error":"#REF!"}},"This strenuous itinerary is focused on the experience of the hike as it pushes along the boundaries of Philmont's South Country. This will provide opportunities for summits like Mount Phillips, Comanche Peak, Lookout Peak, and the iconic Tooth of Time. Your crew will have opportunities for some program as you pass through staffed camps, but often opt to overnight in trail camps for a bigger sense of adventure and solitude. Exceptions to this would include Jicarilla Apache life at Apache Springs, western lore program at Beaubien, and rock climbing at Miners Park."," "]
[1356,{"$f":"Itineraries!#REF!","v":{"$error":"#REF!"}},"Explore Philmont’s southwestern corner on this hiking-focused itinerary that begins in the heart of the 2018 Ute Park Fire recovery area. From your Ranger training camp at Minnette Meadows, hike through Ute Park Pass and Hidden Valley to Cimarroncito for climbing and rappelling. Ascend the wild North Fork Cimarroncito Creek to Cyphers Mine and the Stomp. Climb up to Thunder Ridge, cross Comanche Peak, and spend the night atop Mt Phillips (11,736’), the second highest peak at Philmont. Continue down the new, OA-constructed, trail through Clear Creek then up in the shadow of Garcia Peak to remote Wild Horse trail camp. Then follow the western edge of the Ranch, above Wild Horse Park, through Crooked Creek to Apache Springs to learn more about Jicarilla Apache life. From there, cross Buck Creek, pass through Beaubien, and climb Trail Peak (10,250’) to see the remains of a WWII B-24 bomber that crashed here. Continue through Fowler Pass to visit the Continental Tie & Lumber Company at Crater Lake. Take a short hike north to Miners Park for more climbing before starting your walk back into Base Camp. Cross rippling North Fork Urraca Creek and climb up onto Tooth Ridge. Summit the iconic Tooth of Time (9,003’) before resting at Tooth Ridge trail camp for you last night on the trail. For there, it’s an easy walk to Camping HQ in the morning."," "]
[1082,{"$f":"Itineraries!#REF!","v":{"$error":"#REF!"}},"This tour of the Philmont central and north country is for crews looking for a true wilderness backpacking experience with moderately high mileage days and nights at 5 trail camps. Start with two days hiking through the 2018 Ute Park Fire recovery area crossing Deer Lake Mesa and passing through Ute Park Pass on your way to Minnette Meadows trail camp. Cross into the north country at Bear Canyon and spend the night at Mistletoe trail camp. Traverse above Dean Canyon and across the head of Santa Claus Canyon on your way to team building and challenge events at Head of Dean. Work your way up the Baldy Skyline with excellent views of Baldy Mountain ahead of you and the plains behind. Spend two nights at Baldy Town to support your summit of Baldy Mountain (12,441’), the highest mountain at Philmont. Pass through French Henry on your way down the gently flowing South Ponil Creek to Pueblano for the Continental Tie & Lumber Company meeting. Climb up onto the ridge for one more night at a trail camp before heading into Ponil for the Cantina and a western chuck wagon dinner"," "]
[1553,{"$f":"Itineraries!#REF!","v":{"$error":"#REF!"}},"Circumnavigate Philmont’s south country on one of the few itineraries that has you hike out of Base Camp to start and ends by hiking into Base Camp. There are some long days with amazing scenary. Hike from Camping HQ to Magpie for Ranger training, then on to Urraca for ghost stories and the morning view from Inspiration Point. In the next two day, you’ll traverse three mountain passes: through Stone Wall Pass and Crater Lake then over Fowler Pass to Lower Bonito in rugged Bonito Creek canyon, then through Webster Pass, with a side hike to summit Lookout Peak, through Fish Camp and up the verdant Aqua Fria creek valley to Apache Springs and a chance to learn more about Jicarilla Apache life. Hike up the southwestern edge of the Ranch dropping in at Crooked Creek for some homesteading activities and on to remote Wild Horse trail camp. From there, pass through Clear Creek to visit the Rocky Mountain Fur Company and spend the night on top of Mt Phillips (11,736’), the second highest peak at Philmont. Follow the ridge over Comanche Peak and over Thunder Ridge to Whistle Punk trail camp, then on to Sawmill for the Rifle Shooting and Reloading program. Your longest day of the trek goes through the 2018 Ute Park Fire recovery area passing through Ute Park Pass, Ute Gulch commissary, and Hidden Valley on your way to Clarks Fork and a chuck wagon dinner. Then up to Tooth Ridge and summit the iconic Tooth of Time (9,003’) on your way to the last night on the trail at Tooth Ridge trail camp. It’s an easy walk into Base Camp in the morning."," "]
[1235,{"$f":"Itineraries!#REF!","v":{"$error":"#REF!"}},"This high mileage itinerary takes you to some of the most remote and beautiful spots in the Philmont backcountry. Start in Ponil at the Cantina to fortify yourself with a glass of root beer, then head on the ridge above Middle Ponil Creek canyon to dry Horse Canyon trail camp for Ranger training. Continue to Dan Beard, the northernmost camp on Philmont’s property for team building and COPE. For the next four days, you’ll hike cross-country through the pastoral Valle Vidal for astronomy, mountain biking, and a stream restoration project in the incredible McCrystal Creek area – within sight of Windy Gap and The Rock Wall. Finish your time in the Valle at remote Iris Park Low Impact Camp. Make your way through the isolated Greenwood Canyon back onto Philmont property at Copper Park. Take a couple of days in Copper Park to rest and summit Baldy Mountain (12,441’), the tallest peak at Philmont, then cross to the other side of the mountain at Miranda to visit the Rocky Mountain Fur Company and pick up your burro for the trek back to Ponil. Go through Baldy Skyline with great views of Baldy behind you and the open plains ahead of you, then celebrate your accomplishments with another root beer and the Cantina show at Ponil."," "]
[1229,{"$f":"Itineraries!#REF!","v":{"$error":"#REF!"}},"Circumnavigate Philmont’s south country on this high mileage adventure that visits a variety of Philmont’s history camps and two iconic peaks for a true overview of backpacking in the Southwest. From your Ranger training camp at Magpie, skirt the western edge of Urraca Mesa, climbing through Stone Wall Pass, and into Abreu for a stop at the Cantina. Pass through Crater Lake and the Continental Tie & Lumber Company enroute to climbing at Miners Park. Head up the idyllic North Fork Urraca to Black Mountain camp, then cross the ridge below Bonito Peak to pass through Beaubien and Phillips Junction on your way to experience homesteading at quiet Crooked Creek. Then it’s up the peaceful, rippling Rayado Creek valley passing through the Rocky Mountain Fur Company at Clear Creek to camp that night on top of Mt Phillips (11,736’), the second highest peak at Philmont. Swing down to Cypher Mine to attend the Stomp, then on to Cimarroncito for some climbing on your well-deserved layover day. Visit the Western Program at Clarks Fork on your way to Ponderosa Park trail camp for your last night on the trail. In the morning, summit the iconic Tooth of Time (9,003’) then hike into Camping HQ down the scenic Tooth Ridge trail."," "]
[838,{"$f":"Itineraries!#REF!","v":{"$error":"#REF!"}},"Begin your Philmont adventure by hiking into the middle of the 2018 Ute Park Fire recovery area at Deer Lake Mesa. Spend three days traversing and exploring the burn recovery area crossing into Philmont’s north country through Turkey Creek Canyon. Continue through Dean Canyon and over Dean Skyline to Ponil to enjoy the cantina and evening campfire show. Then it’s a hike up the pastoral South Ponil Creek canyon to the Continental Tie & Lumber Company meeting. Start your 3-day assault on Baldy Mountain (12,441’), the highest peak at Philmont by climbing to Azure trail camp in the shadow of Baldy with excellent views over the plains to the east. Celebrate your summit success, then through Miranda and the Mountain Man Rendezvous, to Head of Dean for Challenge Events, and on to Mistletoe trail camp for your last night on the trail."," "]
[1068,{"$f":"Itineraries!#REF!","v":{"$error":"#REF!"}},"Tour Philmont’s south country, spend 2 days hiking through the recovering Ute Park fire area, and cross the north country in this hiking-focused itinerary that takes you to some of the more remote Philmont trail camps and features some big mileage days. After two nights in the south country, cross Tooth Ridge into the Cimarroncito watershed. It’s still early in your trek, so if you feel ambitious, you can side hike the iconic Tooth of Time (9,003’). Then spend the next two days exploring the 2018 Ute Park fire burn and how the land is recovering. After completing your conservation project, head into the north country along the edge of the 2002 Ponil Complex fire to compare how the land recovers in 20 years. Get some rest and enjoy the views at Black Horse Creek Camp before summitting Baldy Mountain (12,441’), the highest peak at Philmont. Enjoy a night at the Continental Tie & Lumber Company for the company meeting before hiking along the south fork of Ponil Creek into Dean Canyon and on into Trail Canyon to catch you ride back to Camping Headquarters."," "]
[989,{"$f":"Itineraries!#REF!","v":{"$error":"#REF!"}},"The most physically challenging itinerary at Philmont visits many of the less-traveled trail camps on the Ranch. Start your adventure hiking west across the Ranch up the beautiful South Ponil Canyon with a stop at the Continental Tie & Lumber Company for the company meeting. Rest up at Placer Camp with views down Baldy Skyline ridge before climbing Baldy Mountain, the highest peak at Philmont (12,441'). Hike down along the southern edge of the 2002 Ponil Complex fire that burned 92,194 acres in the Philmont north country and compare that 20-year recovery with the more recent 2018 Ute Park fire as you hike through Ute Park Pass and work on your conservation project. After an exciting evening at the Cyphers Mine Stomp, work your way down the picturesque Cimarroncito Creek canyon and continue up to Tooth Ridge. For your final day on the trail, summit the iconic Tooth of Time (9,003') and make your way down the Tooth Ridge trail to return to Camping HQ and your closing campfire."," "]

{"sheet":"Calculator","index":13,"n_rows":35,"n_cols":80,"rows_kept":35,"cut":false,"hidden":true,"merged":[[29,0,29,1]]}
["Calculate Individual Values Based on Tables & Scores",null,null,null,null,null,null,null,null,null,null,null,null,null,null,null,null,null,null,null,null,null,null,null,1,{"$f":"Y1+1","v":2},{"$f":"Z1+1","v":3},4,5,6,7,8,9,10,11,12,13,14,15,16,17,18,19,20,21,22,23,24,25,26,27,28,29,30,31,32,33,34,35,36,37,{"$f":"BI1+1","v":38},{"$f":"BJ1+1","v":39},{"$f":"BK1+1","v":40},{"$f":"BL1+1","v":41},42,{"$f":"BN1+1","v":43},{"$f":"BO1+1","v":44},{"$f":"BP1+1","v":45},{"$f":"BQ1+1","v":46},{"$f":"BR1+1","v":47},{"$f":"BS1+1","v":48},{"$f":"BT1+1","v":49},{"$f":"BU1+1","v":50},{"$f":"BV1+1","v":51},{"$f":"BW1+1","v":52},{"$f":"BX1+1","v":53},{"$f":"BY1+1","v":54},{"$f":"BZ1+1","v":55},{"$f":"CA1+1","v":56}]
[{"$f":"Itineraries!A2","v":"Itinerary"},"Ranking","Difficulty","Distance","Food from HQ","Days Food","Trail Camps","Dry Camps","Total Camps","Max Altitude","Total Gain","Daily Change","Hike Out","Hike In","Landmarks: Baldy Mountain","Landmarks: Mount Phillips","Landmarks: Tooth of Time","Landmarks: Inspiration Point","Landmarks: Trail Peak","Landmarks: Mountaineering","South","Central","North","Valle Vidal",{"$f":"INDEX(program_table,Y$1)","v":"Climbing: Bouldering Gym"},{"$f":"INDEX(program_table,Z$1)","v":"Climbing: Climbing Wall/Tower"},{"$f":"INDEX(program_table,AA$1)","v":"Climbing: Crate Stacking"},{"$f":"INDEX(program_table,AB$1)","v":"Climbing: Rock Climbing"},{"$f":"INDEX(program_table,AC$1)","v":"COPE: High Challenge Course"},{"$f":"INDEX(program_table,AD$1)","v":"COPE: Initiative Games"},{"$f":"INDEX(program_table,AE$1)","v":"COPE: Low Challenge Course"},{"$f":"INDEX(program_table,AF$1)","v":"Ecology: Demonstration Forest"},{"$f":"INDEX(program_table,AG$1)","v":"Ecology: Self-Guided Fishing"},{"$f":"INDEX(program_table,AH$1)","v":"Evening: Abreu Family Dinner"},{"$f":"INDEX(program_table,AI$1)","v":"Evening: Advisor Coffee"},{"$f":"INDEX(program_table,AJ$1)","v":"Evening: Campfire Show"},{"$f":"INDEX(program_table,AK$1)","v":"Evening: Chuckwagon Dinner"},{"$f":"INDEX(program_table,AL$1)","v":"Historical: Adobe Brick-Making"},{"$f":"INDEX(program_table,AM$1)","v":"Historical: Blacksmithing"},{"$f":"INDEX(program_table,AN$1)","v":"Historical: Cabin Restoration"},{"$f":"INDEX(program_table,AO$1)","v":"Historical: Cabin/House Tour"},{"$f":"INDEX(program_table,AP$1)","v":"Historical: Crafting"},{"$f":"INDEX(program_table,AQ$1)","v":"Historical: Crosscut & Tie Making"},{"$f":"INDEX(program_table,AR$1)","v":"Historical: Flint Knapping"},{"$f":"INDEX(program_table,AS$1)","v":"Historical: Fur Trapper Rendezvous"},{"$f":"INDEX(program_table,AT$1)","v":"Historical: Gold Panning"},{"$f":"INDEX(program_table,AU$1)","v":"Historical: Mine Tour"},{"$f":"INDEX(program_table,AV$1)","v":"Historical: Petroglyph Tour"},{"$f":"INDEX(program_table,AW$1)","v":"Historical: Pump Car Rides"},{"$f":"INDEX(program_table,AX$1)","v":"Historical: Railroad Construction"},{"$f":"INDEX(program_table,AY$1)","v":"Historical: Spar Pole Climbing"},{"$f":"INDEX(program_table,AZ$1)","v":"Landmarks: Baldy Mountain"},{"$f":"INDEX(program_table,BA$1)","v":"Landmarks: Inspiration Point"},{"$f":"INDEX(program_table,BB$1)","v":"Landmarks: Mount Phillips"},{"$f":"INDEX(program_table,BC$1)","v":"Landmarks: Mountaineering"},{"$f":"INDEX(program_table,BD$1)","v":"Landmarks: Tooth of Time"},{"$f":"INDEX(program_table,BE$1)","v":"Landmarks: Trail Peak"},{"$f":"INDEX(program_table,BF$1)","v":"Livestock: Animal Husbandry"},{"$f":"INDEX(program_table,BG$1)","v":"Livestock: Burro Packing"},{"$f":"INDEX(program_table,BH$1)","v":"Livestock: Chicken Tending"},{"$f":"INDEX(program_table,BI$1)","v":"Livestock: Horse Rides"},{"$f":"INDEX(program_table,BJ$1)","v":"Low Impact Camping"},{"$f":"INDEX(program_table,BK$1)","v":"Range Sports: 3D Archery"},{"$f":"INDEX(program_table,BL$1)","v":"Range Sports: Aerial Archery"},{"$f":"INDEX(program_table,BM$1)","v":"Range Sports: Atlatl Throwing"},{"$f":"INDEX(program_table,BN$1)","v":"Range Sports: Cartridge Reloading"},{"$f":"INDEX(program_table,BO$1)","v":"Range Sports: Cowboy Action Shooting"},{"$f":"INDEX(program_table,BP$1)","v":"Range Sports: Field Archery"},{"$f":"INDEX(program_table,BQ$1)","v":"Range Sports: Muzzleloader Shooting"},{"$f":"INDEX(program_table,BR$1)","v":"Range Sports: Rifle Shooting"},{"$f":"INDEX(program_table,BS$1)","v":"Range Sports: Shotgun Shooting"},{"$f":"INDEX(program_table,BT$1)","v":"Range Sports: Shotshell Reloading"},{"$f":"INDEX(program_table,BU$1)","v":"Range Sports: Tomahawk Throwing"},{"$f":"INDEX(program_table,BV$1)","v":"STEM: Archeology"},{"$f":"INDEX(program_table,BW$1)","v":"STEM: Astronomy"},{"$f":"INDEX(program_table,BX$1)","v":"STEM: Geology"},{"$f":"INDEX(program_table,BY$1)","v":"Western Lore: Branding"},{"$f":"INDEX(program_table,BZ$1)","v":"Western Lore: Cantina"},{"$f":"INDEX(program_table,CA$1)","v":"Western Lore: Roping"},{"$f":"INDEX(program_table,CB$1)","v":"Wheeled: Mountain Biking"}]
[{"$f":"Itineraries!A3","v":"12-1"},{"$f":"SUM(C3:BU3)","v":11826.5},{"$f":"getScoreFactor(C$2,itineraryCamps!C4)","v":2500},{"$f":"getScoreFactor(D$2,\"Miles\") *itineraryCamps!D4","v":4600},{"$f":"getScoreFactor(E$2,Itineraries!B3)","v":40},{"$f":"getScoreFactor(F$2,Itineraries!C3)","v":80},{"$f":"getScoreFactor(G$2,Itineraries!D3)","v":100},{"$f":"getScoreFactor(H$2,Itineraries!E3)","v":100},{"$f":"getScoreFactor(I$2,Itineraries!G3)","v":60},{"$f":"getScoreFactor(J$2,Itineraries!J3)","v":50},{"$f":"getScoreFactor(K$2,Itineraries!K3)","v":60},{"$f":"getScoreFactor(L$2,Itineraries!L3)","v":100},{"$f":"IF(INDEX(startingTA,numericItinerary($A3))=$M$2,getScoreFactor(M$2,\"y\"),getScoreFactor(M$2,\"n\"))","v":0},{"$f":"IF(INDEX(endingTA,numericItinerary($A3))=$N$2,getScoreFactor(N$2,\"y\"),getScoreFactor(N$2,\"n\"))","v":500},{"$f":"IF(INDEX(baldyMountainHike,numericItinerary($A3))=\"\",\"\",getPeakScore(O$2))","v":""},{"$f":"IF(INDEX(mountPhillipsHike,numericItinerary($A3))=\"\",\"\",getPeakScore(P$2))","v":""},{"$f":"IF(INDEX(toothOfTimeHike,numericItinerary($A3))=\"\",\"\",getPeakScore(Q$2))","v":137.25},{"$f":"IF(INDEX(inspirationPointHike,numericItinerary($A3))=\"\",\"\",getPeakScore(Q$2))","v":137.25},{"$f":"IF(INDEX(trailPeakHike,numericItinerary($A3))=\"\",\"\",getPeakScore(S$2))","v":""},{"$f":"IF(INDEX(mountaineeringHike,numericItinerary($A3))=\"\",\"\",getPeakScore(T$2))","v":""},{"$f":"IF(areaImportant<>\"y\",\"\",IF(Itineraries!P3<>\"Y\",\"\",getareascore(U$2)))","v":200},{"$f":"IF(areaImportant<>\"y\",\"\",IF(Itineraries!Q3<>\"Y\",\"\",getareascore(V$2)))","v":""},{"$f":"IF(areaImportant<>\"y\",\"\",IF(Itineraries!R3<>\"Y\",\"\",getareascore(W$2)))","v":""},{"$f":"IF(areaImportant<>\"y\",\"\",IF(Itineraries!S3<>\"Y\",\"\",getareascore(X$2)))","v":""},{"$f":"IF(ItineraryPrograms!C3=\"y\",getScoreFactor(\"Program\",Y$2),\"\")","v":""},{"$f":"IF(ItineraryPrograms!D3=\"y\",getScoreFactor(\"Program\",Z$2),\"\")","v":337.5},{"$f":"IF(ItineraryPrograms!E3=\"y\",getScoreFactor(\"Program\",AA$2),\"\")","v":""},{"$f":"IF(ItineraryPrograms!F3=\"y\",getScoreFactor(\"Program\",AB$2),\"\")","v":""},{"$f":"IF(ItineraryPrograms!G3=\"y\",getScoreFactor(\"Program\",AC$2),\"\")","v":162},{"$f":"IF(ItineraryPrograms!H3=\"y\",getScoreFactor(\"Program\",AD$2),\"\")","v":166.5},{"$f":"IF(ItineraryPrograms!I3=\"y\",getScoreFactor(\"Program\",AE$2),\"\")","v":166.5},{"$f":"IF(ItineraryPrograms!J3=\"y\",getScoreFactor(\"Program\",AF$2),\"\")","v":""},{"$f":"IF(ItineraryPrograms!K3=\"y\",getScoreFactor(\"Program\",AG$2),\"\")","v":130.5},{"$f":"IF(ItineraryPrograms!L3=\"y\",getScoreFactor(\"Program\",AH$2),\"\")","v":91.5},{"$f":"IF(ItineraryPrograms!M3=\"y\",getScoreFactor(\"Program\",AI$2),\"\")","v":109.5},{"$f":"IF(ItineraryPrograms!N3=\"y\",getScoreFactor(\"Program\",AJ$2),\"\")","v":109.5},{"$f":"IF(ItineraryPrograms!O3=\"y\",getScoreFactor(\"Program\",AK$2),\"\")","v":""},{"$f":"IF(ItineraryPrograms!P3=\"y\",getScoreFactor(\"Program\",AL$2),\"\")","v":114},{"$f":"IF(ItineraryPrograms!Q3=\"y\",getScoreFactor(\"Program\",AM$2),\"\")","v":""},{"$f":"IF(ItineraryPrograms!R3=\"y\",getScoreFactor(\"Program\",AN$2),\"\")","v":""},{"$f":"IF(ItineraryPrograms!S3=\"y\",getScoreFactor(\"Program\",AO$2),\"\")","v":106.5},{"$f":"IF(ItineraryPrograms!T3=\"y\",getScoreFactor(\"Program\",AP$2),\"\")","v":145.5},{"$f":"IF(ItineraryPrograms!U3=\"y\",getScoreFactor(\"Program\",AQ$2),\"\")","v":93},{"$f":"IF(ItineraryPrograms!V3=\"y\",getScoreFactor(\"Program\",AR$2),\"\")","v":156},{"$f":"IF(ItineraryPrograms!W3=\"y\",getScoreFactor(\"Program\",AS$2),\"\")","v":""},{"$f":"IF(ItineraryPrograms!X3=\"y\",getScoreFactor(\"Program\",AT$2),\"\")","v":""},{"$f":"IF(ItineraryPrograms!Y3=\"y\",getScoreFactor(\"Program\",AU$2),\"\")","v":""},{"$f":"IF(ItineraryPrograms!Z3=\"y\",getScoreFactor(\"Program\",AV$2),\"\")","v":""},{"$f":"IF(ItineraryPrograms!AA3=\"y\",getScoreFactor(\"Program\",AW$2),\"\")","v":""},{"$f":"IF(ItineraryPrograms!AB3=\"y\",getScoreFactor(\"Program\",AX$2),\"\")","v":""},{"$f":"IF(ItineraryPrograms!AC3=\"y\",getScoreFactor(\"Program\",AY$2),\"\")","v":150},{"$f":"IF(ItineraryPrograms!AD3=\"y\",getScoreFactor(\"Program\",AZ$2),\"\")","v":""},{"$f":"IF(ItineraryPrograms!AE3=\"y\",getScoreFactor(\"Program\",BA$2),\"\")","v":154.5},{"$f":"IF(ItineraryPrograms!AF3=\"y\",getScoreFactor(\"Program\",BB$2),\"\")","v":""},{"$f":"IF(ItineraryPrograms!AG3=\"y\",getScoreFactor(\"Program\",BC$2),\"\")","v":""},{"$f":"IF(ItineraryPrograms!AH3=\"y\",getScoreFactor(\"Program\",BD$2),\"\")","v":91.5},{"$f":"IF(ItineraryPrograms!AI3=\"y\",getScoreFactor(\"Program\",BE$2),\"\")","v":""},{"$f":"IF(ItineraryPrograms!AJ3=\"y\",getScoreFactor(\"Program\",BF$2),\"\")","v":220.5},{"$f":"IF(ItineraryPrograms!AK3=\"y\",getScoreFactor(\"Program\",BG$2),\"\")","v":""},{"$f":"IF(ItineraryPrograms!AL3=\"y\",getScoreFactor(\"Program\",BH$2),\"\")","v":255},{"$f":"IF(ItineraryPrograms!AM3=\"y\",getScoreFactor(\"Program\",BI$2),\"\")","v":""},{"$f":"IF(ItineraryPrograms!AN3=\"y\",getScoreFactor(\"Program\",BJ$2),\"\")","v":""},{"$f":"IF(ItineraryPrograms!AO3=\"y\",getScoreFactor(\"Program\",BK$2),\"\")","v":181.5},{"$f":"IF(ItineraryPrograms!AP3=\"y\",getScoreFactor(\"Program\",BL$2),\"\")","v":220.5},{"$f":"IF(ItineraryPrograms!AQ3=\"y\",getScoreFactor(\"Program\",BM$2),\"\")","v":""},{"$f":"IF(ItineraryPrograms!AR3=\"y\",getScoreFactor(\"Program\",BN$2),\"\")","v":""},{"$f":"IF(ItineraryPrograms!AS3=\"y\",getScoreFactor(\"Program\",BO$2),\"\")","v":""},{"$f":"IF(ItineraryPrograms!AT3=\"y\",getScoreFactor(\"Program\",BP$2),\"\")","v":""},{"$f":"IF(ItineraryPrograms!AU3=\"y\",getScoreFactor(\"Program\",BQ$2),\"\")","v":""},{"$f":"IF(ItineraryPrograms!AV3=\"y\",getScoreFactor(\"Program\",BR$2),\"\")","v":""},{"$f":"IF(ItineraryPrograms!AW3=\"y\",getScoreFactor(\"Program\",BS$2),\"\")","v":""},{"$f":"IF(ItineraryPrograms!AX3=\"y\",getScoreFactor(\"Program\",BT$2),\"\")","v":""},{"$f":"IF(ItineraryPrograms!AY3=\"y\",getScoreFactor(\"Program\",BU$2),\"\")","v":""},{"$f":"IF(ItineraryPrograms!AZ3=\"y\",getScoreFactor(\"Program\",BV$2),\"\")","v":""},{"$f":"IF(ItineraryPrograms!BA3=\"y\",getScoreFactor(\"Program\",BW$2),\"\")","v":""},{"$f":"IF(ItineraryPrograms!BB3=\"y\",getScoreFactor(\"Program\",BX$2),\"\")","v":""},{"$f":"IF(ItineraryPrograms!BC3=\"y\",getScoreFactor(\"Program\",BY$2),\"\")","v":133.5},{"$f":"IF(ItineraryPrograms!BD3=\"y\",getScoreFactor(\"Program\",BZ$2),\"\")","v":285},{"$f":"IF(ItineraryPrograms!BE3=\"y\",getScoreFactor(\"Program\",CA$2),\"\")","v":114},{"$f":"IF(ItineraryPrograms!BF3=\"y\",getScoreFactor(\"Program\",CB$2),\"\")","v":""}]
[{"$f":"Itineraries!A4","v":"12-2"},{"$f":"SUM(C4:BU4)","v":12887},{"$f":"getScoreFactor(C$2,itineraryCamps!C5)","v":2500},{"$f":"getScoreFactor(D$2,\"Miles\") *itineraryCamps!D5","v":5800},{"$f":"getScoreFactor(E$2,Itineraries!B4)","v":40},{"$f":"getScoreFactor(F$2,Itineraries!C4)","v":80},{"$f":"getScoreFactor(G$2,Itineraries!E4)","v":50},{"$f":"getScoreFactor(H$2,Itineraries!H4)","v":225},{"$f":"getScoreFactor(I$2,Itineraries!G4)","v":60},{"$f":"getScoreFactor(J$2,Itineraries!J4)","v":50},{"$f":"getScoreFactor(K$2,Itineraries!K4)","v":60},{"$f":"getScoreFactor(L$2,Itineraries!L4)","v":100},{"$f":"IF(INDEX(startingTA,numericItinerary($A4))=$M$2,getScoreFactor(M$2,\"y\"),getScoreFactor(M$2,\"n\"))","v":0},{"$f":"IF(INDEX(endingTA,numericItinerary($A4))=$N$2,getScoreFactor(N$2,\"y\"),getScoreFactor(N$2,\"n\"))","v":0},{"$f":"IF(INDEX(baldyMountainHike,numericItinerary($A4))=\"\",\"\",getPeakScore(O$2))","v":351},{"$f":"IF(INDEX(mountPhillipsHike,numericItinerary($A4))=\"\",\"\",getPeakScore(P$2))","v":""},{"$f":"IF(INDEX(toothOfTimeHike,numericItinerary($A4))=\"\",\"\",getPeakScore(Q$2))","v":""},{"$f":"IF(INDEX(inspirationPointHike,numericItinerary($A4))=\"\",\"\",getPeakScore(Q$2))","v":""},{"$f":"IF(INDEX(trailPeakHike,numericItinerary($A4))=\"\",\"\",getPeakScore(S$2))","v":""},{"$f":"IF(INDEX(mountaineeringHike,numericItinerary($A4))=\"\",\"\",getPeakScore(T$2))","v":""},{"$f":"IF(areaImportant<>\"y\",\"\",IF(Itineraries!P4<>\"Y\",\"\",getareascore(U$2)))","v":""},{"$f":"IF(areaImportant<>\"y\",\"\",IF(Itineraries!Q4<>\"Y\",\"\",getareascore(V$2)))","v":150},{"$f":"IF(areaImportant<>\"y\",\"\",IF(Itineraries!R4<>\"Y\",\"\",getareascore(W$2)))","v":1000},{"$f":"IF(areaImportant<>\"y\",\"\",IF(Itineraries!S4<>\"Y\",\"\",getareascore(X$2)))","v":""},{"$f":"IF(ItineraryPrograms!C4=\"y\",getScoreFactor(\"Program\",Y$2),\"\")","v":""},{"$f":"IF(ItineraryPrograms!D4=\"y\",getScoreFactor(\"Program\",Z$2),\"\")","v":""},{"$f":"IF(ItineraryPrograms!E4=\"y\",getScoreFactor(\"Program\",AA$2),\"\")","v":""},{"$f":"IF(ItineraryPrograms!F4=\"y\",getScoreFactor(\"Program\",AB$2),\"\")","v":282},{"$f":"IF(ItineraryPrograms!G4=\"y\",getScoreFactor(\"Program\",AC$2),\"\")","v":""},{"$f":"IF(ItineraryPrograms!H4=\"y\",getScoreFactor(\"Program\",AD$2),\"\")","v":166.5},{"$f":"IF(ItineraryPrograms!I4=\"y\",getScoreFactor(\"Program\",AE$2),\"\")","v":166.5},{"$f":"IF(ItineraryPrograms!J4=\"y\",getScoreFactor(\"Program\",AF$2),\"\")","v":""},{"$f":"IF(ItineraryPrograms!K4=\"y\",getScoreFactor(\"Program\",AG$2),\"\")","v":""},{"$f":"IF(ItineraryPrograms!L4=\"y\",getScoreFactor(\"Program\",AH$2),\"\")","v":""},{"$f":"IF(ItineraryPrograms!M4=\"y\",getScoreFactor(\"Program\",AI$2),\"\")","v":109.5},{"$f":"IF(ItineraryPrograms!N4=\"y\",getScoreFactor(\"Program\",AJ$2),\"\")","v":109.5},{"$f":"IF(ItineraryPrograms!O4=\"y\",getScoreFactor(\"Program\",AK$2),\"\")","v":""},{"$f":"IF(ItineraryPrograms!P4=\"y\",getScoreFactor(\"Program\",AL$2),\"\")","v":""},{"$f":"IF(ItineraryPrograms!Q4=\"y\",getScoreFactor(\"Program\",AM$2),\"\")","v":123},{"$f":"IF(ItineraryPrograms!R4=\"y\",getScoreFactor(\"Program\",AN$2),\"\")","v":""},{"$f":"IF(ItineraryPrograms!S4=\"y\",getScoreFactor(\"Program\",AO$2),\"\")","v":""},{"$f":"IF(ItineraryPrograms!T4=\"y\",getScoreFactor(\"Program\",AP$2),\"\")","v":""},{"$f":"IF(ItineraryPrograms!U4=\"y\",getScoreFactor(\"Program\",AQ$2),\"\")","v":93},{"$f":"IF(ItineraryPrograms!V4=\"y\",getScoreFactor(\"Program\",AR$2),\"\")","v":""},{"$f":"IF(ItineraryPrograms!W4=\"y\",getScoreFactor(\"Program\",AS$2),\"\")","v":114},{"$f":"IF(ItineraryPrograms!X4=\"y\",getScoreFactor(\"Program\",AT$2),\"\")","v":129},{"$f":"IF(ItineraryPrograms!Y4=\"y\",getScoreFactor(\"Program\",AU$2),\"\")","v":""},{"$f":"IF(ItineraryPrograms!Z4=\"y\",getScoreFactor(\"Program\",AV$2),\"\")","v":""},{"$f":"IF(ItineraryPrograms!AA4=\"y\",getScoreFactor(\"Program\",AW$2),\"\")","v":""},{"$f":"IF(ItineraryPrograms!AB4=\"y\",getScoreFactor(\"Program\",AX$2),\"\")","v":""},{"$f":"IF(ItineraryPrograms!AC4=\"y\",getScoreFactor(\"Program\",AY$2),\"\")","v":150},{"$f":"IF(ItineraryPrograms!AD4=\"y\",getScoreFactor(\"Program\",AZ$2),\"\")","v":175.5},{"$f":"IF(ItineraryPrograms!AE4=\"y\",getScoreFactor(\"Program\",BA$2),\"\")","v":""},{"$f":"IF(ItineraryPrograms!AF4=\"y\",getScoreFactor(\"Program\",BB$2),\"\")","v":""},{"$f":"IF(ItineraryPrograms!AG4=\"y\",getScoreFactor(\"Program\",BC$2),\"\")","v":""},{"$f":"IF(ItineraryPrograms!AH4=\"y\",getScoreFactor(\"Program\",BD$2),\"\")","v":""},{"$f":"IF(ItineraryPrograms!AI4=\"y\",getScoreFactor(\"Program\",BE$2),\"\")","v":""},{"$f":"IF(ItineraryPrograms!AJ4=\"y\",getScoreFactor(\"Program\",BF$2),\"\")","v":""},{"$f":"IF(ItineraryPrograms!AK4=\"y\",getScoreFactor(\"Program\",BG$2),\"\")","v":""},{"$f":"IF(ItineraryPrograms!AL4=\"y\",getScoreFactor(\"Program\",BH$2),\"\")","v":""},{"$f":"IF(ItineraryPrograms!AM4=\"y\",getScoreFactor(\"Program\",BI$2),\"\")","v":""},{"$f":"IF(ItineraryPrograms!AN4=\"y\",getScoreFactor(\"Program\",BJ$2),\"\")","v":""},{"$f":"IF(ItineraryPrograms!AO4=\"y\",getScoreFactor(\"Program\",BK$2),\"\")","v":181.5},{"$f":"IF(ItineraryPrograms!AP4=\"y\",getScoreFactor(\"Program\",BL$2),\"\")","v":220.5},{"$f":"IF(ItineraryPrograms!AQ4=\"y\",getScoreFactor(\"Program\",BM$2),\"\")","v":""},{"$f":"IF(ItineraryPrograms!AR4=\"y\",getScoreFactor(\"Program\",BN$2),\"\")","v":""},{"$f":"IF(ItineraryPrograms!AS4=\"y\",getScoreFactor(\"Program\",BO$2),\"\")","v":""},{"$f":"IF(ItineraryPrograms!AT4=\"y\",getScoreFactor(\"Program\",BP$2),\"\")","v":193.5},{"$f":"IF(ItineraryPrograms!AU4=\"y\",getScoreFactor(\"Program\",BQ$2),\"\")","v":""},{"$f":"IF(ItineraryPrograms!AV4=\"y\",getScoreFactor(\"Program\",BR$2),\"\")","v":""},{"$f":"IF(ItineraryPrograms!AW4=\"y\",getScoreFactor(\"Program\",BS$2),\"\")","v":""},{"$f":"IF(ItineraryPrograms!AX4=\"y\",getScoreFactor(\"Program\",BT$2),\"\")","v":""},{"$f":"IF(ItineraryPrograms!AY4=\"y\",getScoreFactor(\"Program\",BU$2),\"\")","v":207},{"$f":"IF(ItineraryPrograms!AZ4=\"y\",getScoreFactor(\"Program\",BV$2),\"\")","v":""},{"$f":"IF(ItineraryPrograms!BA4=\"y\",getScoreFactor(\"Program\",BW$2),\"\")","v":""},{"$f":"IF(ItineraryPrograms!BB4=\"y\",getScoreFactor(\"Program\",BX$2),\"\")","v":235.5},{"$f":"IF(ItineraryPrograms!BC4=\"y\",getScoreFactor(\"Program\",BY$2),\"\")","v":""},{"$f":"IF(ItineraryPrograms!BD4=\"y\",getScoreFactor(\"Program\",BZ$2),\"\")","v":285},{"$f":"IF(ItineraryPrograms!BE4=\"y\",getScoreFactor(\"Program\",CA$2),\"\")","v":114},{"$f":"IF(ItineraryPrograms!BF4=\"y\",getScoreFactor(\"Program\",CB$2),\"\")","v":""}]
[{"$f":"Itineraries!A5","v":"12-3"},14094.666666666666,{"$f":"getScoreFactor(C$2,itineraryCamps!C6)","v":2666.6666666666665},{"$f":"getScoreFactor(D$2,\"Miles\") *itineraryCamps!D6","v":7100},{"$f":"getScoreFactor(E$2,Itineraries!B5)","v":40},{"$f":"getScoreFactor(F$2,Itineraries!C5)","v":80},{"$f":"getScoreFactor(G$2,Itineraries!E5)","v":100},{"$f":"getScoreFactor(H$2,Itineraries!H5)","v":300},{"$f":"getScoreFactor(I$2,Itineraries!G5)","v":50},{"$f":"getScoreFactor(J$2,Itineraries!J5)","v":40},{"$f":"getScoreFactor(K$2,Itineraries!K5)","v":60},{"$f":"getScoreFactor(L$2,Itineraries!L5)","v":300},{"$f":"IF(INDEX(startingTA,numericItinerary($A5))=$M$2,getScoreFactor(M$2,\"y\"),getScoreFactor(M$2,\"n\"))","v":0},{"$f":"IF(INDEX(endingTA,numericItinerary($A5))=$N$2,getScoreFactor(N$2,\"y\"),getScoreFactor(N$2,\"n\"))","v":0},{"$f":"IF(INDEX(baldyMountainHike,numericItinerary($A5))=\"\",\"\",getPeakScore(O$2))","v":""},{"$f":"IF(INDEX(mountPhillipsHike,numericItinerary($A5))=\"\",\"\",getPeakScore(P$2))","v":""},{"$f":"IF(INDEX(toothOfTimeHike,numericItinerary($A5))=\"\",\"\",getPeakScore(Q$2))","v":""},{"$f":"IF(INDEX(inspirationPointHike,numericItinerary($A5))=\"\",\"\",getPeakScore(Q$2))","v":""},{"$f":"IF(INDEX(trailPeakHike,numericItinerary($A5))=\"\",\"\",getPeakScore(S$2))","v":""},{"$f":"IF(INDEX(mountaineeringHike,numericItinerary($A5))=\"\",\"\",getPeakScore(T$2))","v":""},{"$f":"IF(areaImportant<>\"y\",\"\",IF(Itineraries!P5<>\"Y\",\"\",getareascore(U$2)))","v":""},{"$f":"IF(areaImportant<>\"y\",\"\",IF(Itineraries!Q5<>\"Y\",\"\",getareascore(V$2)))","v":""},{"$f":"IF(areaImportant<>\"y\",\"\",IF(Itineraries!R5<>\"Y\",\"\",getareascore(W$2)))","v":1000},{"$f":"IF(areaImportant<>\"y\",\"\",IF(Itineraries!S5<>\"Y\",\"\",getareascore(X$2)))","v":600},{"$f":"IF(ItineraryPrograms!C5=\"y\",getScoreFactor(\"Program\",Y$2),\"\")","v":""},{"$f":"IF(ItineraryPrograms!D5=\"y\",getScoreFactor(\"Program\",Z$2),\"\")","v":""},{"$f":"IF(ItineraryPrograms!E5=\"y\",getScoreFactor(\"Program\",AA$2),\"\")","v":""},{"$f":"IF(ItineraryPrograms!F5=\"y\",getScoreFactor(\"Program\",AB$2),\"\")","v":""},{"$f":"IF(ItineraryPrograms!G5=\"y\",getScoreFactor(\"Program\",AC$2),\"\")","v":""},{"$f":"IF(ItineraryPrograms!H5=\"y\",getScoreFactor(\"Program\",AD$2),\"\")","v":166.5},{"$f":"IF(ItineraryPrograms!I5=\"y\",getScoreFactor(\"Program\",AE$2),\"\")","v":166.5},{"$f":"IF(ItineraryPrograms!J5=\"y\",getScoreFactor(\"Program\",AF$2),\"\")","v":""},{"$f":"IF(ItineraryPrograms!K5=\"y\",getScoreFactor(\"Program\",AG$2),\"\")","v":""},{"$f":"IF(ItineraryPrograms!L5=\"y\",getScoreFactor(\"Program\",AH$2),\"\")","v":""},{"$f":"IF(ItineraryPrograms!M5=\"y\",getScoreFactor(\"Program\",AI$2),\"\")","v":109.5},{"$f":"IF(ItineraryPrograms!N5=\"y\",getScoreFactor(\"Program\",AJ$2),\"\")","v":109.5},{"$f":"IF(ItineraryPrograms!O5=\"y\",getScoreFactor(\"Program\",AK$2),\"\")","v":""},{"$f":"IF(ItineraryPrograms!P5=\"y\",getScoreFactor(\"Program\",AL$2),\"\")","v":""},{"$f":"IF(ItineraryPrograms!Q5=\"y\",getScoreFactor(\"Program\",AM$2),\"\")","v":123},{"$f":"IF(ItineraryPrograms!R5=\"y\",getScoreFactor(\"Program\",AN$2),\"\")","v":""},{"$f":"IF(ItineraryPrograms!S5=\"y\",getScoreFactor(\"Program\",AO$2),\"\")","v":106.5},{"$f":"IF(ItineraryPrograms!T5=\"y\",getScoreFactor(\"Program\",AP$2),\"\")","v":""},{"$f":"IF(ItineraryPrograms!U5=\"y\",getScoreFactor(\"Program\",AQ$2),\"\")","v":""},{"$f":"IF(ItineraryPrograms!V5=\"y\",getScoreFactor(\"Program\",AR$2),\"\")","v":""},{"$f":"IF(ItineraryPrograms!W5=\"y\",getScoreFactor(\"Program\",AS$2),\"\")","v":""},{"$f":"IF(ItineraryPrograms!X5=\"y\",getScoreFactor(\"Program\",AT$2),\"\")","v":""},{"$f":"IF(ItineraryPrograms!Y5=\"y\",getScoreFactor(\"Program\",AU$2),\"\")","v":""},{"$f":"IF(ItineraryPrograms!Z5=\"y\",getScoreFactor(\"Program\",AV$2),\"\")","v":162},{"$f":"IF(ItineraryPrograms!AA5=\"y\",getScoreFactor(\"Program\",AW$2),\"\")","v":""},{"$f":"IF(ItineraryPrograms!AB5=\"y\",getScoreFactor(\"Program\",AX$2),\"\")","v":145.5},{"$f":"IF(ItineraryPrograms!AC5=\"y\",getScoreFactor(\"Program\",AY$2),\"\")","v":""},{"$f":"IF(ItineraryPrograms!AD5=\"y\",getScoreFactor(\"Program\",AZ$2),\"\")","v":""},{"$f":"IF(ItineraryPrograms!AE5=\"y\",getScoreFactor(\"Program\",BA$2),\"\")","v":""},{"$f":"IF(ItineraryPrograms!AF5=\"y\",getScoreFactor(\"Program\",BB$2),\"\")","v":""},{"$f":"IF(ItineraryPrograms!AG5=\"y\",getScoreFactor(\"Program\",BC$2),\"\")","v":""},{"$f":"IF(ItineraryPrograms!AH5=\"y\",getScoreFactor(\"Program\",BD$2),\"\")","v":""},{"$f":"IF(ItineraryPrograms!AI5=\"y\",getScoreFactor(\"Program\",BE$2),\"\")","v":""},{"$f":"IF(ItineraryPrograms!AJ5=\"y\",getScoreFactor(\"Program\",BF$2),\"\")","v":220.5},{"$f":"IF(ItineraryPrograms!AK5=\"y\",getScoreFactor(\"Program\",BG$2),\"\")","v":""},{"$f":"IF(ItineraryPrograms!AL5=\"y\",getScoreFactor(\"Program\",BH$2),\"\")","v":255},{"$f":"IF(ItineraryPrograms!AM5=\"y\",getScoreFactor(\"Program\",BI$2),\"\")","v":""},{"$f":"IF(ItineraryPrograms!AN5=\"y\",getScoreFactor(\"Program\",BJ$2),\"\")","v":193.5},{"$f":"IF(ItineraryPrograms!AO5=\"y\",getScoreFactor(\"Program\",BK$2),\"\")","v":""},{"$f":"IF(ItineraryPrograms!AP5=\"y\",getScoreFactor(\"Program\",BL$2),\"\")","v":""},{"$f":"IF(ItineraryPrograms!AQ5=\"y\",getScoreFactor(\"Program\",BM$2),\"\")","v":""},{"$f":"IF(ItineraryPrograms!AR5=\"y\",getScoreFactor(\"Program\",BN$2),\"\")","v":""},{"$f":"IF(ItineraryPrograms!AS5=\"y\",getScoreFactor(\"Program\",BO$2),\"\")","v":""},{"$f":"IF(ItineraryPrograms!AT5=\"y\",getScoreFactor(\"Program\",BP$2),\"\")","v":""},{"$f":"IF(ItineraryPrograms!AU5=\"y\",getScoreFactor(\"Program\",BQ$2),\"\")","v":""},{"$f":"IF(ItineraryPrograms!AV5=\"y\",getScoreFactor(\"Program\",BR$2),\"\")","v":""},{"$f":"IF(ItineraryPrograms!AW5=\"y\",getScoreFactor(\"Program\",BS$2),\"\")","v":""},{"$f":"IF(ItineraryPrograms!AX5=\"y\",getScoreFactor(\"Program\",BT$2),\"\")","v":""},{"$f":"IF(ItineraryPrograms!AY5=\"y\",getScoreFactor(\"Program\",BU$2),\"\")","v":""},{"$f":"IF(ItineraryPrograms!AZ5=\"y\",getScoreFactor(\"Program\",BV$2),\"\")","v":207},{"$f":"IF(ItineraryPrograms!BA5=\"y\",getScoreFactor(\"Program\",BW$2),\"\")","v":91.5},{"$f":"IF(ItineraryPrograms!BB5=\"y\",getScoreFactor(\"Program\",BX$2),\"\")","v":""},{"$f":"IF(ItineraryPrograms!BC5=\"y\",getScoreFactor(\"Program\",BY$2),\"\")","v":133.5},{"$f":"IF(ItineraryPrograms!BD5=\"y\",getScoreFactor(\"Program\",BZ$2),\"\")","v":""},{"$f":"IF(ItineraryPrograms!BE5=\"y\",getScoreFactor(\"Program\",CA$2),\"\")","v":""},{"$f":"IF(ItineraryPrograms!BF5=\"y\",getScoreFactor(\"Program\",CB$2),\"\")","v":139.5}]
[{"$f":"Itineraries!A6","v":"12-4"},13324.5,{"$f":"getScoreFactor(C$2,itineraryCamps!C7)","v":2500},{"$f":"getScoreFactor(D$2,\"Miles\") *itineraryCamps!D7","v":5800},{"$f":"getScoreFactor(E$2,Itineraries!B6)","v":30},{"$f":"getScoreFactor(F$2,Itineraries!C6)","v":70},{"$f":"getScoreFactor(G$2,Itineraries!E6)","v":100},{"$f":"getScoreFactor(H$2,Itineraries!H6)","v":300},{"$f":"getScoreFactor(I$2,Itineraries!G6)","v":60},{"$f":"getScoreFactor(J$2,Itineraries!J6)","v":60},{"$f":"getScoreFactor(K$2,Itineraries!K6)","v":70},{"$f":"getScoreFactor(L$2,Itineraries!L6)","v":300},{"$f":"IF(INDEX(startingTA,numericItinerary($A6))=$M$2,getScoreFactor(M$2,\"y\"),getScoreFactor(M$2,\"n\"))","v":0},{"$f":"IF(INDEX(endingTA,numericItinerary($A6))=$N$2,getScoreFactor(N$2,\"y\"),getScoreFactor(N$2,\"n\"))","v":0},{"$f":"IF(INDEX(baldyMountainHike,numericItinerary($A6))=\"\",\"\",getPeakScore(O$2))","v":351},{"$f":"IF(INDEX(mountPhillipsHike,numericItinerary($A6))=\"\",\"\",getPeakScore(P$2))","v":""},{"$f":"IF(INDEX(toothOfTimeHike,numericItinerary($A6))=\"\",\"\",getPeakScore(Q$2))","v":""},{"$f":"IF(INDEX(inspirationPointHike,numericItinerary($A6))=\"\",\"\",getPeakScore(Q$2))","v":""},{"$f":"IF(INDEX(trailPeakHike,numericItinerary($A6))=\"\",\"\",getPeakScore(S$2))","v":""},{"$f":"IF(INDEX(mountaineeringHike,numericItinerary($A6))=\"\",\"\",getPeakScore(T$2))","v":""},{"$f":"IF(areaImportant<>\"y\",\"\",IF(Itineraries!P6<>\"Y\",\"\",getareascore(U$2)))","v":""},{"$f":"IF(areaImportant<>\"y\",\"\",IF(Itineraries!Q6<>\"Y\",\"\",getareascore(V$2)))","v":""},{"$f":"IF(areaImportant<>\"y\",\"\",IF(Itineraries!R6<>\"Y\",\"\",getareascore(W$2)))","v":1000},{"$f":"IF(areaImportant<>\"y\",\"\",IF(Itineraries!S6<>\"Y\",\"\",getareascore(X$2)))","v":""},{"$f":"IF(ItineraryPrograms!C6=\"y\",getScoreFactor(\"Program\",Y$2),\"\")","v":""},{"$f":"IF(ItineraryPrograms!D6=\"y\",getScoreFactor(\"Program\",Z$2),\"\")","v":""},{"$f":"IF(ItineraryPrograms!E6=\"y\",getScoreFactor(\"Program\",AA$2),\"\")","v":""},{"$f":"IF(ItineraryPrograms!F6=\"y\",getScoreFactor(\"Program\",AB$2),\"\")","v":""},{"$f":"IF(ItineraryPrograms!G6=\"y\",getScoreFactor(\"Program\",AC$2),\"\")","v":""},{"$f":"IF(ItineraryPrograms!H6=\"y\",getScoreFactor(\"Program\",AD$2),\"\")","v":166.5},{"$f":"IF(ItineraryPrograms!I6=\"y\",getScoreFactor(\"Program\",AE$2),\"\")","v":166.5},{"$f":"IF(ItineraryPrograms!J6=\"y\",getScoreFactor(\"Program\",AF$2),\"\")","v":""},{"$f":"IF(ItineraryPrograms!K6=\"y\",getScoreFactor(\"Program\",AG$2),\"\")","v":""},{"$f":"IF(ItineraryPrograms!L6=\"y\",getScoreFactor(\"Program\",AH$2),\"\")","v":""},{"$f":"IF(ItineraryPrograms!M6=\"y\",getScoreFactor(\"Program\",AI$2),\"\")","v":109.5},{"$f":"IF(ItineraryPrograms!N6=\"y\",getScoreFactor(\"Program\",AJ$2),\"\")","v":109.5},{"$f":"IF(ItineraryPrograms!O6=\"y\",getScoreFactor(\"Program\",AK$2),\"\")","v":111},{"$f":"IF(ItineraryPrograms!P6=\"y\",getScoreFactor(\"Program\",AL$2),\"\")","v":""},{"$f":"IF(ItineraryPrograms!Q6=\"y\",getScoreFactor(\"Program\",AM$2),\"\")","v":123},{"$f":"IF(ItineraryPrograms!R6=\"y\",getScoreFactor(\"Program\",AN$2),\"\")","v":""},{"$f":"IF(ItineraryPrograms!S6=\"y\",getScoreFactor(\"Program\",AO$2),\"\")","v":""},{"$f":"IF(ItineraryPrograms!T6=\"y\",getScoreFactor(\"Program\",AP$2),\"\")","v":""},{"$f":"IF(ItineraryPrograms!U6=\"y\",getScoreFactor(\"Program\",AQ$2),\"\")","v":93},{"$f":"IF(ItineraryPrograms!V6=\"y\",getScoreFactor(\"Program\",AR$2),\"\")","v":""},{"$f":"IF(ItineraryPrograms!W6=\"y\",getScoreFactor(\"Program\",AS$2),\"\")","v":114},{"$f":"IF(ItineraryPrograms!X6=\"y\",getScoreFactor(\"Program\",AT$2),\"\")","v":129},{"$f":"IF(ItineraryPrograms!Y6=\"y\",getScoreFactor(\"Program\",AU$2),\"\")","v":""},{"$f":"IF(ItineraryPrograms!Z6=\"y\",getScoreFactor(\"Program\",AV$2),\"\")","v":""},{"$f":"IF(ItineraryPrograms!AA6=\"y\",getScoreFactor(\"Program\",AW$2),\"\")","v":201},{"$f":"IF(ItineraryPrograms!AB6=\"y\",getScoreFactor(\"Program\",AX$2),\"\")","v":145.5},{"$f":"IF(ItineraryPrograms!AC6=\"y\",getScoreFactor(\"Program\",AY$2),\"\")","v":""},{"$f":"IF(ItineraryPrograms!AD6=\"y\",getScoreFactor(\"Program\",AZ$2),\"\")","v":175.5},{"$f":"IF(ItineraryPrograms!AE6=\"y\",getScoreFactor(\"Program\",BA$2),\"\")","v":""},{"$f":"IF(ItineraryPrograms!AF6=\"y\",getScoreFactor(\"Program\",BB$2),\"\")","v":""},{"$f":"IF(ItineraryPrograms!AG6=\"y\",getScoreFactor(\"Program\",BC$2),\"\")","v":""},{"$f":"IF(ItineraryPrograms!AH6=\"y\",getScoreFactor(\"Program\",BD$2),\"\")","v":""},{"$f":"IF(ItineraryPrograms!AI6=\"y\",getScoreFactor(\"Program\",BE$2),\"\")","v":""},{"$f":"IF(ItineraryPrograms!AJ6=\"y\",getScoreFactor(\"Program\",BF$2),\"\")","v":""},{"$f":"IF(ItineraryPrograms!AK6=\"y\",getScoreFactor(\"Program\",BG$2),\"\")","v":210},{"$f":"IF(ItineraryPrograms!AL6=\"y\",getScoreFactor(\"Program\",BH$2),\"\")","v":""},{"$f":"IF(ItineraryPrograms!AM6=\"y\",getScoreFactor(\"Program\",BI$2),\"\")","v":235.5},{"$f":"IF(ItineraryPrograms!AN6=\"y\",getScoreFactor(\"Program\",BJ$2),\"\")","v":""},{"$f":"IF(ItineraryPrograms!AO6=\"y\",getScoreFactor(\"Program\",BK$2),\"\")","v":""},{"$f":"IF(ItineraryPrograms!AP6=\"y\",getScoreFactor(\"Program\",BL$2),\"\")","v":""},{"$f":"IF(ItineraryPrograms!AQ6=\"y\",getScoreFactor(\"Program\",BM$2),\"\")","v":""},{"$f":"IF(ItineraryPrograms!AR6=\"y\",getScoreFactor(\"Program\",BN$2),\"\")","v":""},{"$f":"IF(ItineraryPrograms!AS6=\"y\",getScoreFactor(\"Program\",BO$2),\"\")","v":235.5},{"$f":"IF(ItineraryPrograms!AT6=\"y\",getScoreFactor(\"Program\",BP$2),\"\")","v":""},{"$f":"IF(ItineraryPrograms!AU6=\"y\",getScoreFactor(\"Program\",BQ$2),\"\")","v":151.5},{"$f":"IF(ItineraryPrograms!AV6=\"y\",getScoreFactor(\"Program\",BR$2),\"\")","v":""},{"$f":"IF(ItineraryPrograms!AW6=\"y\",getScoreFactor(\"Program\",BS$2),\"\")","v":""},{"$f":"IF(ItineraryPrograms!AX6=\"y\",getScoreFactor(\"Program\",BT$2),\"\")","v":""},{"$f":"IF(ItineraryPrograms!AY6=\"y\",getScoreFactor(\"Program\",BU$2),\"\")","v":207},{"$f":"IF(ItineraryPrograms!AZ6=\"y\",getScoreFactor(\"Program\",BV$2),\"\")","v":""},{"$f":"IF(ItineraryPrograms!BA6=\"y\",getScoreFactor(\"Program\",BW$2),\"\")","v":""},{"$f":"IF(ItineraryPrograms!BB6=\"y\",getScoreFactor(\"Program\",BX$2),\"\")","v":235.5},{"$f":"IF(ItineraryPrograms!BC6=\"y\",getScoreFactor(\"Program\",BY$2),\"\")","v":133.5},{"$f":"IF(ItineraryPrograms!BD6=\"y\",getScoreFactor(\"Program\",BZ$2),\"\")","v":285},{"$f":"IF(ItineraryPrograms!BE6=\"y\",getScoreFactor(\"Program\",CA$2),\"\")","v":114},{"$f":"IF(ItineraryPrograms!BF6=\"y\",getScoreFactor(\"Program\",CB$2),\"\")","v":""}]
[{"$f":"Itineraries!A7","v":"12-5"},12493,{"$f":"getScoreFactor(C$2,itineraryCamps!C8)","v":2500},{"$f":"getScoreFactor(D$2,\"Miles\") *itineraryCamps!D8","v":5400},{"$f":"getScoreFactor(E$2,Itineraries!B7)","v":50},{"$f":"getScoreFactor(F$2,Itineraries!C7)","v":70},{"$f":"getScoreFactor(G$2,Itineraries!E7)","v":75},{"$f":"getScoreFactor(H$2,Itineraries!H7)","v":250},{"$f":"getScoreFactor(I$2,Itineraries!G7)","v":50},{"$f":"getScoreFactor(J$2,Itineraries!J7)","v":80},{"$f":"getScoreFactor(K$2,Itineraries!K7)","v":80},{"$f":"getScoreFactor(L$2,Itineraries!L7)","v":300},{"$f":"IF(INDEX(startingTA,numericItinerary($A7))=$M$2,getScoreFactor(M$2,\"y\"),getScoreFactor(M$2,\"n\"))","v":0},{"$f":"IF(INDEX(endingTA,numericItinerary($A7))=$N$2,getScoreFactor(N$2,\"y\"),getScoreFactor(N$2,\"n\"))","v":0},{"$f":"IF(INDEX(baldyMountainHike,numericItinerary($A7))=\"\",\"\",getPeakScore(O$2))","v":""},{"$f":"IF(INDEX(mountPhillipsHike,numericItinerary($A7))=\"\",\"\",getPeakScore(P$2))","v":283.5},{"$f":"IF(INDEX(toothOfTimeHike,numericItinerary($A7))=\"\",\"\",getPeakScore(Q$2))","v":""},{"$f":"IF(INDEX(inspirationPointHike,numericItinerary($A7))=\"\",\"\",getPeakScore(Q$2))","v":""},{"$f":"IF(INDEX(trailPeakHike,numericItinerary($A7))=\"\",\"\",getPeakScore(S$2))","v":""},{"$f":"IF(INDEX(mountaineeringHike,numericItinerary($A7))=\"\",\"\",getPeakScore(T$2))","v":202.5},{"$f":"IF(areaImportant<>\"y\",\"\",IF(Itineraries!P7<>\"Y\",\"\",getareascore(U$2)))","v":200},{"$f":"IF(areaImportant<>\"y\",\"\",IF(Itineraries!Q7<>\"Y\",\"\",getareascore(V$2)))","v":150},{"$f":"IF(areaImportant<>\"y\",\"\",IF(Itineraries!R7<>\"Y\",\"\",getareascore(W$2)))","v":""},{"$f":"IF(areaImportant<>\"y\",\"\",IF(Itineraries!S7<>\"Y\",\"\",getareascore(X$2)))","v":""},{"$f":"IF(ItineraryPrograms!C7=\"y\",getScoreFactor(\"Program\",Y$2),\"\")","v":""},{"$f":"IF(ItineraryPrograms!D7=\"y\",getScoreFactor(\"Program\",Z$2),\"\")","v":""},{"$f":"IF(ItineraryPrograms!E7=\"y\",getScoreFactor(\"Program\",AA$2),\"\")","v":""},{"$f":"IF(ItineraryPrograms!F7=\"y\",getScoreFactor(\"Program\",AB$2),\"\")","v":""},{"$f":"IF(ItineraryPrograms!G7=\"y\",getScoreFactor(\"Program\",AC$2),\"\")","v":""},{"$f":"IF(ItineraryPrograms!H7=\"y\",getScoreFactor(\"Program\",AD$2),\"\")","v":""},{"$f":"IF(ItineraryPrograms!I7=\"y\",getScoreFactor(\"Program\",AE$2),\"\")","v":""},{"$f":"IF(ItineraryPrograms!J7=\"y\",getScoreFactor(\"Program\",AF$2),\"\")","v":""},{"$f":"IF(ItineraryPrograms!K7=\"y\",getScoreFactor(\"Program\",AG$2),\"\")","v":130.5},{"$f":"IF(ItineraryPrograms!L7=\"y\",getScoreFactor(\"Program\",AH$2),\"\")","v":""},{"$f":"IF(ItineraryPrograms!M7=\"y\",getScoreFactor(\"Program\",AI$2),\"\")","v":109.5},{"$f":"IF(ItineraryPrograms!N7=\"y\",getScoreFactor(\"Program\",AJ$2),\"\")","v":""},{"$f":"IF(ItineraryPrograms!O7=\"y\",getScoreFactor(\"Program\",AK$2),\"\")","v":""},{"$f":"IF(ItineraryPrograms!P7=\"y\",getScoreFactor(\"Program\",AL$2),\"\")","v":114},{"$f":"IF(ItineraryPrograms!Q7=\"y\",getScoreFactor(\"Program\",AM$2),\"\")","v":""},{"$f":"IF(ItineraryPrograms!R7=\"y\",getScoreFactor(\"Program\",AN$2),\"\")","v":126},{"$f":"IF(ItineraryPrograms!S7=\"y\",getScoreFactor(\"Program\",AO$2),\"\")","v":106.5},{"$f":"IF(ItineraryPrograms!T7=\"y\",getScoreFactor(\"Program\",AP$2),\"\")","v":145.5},{"$f":"IF(ItineraryPrograms!U7=\"y\",getScoreFactor(\"Program\",AQ$2),\"\")","v":93},{"$f":"IF(ItineraryPrograms!V7=\"y\",getScoreFactor(\"Program\",AR$2),\"\")","v":156},{"$f":"IF(ItineraryPrograms!W7=\"y\",getScoreFactor(\"Program\",AS$2),\"\")","v":""},{"$f":"IF(ItineraryPrograms!X7=\"y\",getScoreFactor(\"Program\",AT$2),\"\")","v":""},{"$f":"IF(ItineraryPrograms!Y7=\"y\",getScoreFactor(\"Program\",AU$2),\"\")","v":""},{"$f":"IF(ItineraryPrograms!Z7=\"y\",getScoreFactor(\"Program\",AV$2),\"\")","v":""},{"$f":"IF(ItineraryPrograms!AA7=\"y\",getScoreFactor(\"Program\",AW$2),\"\")","v":""},{"$f":"IF(ItineraryPrograms!AB7=\"y\",getScoreFactor(\"Program\",AX$2),\"\")","v":""},{"$f":"IF(ItineraryPrograms!AC7=\"y\",getScoreFactor(\"Program\",AY$2),\"\")","v":""},{"$f":"IF(ItineraryPrograms!AD7=\"y\",getScoreFactor(\"Program\",AZ$2),\"\")","v":""},{"$f":"IF(ItineraryPrograms!AE7=\"y\",getScoreFactor(\"Program\",BA$2),\"\")","v":""},{"$f":"IF(ItineraryPrograms!AF7=\"y\",getScoreFactor(\"Program\",BB$2),\"\")","v":189},{"$f":"IF(ItineraryPrograms!AG7=\"y\",getScoreFactor(\"Program\",BC$2),\"\")","v":202.5},{"$f":"IF(ItineraryPrograms!AH7=\"y\",getScoreFactor(\"Program\",BD$2),\"\")","v":""},{"$f":"IF(ItineraryPrograms!AI7=\"y\",getScoreFactor(\"Program\",BE$2),\"\")","v":""},{"$f":"IF(ItineraryPrograms!AJ7=\"y\",getScoreFactor(\"Program\",BF$2),\"\")","v":220.5},{"$f":"IF(ItineraryPrograms!AK7=\"y\",getScoreFactor(\"Program\",BG$2),\"\")","v":""},{"$f":"IF(ItineraryPrograms!AL7=\"y\",getScoreFactor(\"Program\",BH$2),\"\")","v":255},{"$f":"IF(ItineraryPrograms!AM7=\"y\",getScoreFactor(\"Program\",BI$2),\"\")","v":""},{"$f":"IF(ItineraryPrograms!AN7=\"y\",getScoreFactor(\"Program\",BJ$2),\"\")","v":193.5},{"$f":"IF(ItineraryPrograms!AO7=\"y\",getScoreFactor(\"Program\",BK$2),\"\")","v":181.5},{"$f":"IF(ItineraryPrograms!AP7=\"y\",getScoreFactor(\"Program\",BL$2),\"\")","v":220.5},{"$f":"IF(ItineraryPrograms!AQ7=\"y\",getScoreFactor(\"Program\",BM$2),\"\")","v":""},{"$f":"IF(ItineraryPrograms!AR7=\"y\",getScoreFactor(\"Program\",BN$2),\"\")","v":""},{"$f":"IF(ItineraryPrograms!AS7=\"y\",getScoreFactor(\"Program\",BO$2),\"\")","v":""},{"$f":"IF(ItineraryPrograms!AT7=\"y\",getScoreFactor(\"Program\",BP$2),\"\")","v":""},{"$f":"IF(ItineraryPrograms!AU7=\"y\",getScoreFactor(\"Program\",BQ$2),\"\")","v":151.5},{"$f":"IF(ItineraryPrograms!AV7=\"y\",getScoreFactor(\"Program\",BR$2),\"\")","v":""},{"$f":"IF(ItineraryPrograms!AW7=\"y\",getScoreFactor(\"Program\",BS$2),\"\")","v":""},{"$f":"IF(ItineraryPrograms!AX7=\"y\",getScoreFactor(\"Program\",BT$2),\"\")","v":""},{"$f":"IF(ItineraryPrograms!AY7=\"y\",getScoreFactor(\"Program\",BU$2),\"\")","v":207},{"$f":"IF(ItineraryPrograms!AZ7=\"y\",getScoreFactor(\"Program\",BV$2),\"\")","v":""},{"$f":"IF(ItineraryPrograms!BA7=\"y\",getScoreFactor(\"Program\",BW$2),\"\")","v":""},{"$f":"IF(ItineraryPrograms!BB7=\"y\",getScoreFactor(\"Program\",BX$2),\"\")","v":""},{"$f":"IF(ItineraryPrograms!BC7=\"y\",getScoreFactor(\"Program\",BY$2),\"\")","v":133.5},{"$f":"IF(ItineraryPrograms!BD7=\"y\",getScoreFactor(\"Program\",BZ$2),\"\")","v":285},{"$f":"IF(ItineraryPrograms!BE7=\"y\",getScoreFactor(\"Program\",CA$2),\"\")","v":114},{"$f":"IF(ItineraryPrograms!BF7=\"y\",getScoreFactor(\"Program\",CB$2),\"\")","v":""}]
[{"$f":"Itineraries!A8","v":"12-6"},13109.166666666666,{"$f":"getScoreFactor(C$2,itineraryCamps!C9)","v":2666.6666666666665},{"$f":"getScoreFactor(D$2,\"Miles\") *itineraryCamps!D9","v":5300},{"$f":"getScoreFactor(E$2,Itineraries!B8)","v":20},{"$f":"getScoreFactor(F$2,Itineraries!C8)","v":80},{"$f":"getScoreFactor(G$2,Itineraries!E8)","v":100},{"$f":"getScoreFactor(H$2,Itineraries!H8)","v":225},{"$f":"getScoreFactor(I$2,Itineraries!G8)","v":75},{"$f":"getScoreFactor(J$2,Itineraries!J8)","v":50},{"$f":"getScoreFactor(K$2,Itineraries!K8)","v":60},{"$f":"getScoreFactor(L$2,Itineraries!L8)","v":100},{"$f":"IF(INDEX(startingTA,numericItinerary($A8))=$M$2,getScoreFactor(M$2,\"y\"),getScoreFactor(M$2,\"n\"))","v":0},{"$f":"IF(INDEX(endingTA,numericItinerary($A8))=$N$2,getScoreFactor(N$2,\"y\"),getScoreFactor(N$2,\"n\"))","v":0},{"$f":"IF(INDEX(baldyMountainHike,numericItinerary($A8))=\"\",\"\",getPeakScore(O$2))","v":351},{"$f":"IF(INDEX(mountPhillipsHike,numericItinerary($A8))=\"\",\"\",getPeakScore(P$2))","v":""},{"$f":"IF(INDEX(toothOfTimeHike,numericItinerary($A8))=\"\",\"\",getPeakScore(Q$2))","v":""},{"$f":"IF(INDEX(inspirationPointHike,numericItinerary($A8))=\"\",\"\",getPeakScore(Q$2))","v":""},{"$f":"IF(INDEX(trailPeakHike,numericItinerary($A8))=\"\",\"\",getPeakScore(S$2))","v":""},{"$f":"IF(INDEX(mountaineeringHike,numericItinerary($A8))=\"\",\"\",getPeakScore(T$2))","v":""},{"$f":"IF(areaImportant<>\"y\",\"\",IF(Itineraries!P8<>\"Y\",\"\",getareascore(U$2)))","v":200},{"$f":"IF(areaImportant<>\"y\",\"\",IF(Itineraries!Q8<>\"Y\",\"\",getareascore(V$2)))","v":150},{"$f":"IF(areaImportant<>\"y\",\"\",IF(Itineraries!R8<>\"Y\",\"\",getareascore(W$2)))","v":1000},{"$f":"IF(areaImportant<>\"y\",\"\",IF(Itineraries!S8<>\"Y\",\"\",getareascore(X$2)))","v":""},{"$f":"IF(ItineraryPrograms!C8=\"y\",getScoreFactor(\"Program\",Y$2),\"\")","v":228},{"$f":"IF(ItineraryPrograms!D8=\"y\",getScoreFactor(\"Program\",Z$2),\"\")","v":337.5},{"$f":"IF(ItineraryPrograms!E8=\"y\",getScoreFactor(\"Program\",AA$2),\"\")","v":114},{"$f":"IF(ItineraryPrograms!F8=\"y\",getScoreFactor(\"Program\",AB$2),\"\")","v":282},{"$f":"IF(ItineraryPrograms!G8=\"y\",getScoreFactor(\"Program\",AC$2),\"\")","v":162},{"$f":"IF(ItineraryPrograms!H8=\"y\",getScoreFactor(\"Program\",AD$2),\"\")","v":""},{"$f":"IF(ItineraryPrograms!I8=\"y\",getScoreFactor(\"Program\",AE$2),\"\")","v":""},{"$f":"IF(ItineraryPrograms!J8=\"y\",getScoreFactor(\"Program\",AF$2),\"\")","v":126},{"$f":"IF(ItineraryPrograms!K8=\"y\",getScoreFactor(\"Program\",AG$2),\"\")","v":""},{"$f":"IF(ItineraryPrograms!L8=\"y\",getScoreFactor(\"Program\",AH$2),\"\")","v":""},{"$f":"IF(ItineraryPrograms!M8=\"y\",getScoreFactor(\"Program\",AI$2),\"\")","v":109.5},{"$f":"IF(ItineraryPrograms!N8=\"y\",getScoreFactor(\"Program\",AJ$2),\"\")","v":""},{"$f":"IF(ItineraryPrograms!O8=\"y\",getScoreFactor(\"Program\",AK$2),\"\")","v":""},{"$f":"IF(ItineraryPrograms!P8=\"y\",getScoreFactor(\"Program\",AL$2),\"\")","v":""},{"$f":"IF(ItineraryPrograms!Q8=\"y\",getScoreFactor(\"Program\",AM$2),\"\")","v":""},{"$f":"IF(ItineraryPrograms!R8=\"y\",getScoreFactor(\"Program\",AN$2),\"\")","v":""},{"$f":"IF(ItineraryPrograms!S8=\"y\",getScoreFactor(\"Program\",AO$2),\"\")","v":""},{"$f":"IF(ItineraryPrograms!T8=\"y\",getScoreFactor(\"Program\",AP$2),\"\")","v":""},{"$f":"IF(ItineraryPrograms!U8=\"y\",getScoreFactor(\"Program\",AQ$2),\"\")","v":""},{"$f":"IF(ItineraryPrograms!V8=\"y\",getScoreFactor(\"Program\",AR$2),\"\")","v":""},{"$f":"IF(ItineraryPrograms!W8=\"y\",getScoreFactor(\"Program\",AS$2),\"\")","v":114},{"$f":"IF(ItineraryPrograms!X8=\"y\",getScoreFactor(\"Program\",AT$2),\"\")","v":129},{"$f":"IF(ItineraryPrograms!Y8=\"y\",getScoreFactor(\"Program\",AU$2),\"\")","v":""},{"$f":"IF(ItineraryPrograms!Z8=\"y\",getScoreFactor(\"Program\",AV$2),\"\")","v":""},{"$f":"IF(ItineraryPrograms!AA8=\"y\",getScoreFactor(\"Program\",AW$2),\"\")","v":""},{"$f":"IF(ItineraryPrograms!AB8=\"y\",getScoreFactor(\"Program\",AX$2),\"\")","v":""},{"$f":"IF(ItineraryPrograms!AC8=\"y\",getScoreFactor(\"Program\",AY$2),\"\")","v":""},{"$f":"IF(ItineraryPrograms!AD8=\"y\",getScoreFactor(\"Program\",AZ$2),\"\")","v":175.5},{"$f":"IF(ItineraryPrograms!AE8=\"y\",getScoreFactor(\"Program\",BA$2),\"\")","v":""},{"$f":"IF(ItineraryPrograms!AF8=\"y\",getScoreFactor(\"Program\",BB$2),\"\")","v":""},{"$f":"IF(ItineraryPrograms!AG8=\"y\",getScoreFactor(\"Program\",BC$2),\"\")","v":""},{"$f":"IF(ItineraryPrograms!AH8=\"y\",getScoreFactor(\"Program\",BD$2),\"\")","v":""},{"$f":"IF(ItineraryPrograms!AI8=\"y\",getScoreFactor(\"Program\",BE$2),\"\")","v":""},{"$f":"IF(ItineraryPrograms!AJ8=\"y\",getScoreFactor(\"Program\",BF$2),\"\")","v":""},{"$f":"IF(ItineraryPrograms!AK8=\"y\",getScoreFactor(\"Program\",BG$2),\"\")","v":""},{"$f":"IF(ItineraryPrograms!AL8=\"y\",getScoreFactor(\"Program\",BH$2),\"\")","v":""},{"$f":"IF(ItineraryPrograms!AM8=\"y\",getScoreFactor(\"Program\",BI$2),\"\")","v":""},{"$f":"IF(ItineraryPrograms!AN8=\"y\",getScoreFactor(\"Program\",BJ$2),\"\")","v":""},{"$f":"IF(ItineraryPrograms!AO8=\"y\",getScoreFactor(\"Program\",BK$2),\"\")","v":181.5},{"$f":"IF(ItineraryPrograms!AP8=\"y\",getScoreFactor(\"Program\",BL$2),\"\")","v":220.5},{"$f":"IF(ItineraryPrograms!AQ8=\"y\",getScoreFactor(\"Program\",BM$2),\"\")","v":""},{"$f":"IF(ItineraryPrograms!AR8=\"y\",getScoreFactor(\"Program\",BN$2),\"\")","v":""},{"$f":"IF(ItineraryPrograms!AS8=\"y\",getScoreFactor(\"Program\",BO$2),\"\")","v":""},{"$f":"IF(ItineraryPrograms!AT8=\"y\",getScoreFactor(\"Program\",BP$2),\"\")","v":193.5},{"$f":"IF(ItineraryPrograms!AU8=\"y\",getScoreFactor(\"Program\",BQ$2),\"\")","v":151.5},{"$f":"IF(ItineraryPrograms!AV8=\"y\",getScoreFactor(\"Program\",BR$2),\"\")","v":""},{"$f":"IF(ItineraryPrograms!AW8=\"y\",getScoreFactor(\"Program\",BS$2),\"\")","v":""},{"$f":"IF(ItineraryPrograms!AX8=\"y\",getScoreFactor(\"Program\",BT$2),\"\")","v":""},{"$f":"IF(ItineraryPrograms!AY8=\"y\",getScoreFactor(\"Program\",BU$2),\"\")","v":207},{"$f":"IF(ItineraryPrograms!AZ8=\"y\",getScoreFactor(\"Program\",BV$2),\"\")","v":""},{"$f":"IF(ItineraryPrograms!BA8=\"y\",getScoreFactor(\"Program\",BW$2),\"\")","v":""},{"$f":"IF(ItineraryPrograms!BB8=\"y\",getScoreFactor(\"Program\",BX$2),\"\")","v":235.5},{"$f":"IF(ItineraryPrograms!BC8=\"y\",getScoreFactor(\"Program\",BY$2),\"\")","v":""},{"$f":"IF(ItineraryPrograms!BD8=\"y\",getScoreFactor(\"Program\",BZ$2),\"\")","v":""},{"$f":"IF(ItineraryPrograms!BE8=\"y\",getScoreFactor(\"Program\",CA$2),\"\")","v":114},{"$f":"IF(ItineraryPrograms!BF8=\"y\",getScoreFactor(\"Program\",CB$2),\"\")","v":""}]
[{"$f":"Itineraries!A9","v":"12-7"},14690.166666666666,{"$f":"getScoreFactor(C$2,itineraryCamps!C10)","v":2666.6666666666665},{"$f":"getScoreFactor(D$2,\"Miles\") *itineraryCamps!D10","v":6900},{"$f":"getScoreFactor(E$2,Itineraries!B9)","v":20},{"$f":"getScoreFactor(F$2,Itineraries!C9)","v":80},{"$f":"getScoreFactor(G$2,Itineraries!E9)","v":75},{"$f":"getScoreFactor(H$2,Itineraries!H9)","v":250},{"$f":"getScoreFactor(I$2,Itineraries!G9)","v":60},{"$f":"getScoreFactor(J$2,Itineraries!J9)","v":80},{"$f":"getScoreFactor(K$2,Itineraries!K9)","v":80},{"$f":"getScoreFactor(L$2,Itineraries!L9)","v":300},{"$f":"IF(INDEX(startingTA,numericItinerary($A9))=$M$2,getScoreFactor(M$2,\"y\"),getScoreFactor(M$2,\"n\"))","v":0},{"$f":"IF(INDEX(endingTA,numericItinerary($A9))=$N$2,getScoreFactor(N$2,\"y\"),getScoreFactor(N$2,\"n\"))","v":0},{"$f":"IF(INDEX(baldyMountainHike,numericItinerary($A9))=\"\",\"\",getPeakScore(O$2))","v":351},{"$f":"IF(INDEX(mountPhillipsHike,numericItinerary($A9))=\"\",\"\",getPeakScore(P$2))","v":""},{"$f":"IF(INDEX(toothOfTimeHike,numericItinerary($A9))=\"\",\"\",getPeakScore(Q$2))","v":""},{"$f":"IF(INDEX(inspirationPointHike,numericItinerary($A9))=\"\",\"\",getPeakScore(Q$2))","v":""},{"$f":"IF(INDEX(trailPeakHike,numericItinerary($A9))=\"\",\"\",getPeakScore(S$2))","v":""},{"$f":"IF(INDEX(mountaineeringHike,numericItinerary($A9))=\"\",\"\",getPeakScore(T$2))","v":""},{"$f":"IF(areaImportant<>\"y\",\"\",IF(Itineraries!P9<>\"Y\",\"\",getareascore(U$2)))","v":""},{"$f":"IF(areaImportant<>\"y\",\"\",IF(Itineraries!Q9<>\"Y\",\"\",getareascore(V$2)))","v":""},{"$f":"IF(areaImportant<>\"y\",\"\",IF(Itineraries!R9<>\"Y\",\"\",getareascore(W$2)))","v":1000},{"$f":"IF(areaImportant<>\"y\",\"\",IF(Itineraries!S9<>\"Y\",\"\",getareascore(X$2)))","v":600},{"$f":"IF(ItineraryPrograms!C9=\"y\",getScoreFactor(\"Program\",Y$2),\"\")","v":""},{"$f":"IF(ItineraryPrograms!D9=\"y\",getScoreFactor(\"Program\",Z$2),\"\")","v":""},{"$f":"IF(ItineraryPrograms!E9=\"y\",getScoreFactor(\"Program\",AA$2),\"\")","v":""},{"$f":"IF(ItineraryPrograms!F9=\"y\",getScoreFactor(\"Program\",AB$2),\"\")","v":""},{"$f":"IF(ItineraryPrograms!G9=\"y\",getScoreFactor(\"Program\",AC$2),\"\")","v":""},{"$f":"IF(ItineraryPrograms!H9=\"y\",getScoreFactor(\"Program\",AD$2),\"\")","v":166.5},{"$f":"IF(ItineraryPrograms!I9=\"y\",getScoreFactor(\"Program\",AE$2),\"\")","v":166.5},{"$f":"IF(ItineraryPrograms!J9=\"y\",getScoreFactor(\"Program\",AF$2),\"\")","v":""},{"$f":"IF(ItineraryPrograms!K9=\"y\",getScoreFactor(\"Program\",AG$2),\"\")","v":""},{"$f":"IF(ItineraryPrograms!L9=\"y\",getScoreFactor(\"Program\",AH$2),\"\")","v":""},{"$f":"IF(ItineraryPrograms!M9=\"y\",getScoreFactor(\"Program\",AI$2),\"\")","v":109.5},{"$f":"IF(ItineraryPrograms!N9=\"y\",getScoreFactor(\"Program\",AJ$2),\"\")","v":109.5},{"$f":"IF(ItineraryPrograms!O9=\"y\",getScoreFactor(\"Program\",AK$2),\"\")","v":""},{"$f":"IF(ItineraryPrograms!P9=\"y\",getScoreFactor(\"Program\",AL$2),\"\")","v":""},{"$f":"IF(ItineraryPrograms!Q9=\"y\",getScoreFactor(\"Program\",AM$2),\"\")","v":123},{"$f":"IF(ItineraryPrograms!R9=\"y\",getScoreFactor(\"Program\",AN$2),\"\")","v":""},{"$f":"IF(ItineraryPrograms!S9=\"y\",getScoreFactor(\"Program\",AO$2),\"\")","v":106.5},{"$f":"IF(ItineraryPrograms!T9=\"y\",getScoreFactor(\"Program\",AP$2),\"\")","v":""},{"$f":"IF(ItineraryPrograms!U9=\"y\",getScoreFactor(\"Program\",AQ$2),\"\")","v":""},{"$f":"IF(ItineraryPrograms!V9=\"y\",getScoreFactor(\"Program\",AR$2),\"\")","v":""},{"$f":"IF(ItineraryPrograms!W9=\"y\",getScoreFactor(\"Program\",AS$2),\"\")","v":114},{"$f":"IF(ItineraryPrograms!X9=\"y\",getScoreFactor(\"Program\",AT$2),\"\")","v":129},{"$f":"IF(ItineraryPrograms!Y9=\"y\",getScoreFactor(\"Program\",AU$2),\"\")","v":""},{"$f":"IF(ItineraryPrograms!Z9=\"y\",getScoreFactor(\"Program\",AV$2),\"\")","v":""},{"$f":"IF(ItineraryPrograms!AA9=\"y\",getScoreFactor(\"Program\",AW$2),\"\")","v":""},{"$f":"IF(ItineraryPrograms!AB9=\"y\",getScoreFactor(\"Program\",AX$2),\"\")","v":""},{"$f":"IF(ItineraryPrograms!AC9=\"y\",getScoreFactor(\"Program\",AY$2),\"\")","v":""},{"$f":"IF(ItineraryPrograms!AD9=\"y\",getScoreFactor(\"Program\",AZ$2),\"\")","v":175.5},{"$f":"IF(ItineraryPrograms!AE9=\"y\",getScoreFactor(\"Program\",BA$2),\"\")","v":""},{"$f":"IF(ItineraryPrograms!AF9=\"y\",getScoreFactor(\"Program\",BB$2),\"\")","v":""},{"$f":"IF(ItineraryPrograms!AG9=\"y\",getScoreFactor(\"Program\",BC$2),\"\")","v":""},{"$f":"IF(ItineraryPrograms!AH9=\"y\",getScoreFactor(\"Program\",BD$2),\"\")","v":""},{"$f":"IF(ItineraryPrograms!AI9=\"y\",getScoreFactor(\"Program\",BE$2),\"\")","v":""},{"$f":"IF(ItineraryPrograms!AJ9=\"y\",getScoreFactor(\"Program\",BF$2),\"\")","v":220.5},{"$f":"IF(ItineraryPrograms!AK9=\"y\",getScoreFactor(\"Program\",BG$2),\"\")","v":""},{"$f":"IF(ItineraryPrograms!AL9=\"y\",getScoreFactor(\"Program\",BH$2),\"\")","v":255},{"$f":"IF(ItineraryPrograms!AM9=\"y\",getScoreFactor(\"Program\",BI$2),\"\")","v":""},{"$f":"IF(ItineraryPrograms!AN9=\"y\",getScoreFactor(\"Program\",BJ$2),\"\")","v":193.5},{"$f":"IF(ItineraryPrograms!AO9=\"y\",getScoreFactor(\"Program\",BK$2),\"\")","v":""},{"$f":"IF(ItineraryPrograms!AP9=\"y\",getScoreFactor(\"Program\",BL$2),\"\")","v":""},{"$f":"IF(ItineraryPrograms!AQ9=\"y\",getScoreFactor(\"Program\",BM$2),\"\")","v":""},{"$f":"IF(ItineraryPrograms!AR9=\"y\",getScoreFactor(\"Program\",BN$2),\"\")","v":""},{"$f":"IF(ItineraryPrograms!AS9=\"y\",getScoreFactor(\"Program\",BO$2),\"\")","v":""},{"$f":"IF(ItineraryPrograms!AT9=\"y\",getScoreFactor(\"Program\",BP$2),\"\")","v":""},{"$f":"IF(ItineraryPrograms!AU9=\"y\",getScoreFactor(\"Program\",BQ$2),\"\")","v":151.5},{"$f":"IF(ItineraryPrograms!AV9=\"y\",getScoreFactor(\"Program\",BR$2),\"\")","v":""},{"$f":"IF(ItineraryPrograms!AW9=\"y\",getScoreFactor(\"Program\",BS$2),\"\")","v":""},{"$f":"IF(ItineraryPrograms!AX9=\"y\",getScoreFactor(\"Program\",BT$2),\"\")","v":""},{"$f":"IF(ItineraryPrograms!AY9=\"y\",getScoreFactor(\"Program\",BU$2),\"\")","v":207},{"$f":"IF(ItineraryPrograms!AZ9=\"y\",getScoreFactor(\"Program\",BV$2),\"\")","v":""},{"$f":"IF(ItineraryPrograms!BA9=\"y\",getScoreFactor(\"Program\",BW$2),\"\")","v":91.5},{"$f":"IF(ItineraryPrograms!BB9=\"y\",getScoreFactor(\"Program\",BX$2),\"\")","v":235.5},{"$f":"IF(ItineraryPrograms!BC9=\"y\",getScoreFactor(\"Program\",BY$2),\"\")","v":133.5},{"$f":"IF(ItineraryPrograms!BD9=\"y\",getScoreFactor(\"Program\",BZ$2),\"\")","v":""},{"$f":"IF(ItineraryPrograms!BE9=\"y\",getScoreFactor(\"Program\",CA$2),\"\")","v":""},{"$f":"IF(ItineraryPrograms!BF9=\"y\",getScoreFactor(\"Program\",CB$2),\"\")","v":139.5}]
[{"$f":"Itineraries!A10","v":"12-8"},13309.166666666666,{"$f":"getScoreFactor(C$2,itineraryCamps!C11)","v":2666.6666666666665},{"$f":"getScoreFactor(D$2,\"Miles\") *itineraryCamps!D11","v":5500},{"$f":"getScoreFactor(E$2,Itineraries!B10)","v":40},{"$f":"getScoreFactor(F$2,Itineraries!C10)","v":80},{"$f":"getScoreFactor(G$2,Itineraries!E10)","v":50},{"$f":"getScoreFactor(H$2,Itineraries!H10)","v":250},{"$f":"getScoreFactor(I$2,Itineraries!G10)","v":60},{"$f":"getScoreFactor(J$2,Itineraries!J10)","v":50},{"$f":"getScoreFactor(K$2,Itineraries!K10)","v":70},{"$f":"getScoreFactor(L$2,Itineraries!L10)","v":100},{"$f":"IF(INDEX(startingTA,numericItinerary($A10))=$M$2,getScoreFactor(M$2,\"y\"),getScoreFactor(M$2,\"n\"))","v":0},{"$f":"IF(INDEX(endingTA,numericItinerary($A10))=$N$2,getScoreFactor(N$2,\"y\"),getScoreFactor(N$2,\"n\"))","v":0},{"$f":"IF(INDEX(baldyMountainHike,numericItinerary($A10))=\"\",\"\",getPeakScore(O$2))","v":351},{"$f":"IF(INDEX(mountPhillipsHike,numericItinerary($A10))=\"\",\"\",getPeakScore(P$2))","v":""},{"$f":"IF(INDEX(toothOfTimeHike,numericItinerary($A10))=\"\",\"\",getPeakScore(Q$2))","v":""},{"$f":"IF(INDEX(inspirationPointHike,numericItinerary($A10))=\"\",\"\",getPeakScore(Q$2))","v":""},{"$f":"IF(INDEX(trailPeakHike,numericItinerary($A10))=\"\",\"\",getPeakScore(S$2))","v":""},{"$f":"IF(INDEX(mountaineeringHike,numericItinerary($A10))=\"\",\"\",getPeakScore(T$2))","v":202.5},{"$f":"IF(areaImportant<>\"y\",\"\",IF(Itineraries!P10<>\"Y\",\"\",getareascore(U$2)))","v":""},{"$f":"IF(areaImportant<>\"y\",\"\",IF(Itineraries!Q10<>\"Y\",\"\",getareascore(V$2)))","v":150},{"$f":"IF(areaImportant<>\"y\",\"\",IF(Itineraries!R10<>\"Y\",\"\",getareascore(W$2)))","v":1000},{"$f":"IF(areaImportant<>\"y\",\"\",IF(Itineraries!S10<>\"Y\",\"\",getareascore(X$2)))","v":""},{"$f":"IF(ItineraryPrograms!C10=\"y\",getScoreFactor(\"Program\",Y$2),\"\")","v":""},{"$f":"IF(ItineraryPrograms!D10=\"y\",getScoreFactor(\"Program\",Z$2),\"\")","v":""},{"$f":"IF(ItineraryPrograms!E10=\"y\",getScoreFactor(\"Program\",AA$2),\"\")","v":""},{"$f":"IF(ItineraryPrograms!F10=\"y\",getScoreFactor(\"Program\",AB$2),\"\")","v":""},{"$f":"IF(ItineraryPrograms!G10=\"y\",getScoreFactor(\"Program\",AC$2),\"\")","v":""},{"$f":"IF(ItineraryPrograms!H10=\"y\",getScoreFactor(\"Program\",AD$2),\"\")","v":166.5},{"$f":"IF(ItineraryPrograms!I10=\"y\",getScoreFactor(\"Program\",AE$2),\"\")","v":166.5},{"$f":"IF(ItineraryPrograms!J10=\"y\",getScoreFactor(\"Program\",AF$2),\"\")","v":""},{"$f":"IF(ItineraryPrograms!K10=\"y\",getScoreFactor(\"Program\",AG$2),\"\")","v":""},{"$f":"IF(ItineraryPrograms!L10=\"y\",getScoreFactor(\"Program\",AH$2),\"\")","v":""},{"$f":"IF(ItineraryPrograms!M10=\"y\",getScoreFactor(\"Program\",AI$2),\"\")","v":109.5},{"$f":"IF(ItineraryPrograms!N10=\"y\",getScoreFactor(\"Program\",AJ$2),\"\")","v":109.5},{"$f":"IF(ItineraryPrograms!O10=\"y\",getScoreFactor(\"Program\",AK$2),\"\")","v":""},{"$f":"IF(ItineraryPrograms!P10=\"y\",getScoreFactor(\"Program\",AL$2),\"\")","v":""},{"$f":"IF(ItineraryPrograms!Q10=\"y\",getScoreFactor(\"Program\",AM$2),\"\")","v":123},{"$f":"IF(ItineraryPrograms!R10=\"y\",getScoreFactor(\"Program\",AN$2),\"\")","v":""},{"$f":"IF(ItineraryPrograms!S10=\"y\",getScoreFactor(\"Program\",AO$2),\"\")","v":""},{"$f":"IF(ItineraryPrograms!T10=\"y\",getScoreFactor(\"Program\",AP$2),\"\")","v":""},{"$f":"IF(ItineraryPrograms!U10=\"y\",getScoreFactor(\"Program\",AQ$2),\"\")","v":93},{"$f":"IF(ItineraryPrograms!V10=\"y\",getScoreFactor(\"Program\",AR$2),\"\")","v":""},{"$f":"IF(ItineraryPrograms!W10=\"y\",getScoreFactor(\"Program\",AS$2),\"\")","v":""},{"$f":"IF(ItineraryPrograms!X10=\"y\",getScoreFactor(\"Program\",AT$2),\"\")","v":129},{"$f":"IF(ItineraryPrograms!Y10=\"y\",getScoreFactor(\"Program\",AU$2),\"\")","v":""},{"$f":"IF(ItineraryPrograms!Z10=\"y\",getScoreFactor(\"Program\",AV$2),\"\")","v":162},{"$f":"IF(ItineraryPrograms!AA10=\"y\",getScoreFactor(\"Program\",AW$2),\"\")","v":201},{"$f":"IF(ItineraryPrograms!AB10=\"y\",getScoreFactor(\"Program\",AX$2),\"\")","v":145.5},{"$f":"IF(ItineraryPrograms!AC10=\"y\",getScoreFactor(\"Program\",AY$2),\"\")","v":150},{"$f":"IF(ItineraryPrograms!AD10=\"y\",getScoreFactor(\"Program\",AZ$2),\"\")","v":175.5},{"$f":"IF(ItineraryPrograms!AE10=\"y\",getScoreFactor(\"Program\",BA$2),\"\")","v":""},{"$f":"IF(ItineraryPrograms!AF10=\"y\",getScoreFactor(\"Program\",BB$2),\"\")","v":""},{"$f":"IF(ItineraryPrograms!AG10=\"y\",getScoreFactor(\"Program\",BC$2),\"\")","v":202.5},{"$f":"IF(ItineraryPrograms!AH10=\"y\",getScoreFactor(\"Program\",BD$2),\"\")","v":""},{"$f":"IF(ItineraryPrograms!AI10=\"y\",getScoreFactor(\"Program\",BE$2),\"\")","v":""},{"$f":"IF(ItineraryPrograms!AJ10=\"y\",getScoreFactor(\"Program\",BF$2),\"\")","v":""},{"$f":"IF(ItineraryPrograms!AK10=\"y\",getScoreFactor(\"Program\",BG$2),\"\")","v":""},{"$f":"IF(ItineraryPrograms!AL10=\"y\",getScoreFactor(\"Program\",BH$2),\"\")","v":""},{"$f":"IF(ItineraryPrograms!AM10=\"y\",getScoreFactor(\"Program\",BI$2),\"\")","v":""},{"$f":"IF(ItineraryPrograms!AN10=\"y\",getScoreFactor(\"Program\",BJ$2),\"\")","v":""},{"$f":"IF(ItineraryPrograms!AO10=\"y\",getScoreFactor(\"Program\",BK$2),\"\")","v":181.5},{"$f":"IF(ItineraryPrograms!AP10=\"y\",getScoreFactor(\"Program\",BL$2),\"\")","v":220.5},{"$f":"IF(ItineraryPrograms!AQ10=\"y\",getScoreFactor(\"Program\",BM$2),\"\")","v":210},{"$f":"IF(ItineraryPrograms!AR10=\"y\",getScoreFactor(\"Program\",BN$2),\"\")","v":""},{"$f":"IF(ItineraryPrograms!AS10=\"y\",getScoreFactor(\"Program\",BO$2),\"\")","v":""},{"$f":"IF(ItineraryPrograms!AT10=\"y\",getScoreFactor(\"Program\",BP$2),\"\")","v":193.5},{"$f":"IF(ItineraryPrograms!AU10=\"y\",getScoreFactor(\"Program\",BQ$2),\"\")","v":""},{"$f":"IF(ItineraryPrograms!AV10=\"y\",getScoreFactor(\"Program\",BR$2),\"\")","v":""},{"$f":"IF(ItineraryPrograms!AW10=\"y\",getScoreFactor(\"Program\",BS$2),\"\")","v":""},{"$f":"IF(ItineraryPrograms!AX10=\"y\",getScoreFactor(\"Program\",BT$2),\"\")","v":""},{"$f":"IF(ItineraryPrograms!AY10=\"y\",getScoreFactor(\"Program\",BU$2),\"\")","v":""},{"$f":"IF(ItineraryPrograms!AZ10=\"y\",getScoreFactor(\"Program\",BV$2),\"\")","v":207},{"$f":"IF(ItineraryPrograms!BA10=\"y\",getScoreFactor(\"Program\",BW$2),\"\")","v":""},{"$f":"IF(ItineraryPrograms!BB10=\"y\",getScoreFactor(\"Program\",BX$2),\"\")","v":235.5},{"$f":"IF(ItineraryPrograms!BC10=\"y\",getScoreFactor(\"Program\",BY$2),\"\")","v":133.5},{"$f":"IF(ItineraryPrograms!BD10=\"y\",getScoreFactor(\"Program\",BZ$2),\"\")","v":285},{"$f":"IF(ItineraryPrograms!BE10=\"y\",getScoreFactor(\"Program\",CA$2),\"\")","v":114},{"$f":"IF(ItineraryPrograms!BF10=\"y\",getScoreFactor(\"Program\",CB$2),\"\")","v":""}]
[{"$f":"Itineraries!A11","v":"12-9"},15206.916666666666,{"$f":"getScoreFactor(C$2,itineraryCamps!C12)","v":2666.6666666666665},{"$f":"getScoreFactor(D$2,\"Miles\") *itineraryCamps!D12","v":6100},{"$f":"getScoreFactor(E$2,Itineraries!B11)","v":30},{"$f":"getScoreFactor(F$2,Itineraries!C11)","v":60},{"$f":"getScoreFactor(G$2,Itineraries!E11)","v":125},{"$f":"getScoreFactor(H$2,Itineraries!H11)","v":250},{"$f":"getScoreFactor(I$2,Itineraries!G11)","v":50},{"$f":"getScoreFactor(J$2,Itineraries!J11)","v":20},{"$f":"getScoreFactor(K$2,Itineraries!K11)","v":50},{"$f":"getScoreFactor(L$2,Itineraries!L11)","v":300},{"$f":"IF(INDEX(startingTA,numericItinerary($A11))=$M$2,getScoreFactor(M$2,\"y\"),getScoreFactor(M$2,\"n\"))","v":0},{"$f":"IF(INDEX(endingTA,numericItinerary($A11))=$N$2,getScoreFactor(N$2,\"y\"),getScoreFactor(N$2,\"n\"))","v":500},{"$f":"IF(INDEX(baldyMountainHike,numericItinerary($A11))=\"\",\"\",getPeakScore(O$2))","v":""},{"$f":"IF(INDEX(mountPhillipsHike,numericItinerary($A11))=\"\",\"\",getPeakScore(P$2))","v":""},{"$f":"IF(INDEX(toothOfTimeHike,numericItinerary($A11))=\"\",\"\",getPeakScore(Q$2))","v":137.25},{"$f":"IF(INDEX(inspirationPointHike,numericItinerary($A11))=\"\",\"\",getPeakScore(Q$2))","v":""},{"$f":"IF(INDEX(trailPeakHike,numericItinerary($A11))=\"\",\"\",getPeakScore(S$2))","v":""},{"$f":"IF(INDEX(mountaineeringHike,numericItinerary($A11))=\"\",\"\",getPeakScore(T$2))","v":202.5},{"$f":"IF(areaImportant<>\"y\",\"\",IF(Itineraries!P11<>\"Y\",\"\",getareascore(U$2)))","v":""},{"$f":"IF(areaImportant<>\"y\",\"\",IF(Itineraries!Q11<>\"Y\",\"\",getareascore(V$2)))","v":150},{"$f":"IF(areaImportant<>\"y\",\"\",IF(Itineraries!R11<>\"Y\",\"\",getareascore(W$2)))","v":1000},{"$f":"IF(areaImportant<>\"y\",\"\",IF(Itineraries!S11<>\"Y\",\"\",getareascore(X$2)))","v":""},{"$f":"IF(ItineraryPrograms!C11=\"y\",getScoreFactor(\"Program\",Y$2),\"\")","v":228},{"$f":"IF(ItineraryPrograms!D11=\"y\",getScoreFactor(\"Program\",Z$2),\"\")","v":""},{"$f":"IF(ItineraryPrograms!E11=\"y\",getScoreFactor(\"Program\",AA$2),\"\")","v":""},{"$f":"IF(ItineraryPrograms!F11=\"y\",getScoreFactor(\"Program\",AB$2),\"\")","v":282},{"$f":"IF(ItineraryPrograms!G11=\"y\",getScoreFactor(\"Program\",AC$2),\"\")","v":""},{"$f":"IF(ItineraryPrograms!H11=\"y\",getScoreFactor(\"Program\",AD$2),\"\")","v":166.5},{"$f":"IF(ItineraryPrograms!I11=\"y\",getScoreFactor(\"Program\",AE$2),\"\")","v":166.5},{"$f":"IF(ItineraryPrograms!J11=\"y\",getScoreFactor(\"Program\",AF$2),\"\")","v":126},{"$f":"IF(ItineraryPrograms!K11=\"y\",getScoreFactor(\"Program\",AG$2),\"\")","v":130.5},{"$f":"IF(ItineraryPrograms!L11=\"y\",getScoreFactor(\"Program\",AH$2),\"\")","v":""},{"$f":"IF(ItineraryPrograms!M11=\"y\",getScoreFactor(\"Program\",AI$2),\"\")","v":109.5},{"$f":"IF(ItineraryPrograms!N11=\"y\",getScoreFactor(\"Program\",AJ$2),\"\")","v":109.5},{"$f":"IF(ItineraryPrograms!O11=\"y\",getScoreFactor(\"Program\",AK$2),\"\")","v":111},{"$f":"IF(ItineraryPrograms!P11=\"y\",getScoreFactor(\"Program\",AL$2),\"\")","v":""},{"$f":"IF(ItineraryPrograms!Q11=\"y\",getScoreFactor(\"Program\",AM$2),\"\")","v":""},{"$f":"IF(ItineraryPrograms!R11=\"y\",getScoreFactor(\"Program\",AN$2),\"\")","v":""},{"$f":"IF(ItineraryPrograms!S11=\"y\",getScoreFactor(\"Program\",AO$2),\"\")","v":""},{"$f":"IF(ItineraryPrograms!T11=\"y\",getScoreFactor(\"Program\",AP$2),\"\")","v":""},{"$f":"IF(ItineraryPrograms!U11=\"y\",getScoreFactor(\"Program\",AQ$2),\"\")","v":93},{"$f":"IF(ItineraryPrograms!V11=\"y\",getScoreFactor(\"Program\",AR$2),\"\")","v":""},{"$f":"IF(ItineraryPrograms!W11=\"y\",getScoreFactor(\"Program\",AS$2),\"\")","v":114},{"$f":"IF(ItineraryPrograms!X11=\"y\",getScoreFactor(\"Program\",AT$2),\"\")","v":""},{"$f":"IF(ItineraryPrograms!Y11=\"y\",getScoreFactor(\"Program\",AU$2),\"\")","v":""},{"$f":"IF(ItineraryPrograms!Z11=\"y\",getScoreFactor(\"Program\",AV$2),\"\")","v":""},{"$f":"IF(ItineraryPrograms!AA11=\"y\",getScoreFactor(\"Program\",AW$2),\"\")","v":""},{"$f":"IF(ItineraryPrograms!AB11=\"y\",getScoreFactor(\"Program\",AX$2),\"\")","v":""},{"$f":"IF(ItineraryPrograms!AC11=\"y\",getScoreFactor(\"Program\",AY$2),\"\")","v":""},{"$f":"IF(ItineraryPrograms!AD11=\"y\",getScoreFactor(\"Program\",AZ$2),\"\")","v":""},{"$f":"IF(ItineraryPrograms!AE11=\"y\",getScoreFactor(\"Program\",BA$2),\"\")","v":""},{"$f":"IF(ItineraryPrograms!AF11=\"y\",getScoreFactor(\"Program\",BB$2),\"\")","v":""},{"$f":"IF(ItineraryPrograms!AG11=\"y\",getScoreFactor(\"Program\",BC$2),\"\")","v":202.5},{"$f":"IF(ItineraryPrograms!AH11=\"y\",getScoreFactor(\"Program\",BD$2),\"\")","v":91.5},{"$f":"IF(ItineraryPrograms!AI11=\"y\",getScoreFactor(\"Program\",BE$2),\"\")","v":""},{"$f":"IF(ItineraryPrograms!AJ11=\"y\",getScoreFactor(\"Program\",BF$2),\"\")","v":""},{"$f":"IF(ItineraryPrograms!AK11=\"y\",getScoreFactor(\"Program\",BG$2),\"\")","v":210},{"$f":"IF(ItineraryPrograms!AL11=\"y\",getScoreFactor(\"Program\",BH$2),\"\")","v":""},{"$f":"IF(ItineraryPrograms!AM11=\"y\",getScoreFactor(\"Program\",BI$2),\"\")","v":235.5},{"$f":"IF(ItineraryPrograms!AN11=\"y\",getScoreFactor(\"Program\",BJ$2),\"\")","v":""},{"$f":"IF(ItineraryPrograms!AO11=\"y\",getScoreFactor(\"Program\",BK$2),\"\")","v":181.5},{"$f":"IF(ItineraryPrograms!AP11=\"y\",getScoreFactor(\"Program\",BL$2),\"\")","v":220.5},{"$f":"IF(ItineraryPrograms!AQ11=\"y\",getScoreFactor(\"Program\",BM$2),\"\")","v":""},{"$f":"IF(ItineraryPrograms!AR11=\"y\",getScoreFactor(\"Program\",BN$2),\"\")","v":""},{"$f":"IF(ItineraryPrograms!AS11=\"y\",getScoreFactor(\"Program\",BO$2),\"\")","v":235.5},{"$f":"IF(ItineraryPrograms!AT11=\"y\",getScoreFactor(\"Program\",BP$2),\"\")","v":193.5},{"$f":"IF(ItineraryPrograms!AU11=\"y\",getScoreFactor(\"Program\",BQ$2),\"\")","v":151.5},{"$f":"IF(ItineraryPrograms!AV11=\"y\",getScoreFactor(\"Program\",BR$2),\"\")","v":""},{"$f":"IF(ItineraryPrograms!AW11=\"y\",getScoreFactor(\"Program\",BS$2),\"\")","v":""},{"$f":"IF(ItineraryPrograms!AX11=\"y\",getScoreFactor(\"Program\",BT$2),\"\")","v":""},{"$f":"IF(ItineraryPrograms!AY11=\"y\",getScoreFactor(\"Program\",BU$2),\"\")","v":207},{"$f":"IF(ItineraryPrograms!AZ11=\"y\",getScoreFactor(\"Program\",BV$2),\"\")","v":""},{"$f":"IF(ItineraryPrograms!BA11=\"y\",getScoreFactor(\"Program\",BW$2),\"\")","v":""},{"$f":"IF(ItineraryPrograms!BB11=\"y\",getScoreFactor(\"Program\",BX$2),\"\")","v":""},{"$f":"IF(ItineraryPrograms!BC11=\"y\",getScoreFactor(\"Program\",BY$2),\"\")","v":133.5},{"$f":"IF(ItineraryPrograms!BD11=\"y\",getScoreFactor(\"Program\",BZ$2),\"\")","v":285},{"$f":"IF(ItineraryPrograms!BE11=\"y\",getScoreFactor(\"Program\",CA$2),\"\")","v":114},{"$f":"IF(ItineraryPrograms!BF11=\"y\",getScoreFactor(\"Program\",CB$2),\"\")","v":""}]
[{"$f":"Itineraries!A12","v":"12-10"},14348.666666666666,{"$f":"getScoreFactor(C$2,itineraryCamps!C13)","v":2666.6666666666665},{"$f":"getScoreFactor(D$2,\"Miles\") *itineraryCamps!D13","v":5300},{"$f":"getScoreFactor(E$2,Itineraries!B12)","v":40},{"$f":"getScoreFactor(F$2,Itineraries!C12)","v":80},{"$f":"getScoreFactor(G$2,Itineraries!E12)","v":75},{"$f":"getScoreFactor(H$2,Itineraries!H12)","v":300},{"$f":"getScoreFactor(I$2,Itineraries!G12)","v":60},{"$f":"getScoreFactor(J$2,Itineraries!J12)","v":50},{"$f":"getScoreFactor(K$2,Itineraries!K12)","v":60},{"$f":"getScoreFactor(L$2,Itineraries!L12)","v":100},{"$f":"IF(INDEX(startingTA,numericItinerary($A12))=$M$2,getScoreFactor(M$2,\"y\"),getScoreFactor(M$2,\"n\"))","v":0},{"$f":"IF(INDEX(endingTA,numericItinerary($A12))=$N$2,getScoreFactor(N$2,\"y\"),getScoreFactor(N$2,\"n\"))","v":0},{"$f":"IF(INDEX(baldyMountainHike,numericItinerary($A12))=\"\",\"\",getPeakScore(O$2))","v":351},{"$f":"IF(INDEX(mountPhillipsHike,numericItinerary($A12))=\"\",\"\",getPeakScore(P$2))","v":""},{"$f":"IF(INDEX(toothOfTimeHike,numericItinerary($A12))=\"\",\"\",getPeakScore(Q$2))","v":""},{"$f":"IF(INDEX(inspirationPointHike,numericItinerary($A12))=\"\",\"\",getPeakScore(Q$2))","v":""},{"$f":"IF(INDEX(trailPeakHike,numericItinerary($A12))=\"\",\"\",getPeakScore(S$2))","v":""},{"$f":"IF(INDEX(mountaineeringHike,numericItinerary($A12))=\"\",\"\",getPeakScore(T$2))","v":202.5},{"$f":"IF(areaImportant<>\"y\",\"\",IF(Itineraries!P12<>\"Y\",\"\",getareascore(U$2)))","v":""},{"$f":"IF(areaImportant<>\"y\",\"\",IF(Itineraries!Q12<>\"Y\",\"\",getareascore(V$2)))","v":""},{"$f":"IF(areaImportant<>\"y\",\"\",IF(Itineraries!R12<>\"Y\",\"\",getareascore(W$2)))","v":1000},{"$f":"IF(areaImportant<>\"y\",\"\",IF(Itineraries!S12<>\"Y\",\"\",getareascore(X$2)))","v":""},{"$f":"IF(ItineraryPrograms!C12=\"y\",getScoreFactor(\"Program\",Y$2),\"\")","v":""},{"$f":"IF(ItineraryPrograms!D12=\"y\",getScoreFactor(\"Program\",Z$2),\"\")","v":""},{"$f":"IF(ItineraryPrograms!E12=\"y\",getScoreFactor(\"Program\",AA$2),\"\")","v":""},{"$f":"IF(ItineraryPrograms!F12=\"y\",getScoreFactor(\"Program\",AB$2),\"\")","v":""},{"$f":"IF(ItineraryPrograms!G12=\"y\",getScoreFactor(\"Program\",AC$2),\"\")","v":""},{"$f":"IF(ItineraryPrograms!H12=\"y\",getScoreFactor(\"Program\",AD$2),\"\")","v":166.5},{"$f":"IF(ItineraryPrograms!I12=\"y\",getScoreFactor(\"Program\",AE$2),\"\")","v":166.5},{"$f":"IF(ItineraryPrograms!J12=\"y\",getScoreFactor(\"Program\",AF$2),\"\")","v":""},{"$f":"IF(ItineraryPrograms!K12=\"y\",getScoreFactor(\"Program\",AG$2),\"\")","v":""},{"$f":"IF(ItineraryPrograms!L12=\"y\",getScoreFactor(\"Program\",AH$2),\"\")","v":""},{"$f":"IF(ItineraryPrograms!M12=\"y\",getScoreFactor(\"Program\",AI$2),\"\")","v":109.5},{"$f":"IF(ItineraryPrograms!N12=\"y\",getScoreFactor(\"Program\",AJ$2),\"\")","v":109.5},{"$f":"IF(ItineraryPrograms!O12=\"y\",getScoreFactor(\"Program\",AK$2),\"\")","v":111},{"$f":"IF(ItineraryPrograms!P12=\"y\",getScoreFactor(\"Program\",AL$2),\"\")","v":""},{"$f":"IF(ItineraryPrograms!Q12=\"y\",getScoreFactor(\"Program\",AM$2),\"\")","v":123},{"$f":"IF(ItineraryPrograms!R12=\"y\",getScoreFactor(\"Program\",AN$2),\"\")","v":""},{"$f":"IF(ItineraryPrograms!S12=\"y\",getScoreFactor(\"Program\",AO$2),\"\")","v":106.5},{"$f":"IF(ItineraryPrograms!T12=\"y\",getScoreFactor(\"Program\",AP$2),\"\")","v":""},{"$f":"IF(ItineraryPrograms!U12=\"y\",getScoreFactor(\"Program\",AQ$2),\"\")","v":93},{"$f":"IF(ItineraryPrograms!V12=\"y\",getScoreFactor(\"Program\",AR$2),\"\")","v":""},{"$f":"IF(ItineraryPrograms!W12=\"y\",getScoreFactor(\"Program\",AS$2),\"\")","v":114},{"$f":"IF(ItineraryPrograms!X12=\"y\",getScoreFactor(\"Program\",AT$2),\"\")","v":129},{"$f":"IF(ItineraryPrograms!Y12=\"y\",getScoreFactor(\"Program\",AU$2),\"\")","v":""},{"$f":"IF(ItineraryPrograms!Z12=\"y\",getScoreFactor(\"Program\",AV$2),\"\")","v":""},{"$f":"IF(ItineraryPrograms!AA12=\"y\",getScoreFactor(\"Program\",AW$2),\"\")","v":201},{"$f":"IF(ItineraryPrograms!AB12=\"y\",getScoreFactor(\"Program\",AX$2),\"\")","v":145.5},{"$f":"IF(ItineraryPrograms!AC12=\"y\",getScoreFactor(\"Program\",AY$2),\"\")","v":""},{"$f":"IF(ItineraryPrograms!AD12=\"y\",getScoreFactor(\"Program\",AZ$2),\"\")","v":175.5},{"$f":"IF(ItineraryPrograms!AE12=\"y\",getScoreFactor(\"Program\",BA$2),\"\")","v":""},{"$f":"IF(ItineraryPrograms!AF12=\"y\",getScoreFactor(\"Program\",BB$2),\"\")","v":""},{"$f":"IF(ItineraryPrograms!AG12=\"y\",getScoreFactor(\"Program\",BC$2),\"\")","v":202.5},{"$f":"IF(ItineraryPrograms!AH12=\"y\",getScoreFactor(\"Program\",BD$2),\"\")","v":""},{"$f":"IF(ItineraryPrograms!AI12=\"y\",getScoreFactor(\"Program\",BE$2),\"\")","v":""},{"$f":"IF(ItineraryPrograms!AJ12=\"y\",getScoreFactor(\"Program\",BF$2),\"\")","v":220.5},{"$f":"IF(ItineraryPrograms!AK12=\"y\",getScoreFactor(\"Program\",BG$2),\"\")","v":210},{"$f":"IF(ItineraryPrograms!AL12=\"y\",getScoreFactor(\"Program\",BH$2),\"\")","v":255},{"$f":"IF(ItineraryPrograms!AM12=\"y\",getScoreFactor(\"Program\",BI$2),\"\")","v":235.5},{"$f":"IF(ItineraryPrograms!AN12=\"y\",getScoreFactor(\"Program\",BJ$2),\"\")","v":""},{"$f":"IF(ItineraryPrograms!AO12=\"y\",getScoreFactor(\"Program\",BK$2),\"\")","v":181.5},{"$f":"IF(ItineraryPrograms!AP12=\"y\",getScoreFactor(\"Program\",BL$2),\"\")","v":220.5},{"$f":"IF(ItineraryPrograms!AQ12=\"y\",getScoreFactor(\"Program\",BM$2),\"\")","v":""},{"$f":"IF(ItineraryPrograms!AR12=\"y\",getScoreFactor(\"Program\",BN$2),\"\")","v":""},{"$f":"IF(ItineraryPrograms!AS12=\"y\",getScoreFactor(\"Program\",BO$2),\"\")","v":235.5},{"$f":"IF(ItineraryPrograms!AT12=\"y\",getScoreFactor(\"Program\",BP$2),\"\")","v":193.5},{"$f":"IF(ItineraryPrograms!AU12=\"y\",getScoreFactor(\"Program\",BQ$2),\"\")","v":151.5},{"$f":"IF(ItineraryPrograms!AV12=\"y\",getScoreFactor(\"Program\",BR$2),\"\")","v":""},{"$f":"IF(ItineraryPrograms!AW12=\"y\",getScoreFactor(\"Program\",BS$2),\"\")","v":""},{"$f":"IF(ItineraryPrograms!AX12=\"y\",getScoreFactor(\"Program\",BT$2),\"\")","v":""},{"$f":"IF(ItineraryPrograms!AY12=\"y\",getScoreFactor(\"Program\",BU$2),\"\")","v":207},{"$f":"IF(ItineraryPrograms!AZ12=\"y\",getScoreFactor(\"Program\",BV$2),\"\")","v":""},{"$f":"IF(ItineraryPrograms!BA12=\"y\",getScoreFactor(\"Program\",BW$2),\"\")","v":""},{"$f":"IF(ItineraryPrograms!BB12=\"y\",getScoreFactor(\"Program\",BX$2),\"\")","v":235.5},{"$f":"IF(ItineraryPrograms!BC12=\"y\",getScoreFactor(\"Program\",BY$2),\"\")","v":133.5},{"$f":"IF(ItineraryPrograms!BD12=\"y\",getScoreFactor(\"Program\",BZ$2),\"\")","v":285},{"$f":"IF(ItineraryPrograms!BE12=\"y\",getScoreFactor(\"Program\",CA$2),\"\")","v":""},{"$f":"IF(ItineraryPrograms!BF12=\"y\",getScoreFactor(\"Program\",CB$2),\"\")","v":""}]
[{"$f":"Itineraries!A13","v":"12-11"},13800.916666666666,{"$f":"getScoreFactor(C$2,itineraryCamps!C14)","v":2666.6666666666665},{"$f":"getScoreFactor(D$2,\"Miles\") *itineraryCamps!D14","v":6400},{"$f":"getScoreFactor(E$2,Itineraries!B13)","v":50},{"$f":"getScoreFactor(F$2,Itineraries!C13)","v":70},{"$f":"getScoreFactor(G$2,Itineraries!E13)","v":125},{"$f":"getScoreFactor(H$2,Itineraries!H13)","v":225},{"$f":"getScoreFactor(I$2,Itineraries!G13)","v":60},{"$f":"getScoreFactor(J$2,Itineraries!J13)","v":80},{"$f":"getScoreFactor(K$2,Itineraries!K13)","v":80},{"$f":"getScoreFactor(L$2,Itineraries!L13)","v":300},{"$f":"IF(INDEX(startingTA,numericItinerary($A13))=$M$2,getScoreFactor(M$2,\"y\"),getScoreFactor(M$2,\"n\"))","v":0},{"$f":"IF(INDEX(endingTA,numericItinerary($A13))=$N$2,getScoreFactor(N$2,\"y\"),getScoreFactor(N$2,\"n\"))","v":500},{"$f":"IF(INDEX(baldyMountainHike,numericItinerary($A13))=\"\",\"\",getPeakScore(O$2))","v":""},{"$f":"IF(INDEX(mountPhillipsHike,numericItinerary($A13))=\"\",\"\",getPeakScore(P$2))","v":""},{"$f":"IF(INDEX(toothOfTimeHike,numericItinerary($A13))=\"\",\"\",getPeakScore(Q$2))","v":137.25},{"$f":"IF(INDEX(inspirationPointHike,numericItinerary($A13))=\"\",\"\",getPeakScore(Q$2))","v":""},{"$f":"IF(INDEX(trailPeakHike,numericItinerary($A13))=\"\",\"\",getPeakScore(S$2))","v":""},{"$f":"IF(INDEX(mountaineeringHike,numericItinerary($A13))=\"\",\"\",getPeakScore(T$2))","v":202.5},{"$f":"IF(areaImportant<>\"y\",\"\",IF(Itineraries!P13<>\"Y\",\"\",getareascore(U$2)))","v":200},{"$f":"IF(areaImportant<>\"y\",\"\",IF(Itineraries!Q13<>\"Y\",\"\",getareascore(V$2)))","v":150},{"$f":"IF(areaImportant<>\"y\",\"\",IF(Itineraries!R13<>\"Y\",\"\",getareascore(W$2)))","v":""},{"$f":"IF(areaImportant<>\"y\",\"\",IF(Itineraries!S13<>\"Y\",\"\",getareascore(X$2)))","v":""},{"$f":"IF(ItineraryPrograms!C13=\"y\",getScoreFactor(\"Program\",Y$2),\"\")","v":228},{"$f":"IF(ItineraryPrograms!D13=\"y\",getScoreFactor(\"Program\",Z$2),\"\")","v":""},{"$f":"IF(ItineraryPrograms!E13=\"y\",getScoreFactor(\"Program\",AA$2),\"\")","v":""},{"$f":"IF(ItineraryPrograms!F13=\"y\",getScoreFactor(\"Program\",AB$2),\"\")","v":""},{"$f":"IF(ItineraryPrograms!G13=\"y\",getScoreFactor(\"Program\",AC$2),\"\")","v":""},{"$f":"IF(ItineraryPrograms!H13=\"y\",getScoreFactor(\"Program\",AD$2),\"\")","v":""},{"$f":"IF(ItineraryPrograms!I13=\"y\",getScoreFactor(\"Program\",AE$2),\"\")","v":""},{"$f":"IF(ItineraryPrograms!J13=\"y\",getScoreFactor(\"Program\",AF$2),\"\")","v":126},{"$f":"IF(ItineraryPrograms!K13=\"y\",getScoreFactor(\"Program\",AG$2),\"\")","v":130.5},{"$f":"IF(ItineraryPrograms!L13=\"y\",getScoreFactor(\"Program\",AH$2),\"\")","v":""},{"$f":"IF(ItineraryPrograms!M13=\"y\",getScoreFactor(\"Program\",AI$2),\"\")","v":109.5},{"$f":"IF(ItineraryPrograms!N13=\"y\",getScoreFactor(\"Program\",AJ$2),\"\")","v":109.5},{"$f":"IF(ItineraryPrograms!O13=\"y\",getScoreFactor(\"Program\",AK$2),\"\")","v":111},{"$f":"IF(ItineraryPrograms!P13=\"y\",getScoreFactor(\"Program\",AL$2),\"\")","v":114},{"$f":"IF(ItineraryPrograms!Q13=\"y\",getScoreFactor(\"Program\",AM$2),\"\")","v":""},{"$f":"IF(ItineraryPrograms!R13=\"y\",getScoreFactor(\"Program\",AN$2),\"\")","v":126},{"$f":"IF(ItineraryPrograms!S13=\"y\",getScoreFactor(\"Program\",AO$2),\"\")","v":106.5},{"$f":"IF(ItineraryPrograms!T13=\"y\",getScoreFactor(\"Program\",AP$2),\"\")","v":145.5},{"$f":"IF(ItineraryPrograms!U13=\"y\",getScoreFactor(\"Program\",AQ$2),\"\")","v":93},{"$f":"IF(ItineraryPrograms!V13=\"y\",getScoreFactor(\"Program\",AR$2),\"\")","v":""},{"$f":"IF(ItineraryPrograms!W13=\"y\",getScoreFactor(\"Program\",AS$2),\"\")","v":""},{"$f":"IF(ItineraryPrograms!X13=\"y\",getScoreFactor(\"Program\",AT$2),\"\")","v":""},{"$f":"IF(ItineraryPrograms!Y13=\"y\",getScoreFactor(\"Program\",AU$2),\"\")","v":""},{"$f":"IF(ItineraryPrograms!Z13=\"y\",getScoreFactor(\"Program\",AV$2),\"\")","v":""},{"$f":"IF(ItineraryPrograms!AA13=\"y\",getScoreFactor(\"Program\",AW$2),\"\")","v":""},{"$f":"IF(ItineraryPrograms!AB13=\"y\",getScoreFactor(\"Program\",AX$2),\"\")","v":""},{"$f":"IF(ItineraryPrograms!AC13=\"y\",getScoreFactor(\"Program\",AY$2),\"\")","v":150},{"$f":"IF(ItineraryPrograms!AD13=\"y\",getScoreFactor(\"Program\",AZ$2),\"\")","v":""},{"$f":"IF(ItineraryPrograms!AE13=\"y\",getScoreFactor(\"Program\",BA$2),\"\")","v":""},{"$f":"IF(ItineraryPrograms!AF13=\"y\",getScoreFactor(\"Program\",BB$2),\"\")","v":""},{"$f":"IF(ItineraryPrograms!AG13=\"y\",getScoreFactor(\"Program\",BC$2),\"\")","v":202.5},{"$f":"IF(ItineraryPrograms!AH13=\"y\",getScoreFactor(\"Program\",BD$2),\"\")","v":91.5},{"$f":"IF(ItineraryPrograms!AI13=\"y\",getScoreFactor(\"Program\",BE$2),\"\")","v":""},{"$f":"IF(ItineraryPrograms!AJ13=\"y\",getScoreFactor(\"Program\",BF$2),\"\")","v":220.5},{"$f":"IF(ItineraryPrograms!AK13=\"y\",getScoreFactor(\"Program\",BG$2),\"\")","v":""},{"$f":"IF(ItineraryPrograms!AL13=\"y\",getScoreFactor(\"Program\",BH$2),\"\")","v":255},{"$f":"IF(ItineraryPrograms!AM13=\"y\",getScoreFactor(\"Program\",BI$2),\"\")","v":235.5},{"$f":"IF(ItineraryPrograms!AN13=\"y\",getScoreFactor(\"Program\",BJ$2),\"\")","v":""},{"$f":"IF(ItineraryPrograms!AO13=\"y\",getScoreFactor(\"Program\",BK$2),\"\")","v":""},{"$f":"IF(ItineraryPrograms!AP13=\"y\",getScoreFactor(\"Program\",BL$2),\"\")","v":""},{"$f":"IF(ItineraryPrograms!AQ13=\"y\",getScoreFactor(\"Program\",BM$2),\"\")","v":""},{"$f":"IF(ItineraryPrograms!AR13=\"y\",getScoreFactor(\"Program\",BN$2),\"\")","v":""},{"$f":"IF(ItineraryPrograms!AS13=\"y\",getScoreFactor(\"Program\",BO$2),\"\")","v":""},{"$f":"IF(ItineraryPrograms!AT13=\"y\",getScoreFactor(\"Program\",BP$2),\"\")","v":""},{"$f":"IF(ItineraryPrograms!AU13=\"y\",getScoreFactor(\"Program\",BQ$2),\"\")","v":""},{"$f":"IF(ItineraryPrograms!AV13=\"y\",getScoreFactor(\"Program\",BR$2),\"\")","v":""},{"$f":"IF(ItineraryPrograms!AW13=\"y\",getScoreFactor(\"Program\",BS$2),\"\")","v":""},{"$f":"IF(ItineraryPrograms!AX13=\"y\",getScoreFactor(\"Program\",BT$2),\"\")","v":""},{"$f":"IF(ItineraryPrograms!AY13=\"y\",getScoreFactor(\"Program\",BU$2),\"\")","v":""},{"$f":"IF(ItineraryPrograms!AZ13=\"y\",getScoreFactor(\"Program\",BV$2),\"\")","v":""},{"$f":"IF(ItineraryPrograms!BA13=\"y\",getScoreFactor(\"Program\",BW$2),\"\")","v":""},{"$f":"IF(ItineraryPrograms!BB13=\"y\",getScoreFactor(\"Program\",BX$2),\"\")","v":""},{"$f":"IF(ItineraryPrograms!BC13=\"y\",getScoreFactor(\"Program\",BY$2),\"\")","v":133.5},{"$f":"IF(ItineraryPrograms!BD13=\"y\",getScoreFactor(\"Program\",BZ$2),\"\")","v":285},{"$f":"IF(ItineraryPrograms!BE13=\"y\",getScoreFactor(\"Program\",CA$2),\"\")","v":114},{"$f":"IF(ItineraryPrograms!BF13=\"y\",getScoreFactor(\"Program\",CB$2),\"\")","v":""}]
[{"$f":"Itineraries!A14","v":"12-12"},{"$f":"SUM(C14:BU14)","v":14965.916666666666},{"$f":"getScoreFactor(C$2,itineraryCamps!C15)","v":2666.6666666666665},{"$f":"getScoreFactor(D$2,\"Miles\") *itineraryCamps!D15","v":6100},{"$f":"getScoreFactor(E$2,Itineraries!B14)","v":40},{"$f":"getScoreFactor(F$2,Itineraries!C14)","v":80},{"$f":"getScoreFactor(G$2,Itineraries!E14)","v":75},{"$f":"getScoreFactor(H$2,Itineraries!H14)","v":200},{"$f":"getScoreFactor(I$2,Itineraries!G14)","v":60},{"$f":"getScoreFactor(J$2,Itineraries!J14)","v":110},{"$f":"getScoreFactor(K$2,Itineraries!K14)","v":90},{"$f":"getScoreFactor(L$2,Itineraries!L14)","v":300},{"$f":"IF(INDEX(startingTA,numericItinerary($A14))=$M$2,getScoreFactor(M$2,\"y\"),getScoreFactor(M$2,\"n\"))","v":0},{"$f":"IF(INDEX(endingTA,numericItinerary($A14))=$N$2,getScoreFactor(N$2,\"y\"),getScoreFactor(N$2,\"n\"))","v":500},{"$f":"IF(INDEX(baldyMountainHike,numericItinerary($A14))=\"\",\"\",getPeakScore(O$2))","v":""},{"$f":"IF(INDEX(mountPhillipsHike,numericItinerary($A14))=\"\",\"\",getPeakScore(P$2))","v":283.5},{"$f":"IF(INDEX(toothOfTimeHike,numericItinerary($A14))=\"\",\"\",getPeakScore(Q$2))","v":137.25},{"$f":"IF(INDEX(inspirationPointHike,numericItinerary($A14))=\"\",\"\",getPeakScore(Q$2))","v":""},{"$f":"IF(INDEX(trailPeakHike,numericItinerary($A14))=\"\",\"\",getPeakScore(S$2))","v":181.5},{"$f":"IF(INDEX(mountaineeringHike,numericItinerary($A14))=\"\",\"\",getPeakScore(T$2))","v":202.5},{"$f":"IF(areaImportant<>\"y\",\"\",IF(Itineraries!P14<>\"Y\",\"\",getareascore(U$2)))","v":200},{"$f":"IF(areaImportant<>\"y\",\"\",IF(Itineraries!Q14<>\"Y\",\"\",getareascore(V$2)))","v":150},{"$f":"IF(areaImportant<>\"y\",\"\",IF(Itineraries!R14<>\"Y\",\"\",getareascore(W$2)))","v":""},{"$f":"IF(areaImportant<>\"y\",\"\",IF(Itineraries!S14<>\"Y\",\"\",getareascore(X$2)))","v":""},{"$f":"IF(ItineraryPrograms!C14=\"y\",getScoreFactor(\"Program\",Y$2),\"\")","v":228},{"$f":"IF(ItineraryPrograms!D14=\"y\",getScoreFactor(\"Program\",Z$2),\"\")","v":337.5},{"$f":"IF(ItineraryPrograms!E14=\"y\",getScoreFactor(\"Program\",AA$2),\"\")","v":114},{"$f":"IF(ItineraryPrograms!F14=\"y\",getScoreFactor(\"Program\",AB$2),\"\")","v":282},{"$f":"IF(ItineraryPrograms!G14=\"y\",getScoreFactor(\"Program\",AC$2),\"\")","v":""},{"$f":"IF(ItineraryPrograms!H14=\"y\",getScoreFactor(\"Program\",AD$2),\"\")","v":""},{"$f":"IF(ItineraryPrograms!I14=\"y\",getScoreFactor(\"Program\",AE$2),\"\")","v":""},{"$f":"IF(ItineraryPrograms!J14=\"y\",getScoreFactor(\"Program\",AF$2),\"\")","v":""},{"$f":"IF(ItineraryPrograms!K14=\"y\",getScoreFactor(\"Program\",AG$2),\"\")","v":130.5},{"$f":"IF(ItineraryPrograms!L14=\"y\",getScoreFactor(\"Program\",AH$2),\"\")","v":""},{"$f":"IF(ItineraryPrograms!M14=\"y\",getScoreFactor(\"Program\",AI$2),\"\")","v":109.5},{"$f":"IF(ItineraryPrograms!N14=\"y\",getScoreFactor(\"Program\",AJ$2),\"\")","v":109.5},{"$f":"IF(ItineraryPrograms!O14=\"y\",getScoreFactor(\"Program\",AK$2),\"\")","v":111},{"$f":"IF(ItineraryPrograms!P14=\"y\",getScoreFactor(\"Program\",AL$2),\"\")","v":114},{"$f":"IF(ItineraryPrograms!Q14=\"y\",getScoreFactor(\"Program\",AM$2),\"\")","v":""},{"$f":"IF(ItineraryPrograms!R14=\"y\",getScoreFactor(\"Program\",AN$2),\"\")","v":126},{"$f":"IF(ItineraryPrograms!S14=\"y\",getScoreFactor(\"Program\",AO$2),\"\")","v":106.5},{"$f":"IF(ItineraryPrograms!T14=\"y\",getScoreFactor(\"Program\",AP$2),\"\")","v":145.5},{"$f":"IF(ItineraryPrograms!U14=\"y\",getScoreFactor(\"Program\",AQ$2),\"\")","v":93},{"$f":"IF(ItineraryPrograms!V14=\"y\",getScoreFactor(\"Program\",AR$2),\"\")","v":""},{"$f":"IF(ItineraryPrograms!W14=\"y\",getScoreFactor(\"Program\",AS$2),\"\")","v":""},{"$f":"IF(ItineraryPrograms!X14=\"y\",getScoreFactor(\"Program\",AT$2),\"\")","v":""},{"$f":"IF(ItineraryPrograms!Y14=\"y\",getScoreFactor(\"Program\",AU$2),\"\")","v":""},{"$f":"IF(ItineraryPrograms!Z14=\"y\",getScoreFactor(\"Program\",AV$2),\"\")","v":""},{"$f":"IF(ItineraryPrograms!AA14=\"y\",getScoreFactor(\"Program\",AW$2),\"\")","v":""},{"$f":"IF(ItineraryPrograms!AB14=\"y\",getScoreFactor(\"Program\",AX$2),\"\")","v":""},{"$f":"IF(ItineraryPrograms!AC14=\"y\",getScoreFactor(\"Program\",AY$2),\"\")","v":""},{"$f":"IF(ItineraryPrograms!AD14=\"y\",getScoreFactor(\"Program\",AZ$2),\"\")","v":""},{"$f":"IF(ItineraryPrograms!AE14=\"y\",getScoreFactor(\"Program\",BA$2),\"\")","v":""},{"$f":"IF(ItineraryPrograms!AF14=\"y\",getScoreFactor(\"Program\",BB$2),\"\")","v":189},{"$f":"IF(ItineraryPrograms!AG14=\"y\",getScoreFactor(\"Program\",BC$2),\"\")","v":202.5},{"$f":"IF(ItineraryPrograms!AH14=\"y\",getScoreFactor(\"Program\",BD$2),\"\")","v":91.5},{"$f":"IF(ItineraryPrograms!AI14=\"y\",getScoreFactor(\"Program\",BE$2),\"\")","v":181.5},{"$f":"IF(ItineraryPrograms!AJ14=\"y\",getScoreFactor(\"Program\",BF$2),\"\")","v":220.5},{"$f":"IF(ItineraryPrograms!AK14=\"y\",getScoreFactor(\"Program\",BG$2),\"\")","v":""},{"$f":"IF(ItineraryPrograms!AL14=\"y\",getScoreFactor(\"Program\",BH$2),\"\")","v":255},{"$f":"IF(ItineraryPrograms!AM14=\"y\",getScoreFactor(\"Program\",BI$2),\"\")","v":235.5},{"$f":"IF(ItineraryPrograms!AN14=\"y\",getScoreFactor(\"Program\",BJ$2),\"\")","v":""},{"$f":"IF(ItineraryPrograms!AO14=\"y\",getScoreFactor(\"Program\",BK$2),\"\")","v":""},{"$f":"IF(ItineraryPrograms!AP14=\"y\",getScoreFactor(\"Program\",BL$2),\"\")","v":""},{"$f":"IF(ItineraryPrograms!AQ14=\"y\",getScoreFactor(\"Program\",BM$2),\"\")","v":""},{"$f":"IF(ItineraryPrograms!AR14=\"y\",getScoreFactor(\"Program\",BN$2),\"\")","v":""},{"$f":"IF(ItineraryPrograms!AS14=\"y\",getScoreFactor(\"Program\",BO$2),\"\")","v":""},{"$f":"IF(ItineraryPrograms!AT14=\"y\",getScoreFactor(\"Program\",BP$2),\"\")","v":""},{"$f":"IF(ItineraryPrograms!AU14=\"y\",getScoreFactor(\"Program\",BQ$2),\"\")","v":""},{"$f":"IF(ItineraryPrograms!AV14=\"y\",getScoreFactor(\"Program\",BR$2),\"\")","v":""},{"$f":"IF(ItineraryPrograms!AW14=\"y\",getScoreFactor(\"Program\",BS$2),\"\")","v":""},{"$f":"IF(ItineraryPrograms!AX14=\"y\",getScoreFactor(\"Program\",BT$2),\"\")","v":""},{"$f":"IF(ItineraryPrograms!AY14=\"y\",getScoreFactor(\"Program\",BU$2),\"\")","v":207},{"$f":"IF(ItineraryPrograms!AZ14=\"y\",getScoreFactor(\"Program\",BV$2),\"\")","v":""},{"$f":"IF(ItineraryPrograms!BA14=\"y\",getScoreFactor(\"Program\",BW$2),\"\")","v":""},{"$f":"IF(ItineraryPrograms!BB14=\"y\",getScoreFactor(\"Program\",BX$2),\"\")","v":""},{"$f":"IF(ItineraryPrograms!BC14=\"y\",getScoreFactor(\"Program\",BY$2),\"\")","v":""},{"$f":"IF(ItineraryPrograms!BD14=\"y\",getScoreFactor(\"Program\",BZ$2),\"\")","v":285},{"$f":"IF(ItineraryPrograms!BE14=\"y\",getScoreFactor(\"Program\",CA$2),\"\")","v":114},{"$f":"IF(ItineraryPrograms!BF14=\"y\",getScoreFactor(\"Program\",CB$2),\"\")","v":""}]
[{"$f":"Itineraries!A15","v":"12-13"},13910.916666666666,{"$f":"getScoreFactor(C$2,itineraryCamps!C16)","v":2666.6666666666665},{"$f":"getScoreFactor(D$2,\"Miles\") *itineraryCamps!D16","v":5900},{"$f":"getScoreFactor(E$2,Itineraries!B15)","v":30},{"$f":"getScoreFactor(F$2,Itineraries!C15)","v":60},{"$f":"getScoreFactor(G$2,Itineraries!E15)","v":100},{"$f":"getScoreFactor(H$2,Itineraries!H15)","v":200},{"$f":"getScoreFactor(I$2,Itineraries!G15)","v":60},{"$f":"getScoreFactor(J$2,Itineraries!J15)","v":80},{"$f":"getScoreFactor(K$2,Itineraries!K15)","v":80},{"$f":"getScoreFactor(L$2,Itineraries!L15)","v":300},{"$f":"IF(INDEX(startingTA,numericItinerary($A15))=$M$2,getScoreFactor(M$2,\"y\"),getScoreFactor(M$2,\"n\"))","v":0},{"$f":"IF(INDEX(endingTA,numericItinerary($A15))=$N$2,getScoreFactor(N$2,\"y\"),getScoreFactor(N$2,\"n\"))","v":500},{"$f":"IF(INDEX(baldyMountainHike,numericItinerary($A15))=\"\",\"\",getPeakScore(O$2))","v":""},{"$f":"IF(INDEX(mountPhillipsHike,numericItinerary($A15))=\"\",\"\",getPeakScore(P$2))","v":283.5},{"$f":"IF(INDEX(toothOfTimeHike,numericItinerary($A15))=\"\",\"\",getPeakScore(Q$2))","v":137.25},{"$f":"IF(INDEX(inspirationPointHike,numericItinerary($A15))=\"\",\"\",getPeakScore(Q$2))","v":""},{"$f":"IF(INDEX(trailPeakHike,numericItinerary($A15))=\"\",\"\",getPeakScore(S$2))","v":""},{"$f":"IF(INDEX(mountaineeringHike,numericItinerary($A15))=\"\",\"\",getPeakScore(T$2))","v":202.5},{"$f":"IF(areaImportant<>\"y\",\"\",IF(Itineraries!P15<>\"Y\",\"\",getareascore(U$2)))","v":200},{"$f":"IF(areaImportant<>\"y\",\"\",IF(Itineraries!Q15<>\"Y\",\"\",getareascore(V$2)))","v":150},{"$f":"IF(areaImportant<>\"y\",\"\",IF(Itineraries!R15<>\"Y\",\"\",getareascore(W$2)))","v":""},{"$f":"IF(areaImportant<>\"y\",\"\",IF(Itineraries!S15<>\"Y\",\"\",getareascore(X$2)))","v":""},{"$f":"IF(ItineraryPrograms!C15=\"y\",getScoreFactor(\"Program\",Y$2),\"\")","v":228},{"$f":"IF(ItineraryPrograms!D15=\"y\",getScoreFactor(\"Program\",Z$2),\"\")","v":337.5},{"$f":"IF(ItineraryPrograms!E15=\"y\",getScoreFactor(\"Program\",AA$2),\"\")","v":114},{"$f":"IF(ItineraryPrograms!F15=\"y\",getScoreFactor(\"Program\",AB$2),\"\")","v":282},{"$f":"IF(ItineraryPrograms!G15=\"y\",getScoreFactor(\"Program\",AC$2),\"\")","v":""},{"$f":"IF(ItineraryPrograms!H15=\"y\",getScoreFactor(\"Program\",AD$2),\"\")","v":166.5},{"$f":"IF(ItineraryPrograms!I15=\"y\",getScoreFactor(\"Program\",AE$2),\"\")","v":166.5},{"$f":"IF(ItineraryPrograms!J15=\"y\",getScoreFactor(\"Program\",AF$2),\"\")","v":126},{"$f":"IF(ItineraryPrograms!K15=\"y\",getScoreFactor(\"Program\",AG$2),\"\")","v":""},{"$f":"IF(ItineraryPrograms!L15=\"y\",getScoreFactor(\"Program\",AH$2),\"\")","v":""},{"$f":"IF(ItineraryPrograms!M15=\"y\",getScoreFactor(\"Program\",AI$2),\"\")","v":109.5},{"$f":"IF(ItineraryPrograms!N15=\"y\",getScoreFactor(\"Program\",AJ$2),\"\")","v":109.5},{"$f":"IF(ItineraryPrograms!O15=\"y\",getScoreFactor(\"Program\",AK$2),\"\")","v":111},{"$f":"IF(ItineraryPrograms!P15=\"y\",getScoreFactor(\"Program\",AL$2),\"\")","v":""},{"$f":"IF(ItineraryPrograms!Q15=\"y\",getScoreFactor(\"Program\",AM$2),\"\")","v":123},{"$f":"IF(ItineraryPrograms!R15=\"y\",getScoreFactor(\"Program\",AN$2),\"\")","v":""},{"$f":"IF(ItineraryPrograms!S15=\"y\",getScoreFactor(\"Program\",AO$2),\"\")","v":""},{"$f":"IF(ItineraryPrograms!T15=\"y\",getScoreFactor(\"Program\",AP$2),\"\")","v":""},{"$f":"IF(ItineraryPrograms!U15=\"y\",getScoreFactor(\"Program\",AQ$2),\"\")","v":""},{"$f":"IF(ItineraryPrograms!V15=\"y\",getScoreFactor(\"Program\",AR$2),\"\")","v":""},{"$f":"IF(ItineraryPrograms!W15=\"y\",getScoreFactor(\"Program\",AS$2),\"\")","v":""},{"$f":"IF(ItineraryPrograms!X15=\"y\",getScoreFactor(\"Program\",AT$2),\"\")","v":129},{"$f":"IF(ItineraryPrograms!Y15=\"y\",getScoreFactor(\"Program\",AU$2),\"\")","v":103.5},{"$f":"IF(ItineraryPrograms!Z15=\"y\",getScoreFactor(\"Program\",AV$2),\"\")","v":""},{"$f":"IF(ItineraryPrograms!AA15=\"y\",getScoreFactor(\"Program\",AW$2),\"\")","v":""},{"$f":"IF(ItineraryPrograms!AB15=\"y\",getScoreFactor(\"Program\",AX$2),\"\")","v":""},{"$f":"IF(ItineraryPrograms!AC15=\"y\",getScoreFactor(\"Program\",AY$2),\"\")","v":""},{"$f":"IF(ItineraryPrograms!AD15=\"y\",getScoreFactor(\"Program\",AZ$2),\"\")","v":""},{"$f":"IF(ItineraryPrograms!AE15=\"y\",getScoreFactor(\"Program\",BA$2),\"\")","v":""},{"$f":"IF(ItineraryPrograms!AF15=\"y\",getScoreFactor(\"Program\",BB$2),\"\")","v":189},{"$f":"IF(ItineraryPrograms!AG15=\"y\",getScoreFactor(\"Program\",BC$2),\"\")","v":202.5},{"$f":"IF(ItineraryPrograms!AH15=\"y\",getScoreFactor(\"Program\",BD$2),\"\")","v":91.5},{"$f":"IF(ItineraryPrograms!AI15=\"y\",getScoreFactor(\"Program\",BE$2),\"\")","v":""},{"$f":"IF(ItineraryPrograms!AJ15=\"y\",getScoreFactor(\"Program\",BF$2),\"\")","v":220.5},{"$f":"IF(ItineraryPrograms!AK15=\"y\",getScoreFactor(\"Program\",BG$2),\"\")","v":""},{"$f":"IF(ItineraryPrograms!AL15=\"y\",getScoreFactor(\"Program\",BH$2),\"\")","v":""},{"$f":"IF(ItineraryPrograms!AM15=\"y\",getScoreFactor(\"Program\",BI$2),\"\")","v":""},{"$f":"IF(ItineraryPrograms!AN15=\"y\",getScoreFactor(\"Program\",BJ$2),\"\")","v":""},{"$f":"IF(ItineraryPrograms!AO15=\"y\",getScoreFactor(\"Program\",BK$2),\"\")","v":""},{"$f":"IF(ItineraryPrograms!AP15=\"y\",getScoreFactor(\"Program\",BL$2),\"\")","v":""},{"$f":"IF(ItineraryPrograms!AQ15=\"y\",getScoreFactor(\"Program\",BM$2),\"\")","v":""},{"$f":"IF(ItineraryPrograms!AR15=\"y\",getScoreFactor(\"Program\",BN$2),\"\")","v":""},{"$f":"IF(ItineraryPrograms!AS15=\"y\",getScoreFactor(\"Program\",BO$2),\"\")","v":""},{"$f":"IF(ItineraryPrograms!AT15=\"y\",getScoreFactor(\"Program\",BP$2),\"\")","v":""},{"$f":"IF(ItineraryPrograms!AU15=\"y\",getScoreFactor(\"Program\",BQ$2),\"\")","v":151.5},{"$f":"IF(ItineraryPrograms!AV15=\"y\",getScoreFactor(\"Program\",BR$2),\"\")","v":""},{"$f":"IF(ItineraryPrograms!AW15=\"y\",getScoreFactor(\"Program\",BS$2),\"\")","v":""},{"$f":"IF(ItineraryPrograms!AX15=\"y\",getScoreFactor(\"Program\",BT$2),\"\")","v":""},{"$f":"IF(ItineraryPrograms!AY15=\"y\",getScoreFactor(\"Program\",BU$2),\"\")","v":""},{"$f":"IF(ItineraryPrograms!AZ15=\"y\",getScoreFactor(\"Program\",BV$2),\"\")","v":""},{"$f":"IF(ItineraryPrograms!BA15=\"y\",getScoreFactor(\"Program\",BW$2),\"\")","v":""},{"$f":"IF(ItineraryPrograms!BB15=\"y\",getScoreFactor(\"Program\",BX$2),\"\")","v":""},{"$f":"IF(ItineraryPrograms!BC15=\"y\",getScoreFactor(\"Program\",BY$2),\"\")","v":""},{"$f":"IF(ItineraryPrograms!BD15=\"y\",getScoreFactor(\"Program\",BZ$2),\"\")","v":""},{"$f":"IF(ItineraryPrograms!BE15=\"y\",getScoreFactor(\"Program\",CA$2),\"\")","v":""},{"$f":"IF(ItineraryPrograms!BF15=\"y\",getScoreFactor(\"Program\",CB$2),\"\")","v":""}]
[{"$f":"Itineraries!A16","v":"12-14"},15900.333333333332,{"$f":"getScoreFactor(C$2,itineraryCamps!C17)","v":2833.333333333333},{"$f":"getScoreFactor(D$2,\"Miles\") *itineraryCamps!D17","v":7800},{"$f":"getScoreFactor(E$2,Itineraries!B16)","v":30},{"$f":"getScoreFactor(F$2,Itineraries!C16)","v":70},{"$f":"getScoreFactor(G$2,Itineraries!E16)","v":125},{"$f":"getScoreFactor(H$2,Itineraries!H16)","v":250},{"$f":"getScoreFactor(I$2,Itineraries!G16)","v":50},{"$f":"getScoreFactor(J$2,Itineraries!J16)","v":20},{"$f":"getScoreFactor(K$2,Itineraries!K16)","v":40},{"$f":"getScoreFactor(L$2,Itineraries!L16)","v":100},{"$f":"IF(INDEX(startingTA,numericItinerary($A16))=$M$2,getScoreFactor(M$2,\"y\"),getScoreFactor(M$2,\"n\"))","v":0},{"$f":"IF(INDEX(endingTA,numericItinerary($A16))=$N$2,getScoreFactor(N$2,\"y\"),getScoreFactor(N$2,\"n\"))","v":0},{"$f":"IF(INDEX(baldyMountainHike,numericItinerary($A16))=\"\",\"\",getPeakScore(O$2))","v":""},{"$f":"IF(INDEX(mountPhillipsHike,numericItinerary($A16))=\"\",\"\",getPeakScore(P$2))","v":""},{"$f":"IF(INDEX(toothOfTimeHike,numericItinerary($A16))=\"\",\"\",getPeakScore(Q$2))","v":""},{"$f":"IF(INDEX(inspirationPointHike,numericItinerary($A16))=\"\",\"\",getPeakScore(Q$2))","v":""},{"$f":"IF(INDEX(trailPeakHike,numericItinerary($A16))=\"\",\"\",getPeakScore(S$2))","v":""},{"$f":"IF(INDEX(mountaineeringHike,numericItinerary($A16))=\"\",\"\",getPeakScore(T$2))","v":""},{"$f":"IF(areaImportant<>\"y\",\"\",IF(Itineraries!P16<>\"Y\",\"\",getareascore(U$2)))","v":""},{"$f":"IF(areaImportant<>\"y\",\"\",IF(Itineraries!Q16<>\"Y\",\"\",getareascore(V$2)))","v":150},{"$f":"IF(areaImportant<>\"y\",\"\",IF(Itineraries!R16<>\"Y\",\"\",getareascore(W$2)))","v":1000},{"$f":"IF(areaImportant<>\"y\",\"\",IF(Itineraries!S16<>\"Y\",\"\",getareascore(X$2)))","v":600},{"$f":"IF(ItineraryPrograms!C16=\"y\",getScoreFactor(\"Program\",Y$2),\"\")","v":228},{"$f":"IF(ItineraryPrograms!D16=\"y\",getScoreFactor(\"Program\",Z$2),\"\")","v":""},{"$f":"IF(ItineraryPrograms!E16=\"y\",getScoreFactor(\"Program\",AA$2),\"\")","v":""},{"$f":"IF(ItineraryPrograms!F16=\"y\",getScoreFactor(\"Program\",AB$2),\"\")","v":282},{"$f":"IF(ItineraryPrograms!G16=\"y\",getScoreFactor(\"Program\",AC$2),\"\")","v":""},{"$f":"IF(ItineraryPrograms!H16=\"y\",getScoreFactor(\"Program\",AD$2),\"\")","v":166.5},{"$f":"IF(ItineraryPrograms!I16=\"y\",getScoreFactor(\"Program\",AE$2),\"\")","v":166.5},{"$f":"IF(ItineraryPrograms!J16=\"y\",getScoreFactor(\"Program\",AF$2),\"\")","v":126},{"$f":"IF(ItineraryPrograms!K16=\"y\",getScoreFactor(\"Program\",AG$2),\"\")","v":130.5},{"$f":"IF(ItineraryPrograms!L16=\"y\",getScoreFactor(\"Program\",AH$2),\"\")","v":""},{"$f":"IF(ItineraryPrograms!M16=\"y\",getScoreFactor(\"Program\",AI$2),\"\")","v":109.5},{"$f":"IF(ItineraryPrograms!N16=\"y\",getScoreFactor(\"Program\",AJ$2),\"\")","v":109.5},{"$f":"IF(ItineraryPrograms!O16=\"y\",getScoreFactor(\"Program\",AK$2),\"\")","v":""},{"$f":"IF(ItineraryPrograms!P16=\"y\",getScoreFactor(\"Program\",AL$2),\"\")","v":""},{"$f":"IF(ItineraryPrograms!Q16=\"y\",getScoreFactor(\"Program\",AM$2),\"\")","v":""},{"$f":"IF(ItineraryPrograms!R16=\"y\",getScoreFactor(\"Program\",AN$2),\"\")","v":""},{"$f":"IF(ItineraryPrograms!S16=\"y\",getScoreFactor(\"Program\",AO$2),\"\")","v":106.5},{"$f":"IF(ItineraryPrograms!T16=\"y\",getScoreFactor(\"Program\",AP$2),\"\")","v":""},{"$f":"IF(ItineraryPrograms!U16=\"y\",getScoreFactor(\"Program\",AQ$2),\"\")","v":93},{"$f":"IF(ItineraryPrograms!V16=\"y\",getScoreFactor(\"Program\",AR$2),\"\")","v":""},{"$f":"IF(ItineraryPrograms!W16=\"y\",getScoreFactor(\"Program\",AS$2),\"\")","v":""},{"$f":"IF(ItineraryPrograms!X16=\"y\",getScoreFactor(\"Program\",AT$2),\"\")","v":""},{"$f":"IF(ItineraryPrograms!Y16=\"y\",getScoreFactor(\"Program\",AU$2),\"\")","v":""},{"$f":"IF(ItineraryPrograms!Z16=\"y\",getScoreFactor(\"Program\",AV$2),\"\")","v":""},{"$f":"IF(ItineraryPrograms!AA16=\"y\",getScoreFactor(\"Program\",AW$2),\"\")","v":""},{"$f":"IF(ItineraryPrograms!AB16=\"y\",getScoreFactor(\"Program\",AX$2),\"\")","v":""},{"$f":"IF(ItineraryPrograms!AC16=\"y\",getScoreFactor(\"Program\",AY$2),\"\")","v":""},{"$f":"IF(ItineraryPrograms!AD16=\"y\",getScoreFactor(\"Program\",AZ$2),\"\")","v":""},{"$f":"IF(ItineraryPrograms!AE16=\"y\",getScoreFactor(\"Program\",BA$2),\"\")","v":""},{"$f":"IF(ItineraryPrograms!AF16=\"y\",getScoreFactor(\"Program\",BB$2),\"\")","v":""},{"$f":"IF(ItineraryPrograms!AG16=\"y\",getScoreFactor(\"Program\",BC$2),\"\")","v":""},{"$f":"IF(ItineraryPrograms!AH16=\"y\",getScoreFactor(\"Program\",BD$2),\"\")","v":""},{"$f":"IF(ItineraryPrograms!AI16=\"y\",getScoreFactor(\"Program\",BE$2),\"\")","v":""},{"$f":"IF(ItineraryPrograms!AJ16=\"y\",getScoreFactor(\"Program\",BF$2),\"\")","v":220.5},{"$f":"IF(ItineraryPrograms!AK16=\"y\",getScoreFactor(\"Program\",BG$2),\"\")","v":""},{"$f":"IF(ItineraryPrograms!AL16=\"y\",getScoreFactor(\"Program\",BH$2),\"\")","v":255},{"$f":"IF(ItineraryPrograms!AM16=\"y\",getScoreFactor(\"Program\",BI$2),\"\")","v":235.5},{"$f":"IF(ItineraryPrograms!AN16=\"y\",getScoreFactor(\"Program\",BJ$2),\"\")","v":193.5},{"$f":"IF(ItineraryPrograms!AO16=\"y\",getScoreFactor(\"Program\",BK$2),\"\")","v":""},{"$f":"IF(ItineraryPrograms!AP16=\"y\",getScoreFactor(\"Program\",BL$2),\"\")","v":""},{"$f":"IF(ItineraryPrograms!AQ16=\"y\",getScoreFactor(\"Program\",BM$2),\"\")","v":""},{"$f":"IF(ItineraryPrograms!AR16=\"y\",getScoreFactor(\"Program\",BN$2),\"\")","v":""},{"$f":"IF(ItineraryPrograms!AS16=\"y\",getScoreFactor(\"Program\",BO$2),\"\")","v":""},{"$f":"IF(ItineraryPrograms!AT16=\"y\",getScoreFactor(\"Program\",BP$2),\"\")","v":""},{"$f":"IF(ItineraryPrograms!AU16=\"y\",getScoreFactor(\"Program\",BQ$2),\"\")","v":""},{"$f":"IF(ItineraryPrograms!AV16=\"y\",getScoreFactor(\"Program\",BR$2),\"\")","v":""},{"$f":"IF(ItineraryPrograms!AW16=\"y\",getScoreFactor(\"Program\",BS$2),\"\")","v":202.5},{"$f":"IF(ItineraryPrograms!AX16=\"y\",getScoreFactor(\"Program\",BT$2),\"\")","v":207},{"$f":"IF(ItineraryPrograms!AY16=\"y\",getScoreFactor(\"Program\",BU$2),\"\")","v":""},{"$f":"IF(ItineraryPrograms!AZ16=\"y\",getScoreFactor(\"Program\",BV$2),\"\")","v":""},{"$f":"IF(ItineraryPrograms!BA16=\"y\",getScoreFactor(\"Program\",BW$2),\"\")","v":91.5},{"$f":"IF(ItineraryPrograms!BB16=\"y\",getScoreFactor(\"Program\",BX$2),\"\")","v":""},{"$f":"IF(ItineraryPrograms!BC16=\"y\",getScoreFactor(\"Program\",BY$2),\"\")","v":133.5},{"$f":"IF(ItineraryPrograms!BD16=\"y\",getScoreFactor(\"Program\",BZ$2),\"\")","v":""},{"$f":"IF(ItineraryPrograms!BE16=\"y\",getScoreFactor(\"Program\",CA$2),\"\")","v":""},{"$f":"IF(ItineraryPrograms!BF16=\"y\",getScoreFactor(\"Program\",CB$2),\"\")","v":139.5}]
[{"$f":"Itineraries!A17","v":"12-15"},15383.083333333332,{"$f":"getScoreFactor(C$2,itineraryCamps!C18)","v":2833.333333333333},{"$f":"getScoreFactor(D$2,\"Miles\") *itineraryCamps!D18","v":6300},{"$f":"getScoreFactor(E$2,Itineraries!B17)","v":20},{"$f":"getScoreFactor(F$2,Itineraries!C17)","v":80},{"$f":"getScoreFactor(G$2,Itineraries!E17)","v":125},{"$f":"getScoreFactor(H$2,Itineraries!H17)","v":225},{"$f":"getScoreFactor(I$2,Itineraries!G17)","v":60},{"$f":"getScoreFactor(J$2,Itineraries!J17)","v":110},{"$f":"getScoreFactor(K$2,Itineraries!K17)","v":90},{"$f":"getScoreFactor(L$2,Itineraries!L17)","v":300},{"$f":"IF(INDEX(startingTA,numericItinerary($A17))=$M$2,getScoreFactor(M$2,\"y\"),getScoreFactor(M$2,\"n\"))","v":0},{"$f":"IF(INDEX(endingTA,numericItinerary($A17))=$N$2,getScoreFactor(N$2,\"y\"),getScoreFactor(N$2,\"n\"))","v":500},{"$f":"IF(INDEX(baldyMountainHike,numericItinerary($A17))=\"\",\"\",getPeakScore(O$2))","v":""},{"$f":"IF(INDEX(mountPhillipsHike,numericItinerary($A17))=\"\",\"\",getPeakScore(P$2))","v":283.5},{"$f":"IF(INDEX(toothOfTimeHike,numericItinerary($A17))=\"\",\"\",getPeakScore(Q$2))","v":137.25},{"$f":"IF(INDEX(inspirationPointHike,numericItinerary($A17))=\"\",\"\",getPeakScore(Q$2))","v":""},{"$f":"IF(INDEX(trailPeakHike,numericItinerary($A17))=\"\",\"\",getPeakScore(S$2))","v":181.5},{"$f":"IF(INDEX(mountaineeringHike,numericItinerary($A17))=\"\",\"\",getPeakScore(T$2))","v":202.5},{"$f":"IF(areaImportant<>\"y\",\"\",IF(Itineraries!P17<>\"Y\",\"\",getareascore(U$2)))","v":200},{"$f":"IF(areaImportant<>\"y\",\"\",IF(Itineraries!Q17<>\"Y\",\"\",getareascore(V$2)))","v":150},{"$f":"IF(areaImportant<>\"y\",\"\",IF(Itineraries!R17<>\"Y\",\"\",getareascore(W$2)))","v":""},{"$f":"IF(areaImportant<>\"y\",\"\",IF(Itineraries!S17<>\"Y\",\"\",getareascore(X$2)))","v":""},{"$f":"IF(ItineraryPrograms!C17=\"y\",getScoreFactor(\"Program\",Y$2),\"\")","v":228},{"$f":"IF(ItineraryPrograms!D17=\"y\",getScoreFactor(\"Program\",Z$2),\"\")","v":337.5},{"$f":"IF(ItineraryPrograms!E17=\"y\",getScoreFactor(\"Program\",AA$2),\"\")","v":114},{"$f":"IF(ItineraryPrograms!F17=\"y\",getScoreFactor(\"Program\",AB$2),\"\")","v":282},{"$f":"IF(ItineraryPrograms!G17=\"y\",getScoreFactor(\"Program\",AC$2),\"\")","v":""},{"$f":"IF(ItineraryPrograms!H17=\"y\",getScoreFactor(\"Program\",AD$2),\"\")","v":""},{"$f":"IF(ItineraryPrograms!I17=\"y\",getScoreFactor(\"Program\",AE$2),\"\")","v":""},{"$f":"IF(ItineraryPrograms!J17=\"y\",getScoreFactor(\"Program\",AF$2),\"\")","v":""},{"$f":"IF(ItineraryPrograms!K17=\"y\",getScoreFactor(\"Program\",AG$2),\"\")","v":""},{"$f":"IF(ItineraryPrograms!L17=\"y\",getScoreFactor(\"Program\",AH$2),\"\")","v":""},{"$f":"IF(ItineraryPrograms!M17=\"y\",getScoreFactor(\"Program\",AI$2),\"\")","v":109.5},{"$f":"IF(ItineraryPrograms!N17=\"y\",getScoreFactor(\"Program\",AJ$2),\"\")","v":109.5},{"$f":"IF(ItineraryPrograms!O17=\"y\",getScoreFactor(\"Program\",AK$2),\"\")","v":111},{"$f":"IF(ItineraryPrograms!P17=\"y\",getScoreFactor(\"Program\",AL$2),\"\")","v":""},{"$f":"IF(ItineraryPrograms!Q17=\"y\",getScoreFactor(\"Program\",AM$2),\"\")","v":123},{"$f":"IF(ItineraryPrograms!R17=\"y\",getScoreFactor(\"Program\",AN$2),\"\")","v":""},{"$f":"IF(ItineraryPrograms!S17=\"y\",getScoreFactor(\"Program\",AO$2),\"\")","v":106.5},{"$f":"IF(ItineraryPrograms!T17=\"y\",getScoreFactor(\"Program\",AP$2),\"\")","v":""},{"$f":"IF(ItineraryPrograms!U17=\"y\",getScoreFactor(\"Program\",AQ$2),\"\")","v":93},{"$f":"IF(ItineraryPrograms!V17=\"y\",getScoreFactor(\"Program\",AR$2),\"\")","v":""},{"$f":"IF(ItineraryPrograms!W17=\"y\",getScoreFactor(\"Program\",AS$2),\"\")","v":""},{"$f":"IF(ItineraryPrograms!X17=\"y\",getScoreFactor(\"Program\",AT$2),\"\")","v":129},{"$f":"IF(ItineraryPrograms!Y17=\"y\",getScoreFactor(\"Program\",AU$2),\"\")","v":103.5},{"$f":"IF(ItineraryPrograms!Z17=\"y\",getScoreFactor(\"Program\",AV$2),\"\")","v":""},{"$f":"IF(ItineraryPrograms!AA17=\"y\",getScoreFactor(\"Program\",AW$2),\"\")","v":""},{"$f":"IF(ItineraryPrograms!AB17=\"y\",getScoreFactor(\"Program\",AX$2),\"\")","v":""},{"$f":"IF(ItineraryPrograms!AC17=\"y\",getScoreFactor(\"Program\",AY$2),\"\")","v":""},{"$f":"IF(ItineraryPrograms!AD17=\"y\",getScoreFactor(\"Program\",AZ$2),\"\")","v":""},{"$f":"IF(ItineraryPrograms!AE17=\"y\",getScoreFactor(\"Program\",BA$2),\"\")","v":""},{"$f":"IF(ItineraryPrograms!AF17=\"y\",getScoreFactor(\"Program\",BB$2),\"\")","v":189},{"$f":"IF(ItineraryPrograms!AG17=\"y\",getScoreFactor(\"Program\",BC$2),\"\")","v":202.5},{"$f":"IF(ItineraryPrograms!AH17=\"y\",getScoreFactor(\"Program\",BD$2),\"\")","v":91.5},{"$f":"IF(ItineraryPrograms!AI17=\"y\",getScoreFactor(\"Program\",BE$2),\"\")","v":181.5},{"$f":"IF(ItineraryPrograms!AJ17=\"y\",getScoreFactor(\"Program\",BF$2),\"\")","v":220.5},{"$f":"IF(ItineraryPrograms!AK17=\"y\",getScoreFactor(\"Program\",BG$2),\"\")","v":""},{"$f":"IF(ItineraryPrograms!AL17=\"y\",getScoreFactor(\"Program\",BH$2),\"\")","v":255},{"$f":"IF(ItineraryPrograms!AM17=\"y\",getScoreFactor(\"Program\",BI$2),\"\")","v":""},{"$f":"IF(ItineraryPrograms!AN17=\"y\",getScoreFactor(\"Program\",BJ$2),\"\")","v":""},{"$f":"IF(ItineraryPrograms!AO17=\"y\",getScoreFactor(\"Program\",BK$2),\"\")","v":""},{"$f":"IF(ItineraryPrograms!AP17=\"y\",getScoreFactor(\"Program\",BL$2),\"\")","v":""},{"$f":"IF(ItineraryPrograms!AQ17=\"y\",getScoreFactor(\"Program\",BM$2),\"\")","v":""},{"$f":"IF(ItineraryPrograms!AR17=\"y\",getScoreFactor(\"Program\",BN$2),\"\")","v":255},{"$f":"IF(ItineraryPrograms!AS17=\"y\",getScoreFactor(\"Program\",BO$2),\"\")","v":""},{"$f":"IF(ItineraryPrograms!AT17=\"y\",getScoreFactor(\"Program\",BP$2),\"\")","v":""},{"$f":"IF(ItineraryPrograms!AU17=\"y\",getScoreFactor(\"Program\",BQ$2),\"\")","v":""},{"$f":"IF(ItineraryPrograms!AV17=\"y\",getScoreFactor(\"Program\",BR$2),\"\")","v":136.5},{"$f":"IF(ItineraryPrograms!AW17=\"y\",getScoreFactor(\"Program\",BS$2),\"\")","v":""},{"$f":"IF(ItineraryPrograms!AX17=\"y\",getScoreFactor(\"Program\",BT$2),\"\")","v":""},{"$f":"IF(ItineraryPrograms!AY17=\"y\",getScoreFactor(\"Program\",BU$2),\"\")","v":207},{"$f":"IF(ItineraryPrograms!AZ17=\"y\",getScoreFactor(\"Program\",BV$2),\"\")","v":""},{"$f":"IF(ItineraryPrograms!BA17=\"y\",getScoreFactor(\"Program\",BW$2),\"\")","v":""},{"$f":"IF(ItineraryPrograms!BB17=\"y\",getScoreFactor(\"Program\",BX$2),\"\")","v":235.5},{"$f":"IF(ItineraryPrograms!BC17=\"y\",getScoreFactor(\"Program\",BY$2),\"\")","v":133.5},{"$f":"IF(ItineraryPrograms!BD17=\"y\",getScoreFactor(\"Program\",BZ$2),\"\")","v":""},{"$f":"IF(ItineraryPrograms!BE17=\"y\",getScoreFactor(\"Program\",CA$2),\"\")","v":114},{"$f":"IF(ItineraryPrograms!BF17=\"y\",getScoreFactor(\"Program\",CB$2),\"\")","v":""}]
[{"$f":"Itineraries!A18","v":"12-16"},15386.083333333332,{"$f":"getScoreFactor(C$2,itineraryCamps!C19)","v":2833.333333333333},{"$f":"getScoreFactor(D$2,\"Miles\") *itineraryCamps!D19","v":6500},{"$f":"getScoreFactor(E$2,Itineraries!B18)","v":40},{"$f":"getScoreFactor(F$2,Itineraries!C18)","v":80},{"$f":"getScoreFactor(G$2,Itineraries!E18)","v":75},{"$f":"getScoreFactor(H$2,Itineraries!H18)","v":250},{"$f":"getScoreFactor(I$2,Itineraries!G18)","v":60},{"$f":"getScoreFactor(J$2,Itineraries!J18)","v":70},{"$f":"getScoreFactor(K$2,Itineraries!K18)","v":70},{"$f":"getScoreFactor(L$2,Itineraries!L18)","v":300},{"$f":"IF(INDEX(startingTA,numericItinerary($A18))=$M$2,getScoreFactor(M$2,\"y\"),getScoreFactor(M$2,\"n\"))","v":0},{"$f":"IF(INDEX(endingTA,numericItinerary($A18))=$N$2,getScoreFactor(N$2,\"y\"),getScoreFactor(N$2,\"n\"))","v":500},{"$f":"IF(INDEX(baldyMountainHike,numericItinerary($A18))=\"\",\"\",getPeakScore(O$2))","v":""},{"$f":"IF(INDEX(mountPhillipsHike,numericItinerary($A18))=\"\",\"\",getPeakScore(P$2))","v":283.5},{"$f":"IF(INDEX(toothOfTimeHike,numericItinerary($A18))=\"\",\"\",getPeakScore(Q$2))","v":137.25},{"$f":"IF(INDEX(inspirationPointHike,numericItinerary($A18))=\"\",\"\",getPeakScore(Q$2))","v":""},{"$f":"IF(INDEX(trailPeakHike,numericItinerary($A18))=\"\",\"\",getPeakScore(S$2))","v":""},{"$f":"IF(INDEX(mountaineeringHike,numericItinerary($A18))=\"\",\"\",getPeakScore(T$2))","v":202.5},{"$f":"IF(areaImportant<>\"y\",\"\",IF(Itineraries!P18<>\"Y\",\"\",getareascore(U$2)))","v":200},{"$f":"IF(areaImportant<>\"y\",\"\",IF(Itineraries!Q18<>\"Y\",\"\",getareascore(V$2)))","v":150},{"$f":"IF(areaImportant<>\"y\",\"\",IF(Itineraries!R18<>\"Y\",\"\",getareascore(W$2)))","v":""},{"$f":"IF(areaImportant<>\"y\",\"\",IF(Itineraries!S18<>\"Y\",\"\",getareascore(X$2)))","v":""},{"$f":"IF(ItineraryPrograms!C18=\"y\",getScoreFactor(\"Program\",Y$2),\"\")","v":228},{"$f":"IF(ItineraryPrograms!D18=\"y\",getScoreFactor(\"Program\",Z$2),\"\")","v":337.5},{"$f":"IF(ItineraryPrograms!E18=\"y\",getScoreFactor(\"Program\",AA$2),\"\")","v":114},{"$f":"IF(ItineraryPrograms!F18=\"y\",getScoreFactor(\"Program\",AB$2),\"\")","v":282},{"$f":"IF(ItineraryPrograms!G18=\"y\",getScoreFactor(\"Program\",AC$2),\"\")","v":""},{"$f":"IF(ItineraryPrograms!H18=\"y\",getScoreFactor(\"Program\",AD$2),\"\")","v":""},{"$f":"IF(ItineraryPrograms!I18=\"y\",getScoreFactor(\"Program\",AE$2),\"\")","v":""},{"$f":"IF(ItineraryPrograms!J18=\"y\",getScoreFactor(\"Program\",AF$2),\"\")","v":""},{"$f":"IF(ItineraryPrograms!K18=\"y\",getScoreFactor(\"Program\",AG$2),\"\")","v":130.5},{"$f":"IF(ItineraryPrograms!L18=\"y\",getScoreFactor(\"Program\",AH$2),\"\")","v":""},{"$f":"IF(ItineraryPrograms!M18=\"y\",getScoreFactor(\"Program\",AI$2),\"\")","v":109.5},{"$f":"IF(ItineraryPrograms!N18=\"y\",getScoreFactor(\"Program\",AJ$2),\"\")","v":109.5},{"$f":"IF(ItineraryPrograms!O18=\"y\",getScoreFactor(\"Program\",AK$2),\"\")","v":111},{"$f":"IF(ItineraryPrograms!P18=\"y\",getScoreFactor(\"Program\",AL$2),\"\")","v":114},{"$f":"IF(ItineraryPrograms!Q18=\"y\",getScoreFactor(\"Program\",AM$2),\"\")","v":123},{"$f":"IF(ItineraryPrograms!R18=\"y\",getScoreFactor(\"Program\",AN$2),\"\")","v":""},{"$f":"IF(ItineraryPrograms!S18=\"y\",getScoreFactor(\"Program\",AO$2),\"\")","v":106.5},{"$f":"IF(ItineraryPrograms!T18=\"y\",getScoreFactor(\"Program\",AP$2),\"\")","v":145.5},{"$f":"IF(ItineraryPrograms!U18=\"y\",getScoreFactor(\"Program\",AQ$2),\"\")","v":""},{"$f":"IF(ItineraryPrograms!V18=\"y\",getScoreFactor(\"Program\",AR$2),\"\")","v":156},{"$f":"IF(ItineraryPrograms!W18=\"y\",getScoreFactor(\"Program\",AS$2),\"\")","v":""},{"$f":"IF(ItineraryPrograms!X18=\"y\",getScoreFactor(\"Program\",AT$2),\"\")","v":""},{"$f":"IF(ItineraryPrograms!Y18=\"y\",getScoreFactor(\"Program\",AU$2),\"\")","v":""},{"$f":"IF(ItineraryPrograms!Z18=\"y\",getScoreFactor(\"Program\",AV$2),\"\")","v":""},{"$f":"IF(ItineraryPrograms!AA18=\"y\",getScoreFactor(\"Program\",AW$2),\"\")","v":""},{"$f":"IF(ItineraryPrograms!AB18=\"y\",getScoreFactor(\"Program\",AX$2),\"\")","v":""},{"$f":"IF(ItineraryPrograms!AC18=\"y\",getScoreFactor(\"Program\",AY$2),\"\")","v":""},{"$f":"IF(ItineraryPrograms!AD18=\"y\",getScoreFactor(\"Program\",AZ$2),\"\")","v":""},{"$f":"IF(ItineraryPrograms!AE18=\"y\",getScoreFactor(\"Program\",BA$2),\"\")","v":""},{"$f":"IF(ItineraryPrograms!AF18=\"y\",getScoreFactor(\"Program\",BB$2),\"\")","v":189},{"$f":"IF(ItineraryPrograms!AG18=\"y\",getScoreFactor(\"Program\",BC$2),\"\")","v":202.5},{"$f":"IF(ItineraryPrograms!AH18=\"y\",getScoreFactor(\"Program\",BD$2),\"\")","v":91.5},{"$f":"IF(ItineraryPrograms!AI18=\"y\",getScoreFactor(\"Program\",BE$2),\"\")","v":""},{"$f":"IF(ItineraryPrograms!AJ18=\"y\",getScoreFactor(\"Program\",BF$2),\"\")","v":220.5},{"$f":"IF(ItineraryPrograms!AK18=\"y\",getScoreFactor(\"Program\",BG$2),\"\")","v":""},{"$f":"IF(ItineraryPrograms!AL18=\"y\",getScoreFactor(\"Program\",BH$2),\"\")","v":255},{"$f":"IF(ItineraryPrograms!AM18=\"y\",getScoreFactor(\"Program\",BI$2),\"\")","v":""},{"$f":"IF(ItineraryPrograms!AN18=\"y\",getScoreFactor(\"Program\",BJ$2),\"\")","v":""},{"$f":"IF(ItineraryPrograms!AO18=\"y\",getScoreFactor(\"Program\",BK$2),\"\")","v":181.5},{"$f":"IF(ItineraryPrograms!AP18=\"y\",getScoreFactor(\"Program\",BL$2),\"\")","v":220.5},{"$f":"IF(ItineraryPrograms!AQ18=\"y\",getScoreFactor(\"Program\",BM$2),\"\")","v":""},{"$f":"IF(ItineraryPrograms!AR18=\"y\",getScoreFactor(\"Program\",BN$2),\"\")","v":""},{"$f":"IF(ItineraryPrograms!AS18=\"y\",getScoreFactor(\"Program\",BO$2),\"\")","v":""},{"$f":"IF(ItineraryPrograms!AT18=\"y\",getScoreFactor(\"Program\",BP$2),\"\")","v":""},{"$f":"IF(ItineraryPrograms!AU18=\"y\",getScoreFactor(\"Program\",BQ$2),\"\")","v":""},{"$f":"IF(ItineraryPrograms!AV18=\"y\",getScoreFactor(\"Program\",BR$2),\"\")","v":""},{"$f":"IF(ItineraryPrograms!AW18=\"y\",getScoreFactor(\"Program\",BS$2),\"\")","v":""},{"$f":"IF(ItineraryPrograms!AX18=\"y\",getScoreFactor(\"Program\",BT$2),\"\")","v":""},{"$f":"IF(ItineraryPrograms!AY18=\"y\",getScoreFactor(\"Program\",BU$2),\"\")","v":207},{"$f":"IF(ItineraryPrograms!AZ18=\"y\",getScoreFactor(\"Program\",BV$2),\"\")","v":""},{"$f":"IF(ItineraryPrograms!BA18=\"y\",getScoreFactor(\"Program\",BW$2),\"\")","v":""},{"$f":"IF(ItineraryPrograms!BB18=\"y\",getScoreFactor(\"Program\",BX$2),\"\")","v":""},{"$f":"IF(ItineraryPrograms!BC18=\"y\",getScoreFactor(\"Program\",BY$2),\"\")","v":133.5},{"$f":"IF(ItineraryPrograms!BD18=\"y\",getScoreFactor(\"Program\",BZ$2),\"\")","v":285},{"$f":"IF(ItineraryPrograms!BE18=\"y\",getScoreFactor(\"Program\",CA$2),\"\")","v":114},{"$f":"IF(ItineraryPrograms!BF18=\"y\",getScoreFactor(\"Program\",CB$2),\"\")","v":""}]
[{"$f":"Itineraries!A19","v":"12-17"},15861.083333333332,{"$f":"getScoreFactor(C$2,itineraryCamps!C20)","v":2833.333333333333},{"$f":"getScoreFactor(D$2,\"Miles\") *itineraryCamps!D20","v":6100},{"$f":"getScoreFactor(E$2,Itineraries!B19)","v":20},{"$f":"getScoreFactor(F$2,Itineraries!C19)","v":70},{"$f":"getScoreFactor(G$2,Itineraries!E19)","v":125},{"$f":"getScoreFactor(H$2,Itineraries!H19)","v":200},{"$f":"getScoreFactor(I$2,Itineraries!G19)","v":50},{"$f":"getScoreFactor(J$2,Itineraries!J19)","v":110},{"$f":"getScoreFactor(K$2,Itineraries!K19)","v":90},{"$f":"getScoreFactor(L$2,Itineraries!L19)","v":300},{"$f":"IF(INDEX(startingTA,numericItinerary($A19))=$M$2,getScoreFactor(M$2,\"y\"),getScoreFactor(M$2,\"n\"))","v":0},{"$f":"IF(INDEX(endingTA,numericItinerary($A19))=$N$2,getScoreFactor(N$2,\"y\"),getScoreFactor(N$2,\"n\"))","v":500},{"$f":"IF(INDEX(baldyMountainHike,numericItinerary($A19))=\"\",\"\",getPeakScore(O$2))","v":""},{"$f":"IF(INDEX(mountPhillipsHike,numericItinerary($A19))=\"\",\"\",getPeakScore(P$2))","v":283.5},{"$f":"IF(INDEX(toothOfTimeHike,numericItinerary($A19))=\"\",\"\",getPeakScore(Q$2))","v":137.25},{"$f":"IF(INDEX(inspirationPointHike,numericItinerary($A19))=\"\",\"\",getPeakScore(Q$2))","v":""},{"$f":"IF(INDEX(trailPeakHike,numericItinerary($A19))=\"\",\"\",getPeakScore(S$2))","v":181.5},{"$f":"IF(INDEX(mountaineeringHike,numericItinerary($A19))=\"\",\"\",getPeakScore(T$2))","v":202.5},{"$f":"IF(areaImportant<>\"y\",\"\",IF(Itineraries!P19<>\"Y\",\"\",getareascore(U$2)))","v":200},{"$f":"IF(areaImportant<>\"y\",\"\",IF(Itineraries!Q19<>\"Y\",\"\",getareascore(V$2)))","v":150},{"$f":"IF(areaImportant<>\"y\",\"\",IF(Itineraries!R19<>\"Y\",\"\",getareascore(W$2)))","v":""},{"$f":"IF(areaImportant<>\"y\",\"\",IF(Itineraries!S19<>\"Y\",\"\",getareascore(X$2)))","v":""},{"$f":"IF(ItineraryPrograms!C19=\"y\",getScoreFactor(\"Program\",Y$2),\"\")","v":228},{"$f":"IF(ItineraryPrograms!D19=\"y\",getScoreFactor(\"Program\",Z$2),\"\")","v":337.5},{"$f":"IF(ItineraryPrograms!E19=\"y\",getScoreFactor(\"Program\",AA$2),\"\")","v":114},{"$f":"IF(ItineraryPrograms!F19=\"y\",getScoreFactor(\"Program\",AB$2),\"\")","v":282},{"$f":"IF(ItineraryPrograms!G19=\"y\",getScoreFactor(\"Program\",AC$2),\"\")","v":""},{"$f":"IF(ItineraryPrograms!H19=\"y\",getScoreFactor(\"Program\",AD$2),\"\")","v":""},{"$f":"IF(ItineraryPrograms!I19=\"y\",getScoreFactor(\"Program\",AE$2),\"\")","v":""},{"$f":"IF(ItineraryPrograms!J19=\"y\",getScoreFactor(\"Program\",AF$2),\"\")","v":""},{"$f":"IF(ItineraryPrograms!K19=\"y\",getScoreFactor(\"Program\",AG$2),\"\")","v":130.5},{"$f":"IF(ItineraryPrograms!L19=\"y\",getScoreFactor(\"Program\",AH$2),\"\")","v":""},{"$f":"IF(ItineraryPrograms!M19=\"y\",getScoreFactor(\"Program\",AI$2),\"\")","v":109.5},{"$f":"IF(ItineraryPrograms!N19=\"y\",getScoreFactor(\"Program\",AJ$2),\"\")","v":109.5},{"$f":"IF(ItineraryPrograms!O19=\"y\",getScoreFactor(\"Program\",AK$2),\"\")","v":""},{"$f":"IF(ItineraryPrograms!P19=\"y\",getScoreFactor(\"Program\",AL$2),\"\")","v":""},{"$f":"IF(ItineraryPrograms!Q19=\"y\",getScoreFactor(\"Program\",AM$2),\"\")","v":123},{"$f":"IF(ItineraryPrograms!R19=\"y\",getScoreFactor(\"Program\",AN$2),\"\")","v":""},{"$f":"IF(ItineraryPrograms!S19=\"y\",getScoreFactor(\"Program\",AO$2),\"\")","v":106.5},{"$f":"IF(ItineraryPrograms!T19=\"y\",getScoreFactor(\"Program\",AP$2),\"\")","v":""},{"$f":"IF(ItineraryPrograms!U19=\"y\",getScoreFactor(\"Program\",AQ$2),\"\")","v":93},{"$f":"IF(ItineraryPrograms!V19=\"y\",getScoreFactor(\"Program\",AR$2),\"\")","v":156},{"$f":"IF(ItineraryPrograms!W19=\"y\",getScoreFactor(\"Program\",AS$2),\"\")","v":""},{"$f":"IF(ItineraryPrograms!X19=\"y\",getScoreFactor(\"Program\",AT$2),\"\")","v":129},{"$f":"IF(ItineraryPrograms!Y19=\"y\",getScoreFactor(\"Program\",AU$2),\"\")","v":103.5},{"$f":"IF(ItineraryPrograms!Z19=\"y\",getScoreFactor(\"Program\",AV$2),\"\")","v":""},{"$f":"IF(ItineraryPrograms!AA19=\"y\",getScoreFactor(\"Program\",AW$2),\"\")","v":""},{"$f":"IF(ItineraryPrograms!AB19=\"y\",getScoreFactor(\"Program\",AX$2),\"\")","v":""},{"$f":"IF(ItineraryPrograms!AC19=\"y\",getScoreFactor(\"Program\",AY$2),\"\")","v":150},{"$f":"IF(ItineraryPrograms!AD19=\"y\",getScoreFactor(\"Program\",AZ$2),\"\")","v":""},{"$f":"IF(ItineraryPrograms!AE19=\"y\",getScoreFactor(\"Program\",BA$2),\"\")","v":""},{"$f":"IF(ItineraryPrograms!AF19=\"y\",getScoreFactor(\"Program\",BB$2),\"\")","v":189},{"$f":"IF(ItineraryPrograms!AG19=\"y\",getScoreFactor(\"Program\",BC$2),\"\")","v":202.5},{"$f":"IF(ItineraryPrograms!AH19=\"y\",getScoreFactor(\"Program\",BD$2),\"\")","v":91.5},{"$f":"IF(ItineraryPrograms!AI19=\"y\",getScoreFactor(\"Program\",BE$2),\"\")","v":181.5},{"$f":"IF(ItineraryPrograms!AJ19=\"y\",getScoreFactor(\"Program\",BF$2),\"\")","v":220.5},{"$f":"IF(ItineraryPrograms!AK19=\"y\",getScoreFactor(\"Program\",BG$2),\"\")","v":""},{"$f":"IF(ItineraryPrograms!AL19=\"y\",getScoreFactor(\"Program\",BH$2),\"\")","v":255},{"$f":"IF(ItineraryPrograms!AM19=\"y\",getScoreFactor(\"Program\",BI$2),\"\")","v":""},{"$f":"IF(ItineraryPrograms!AN19=\"y\",getScoreFactor(\"Program\",BJ$2),\"\")","v":193.5},{"$f":"IF(ItineraryPrograms!AO19=\"y\",getScoreFactor(\"Program\",BK$2),\"\")","v":181.5},{"$f":"IF(ItineraryPrograms!AP19=\"y\",getScoreFactor(\"Program\",BL$2),\"\")","v":220.5},{"$f":"IF(ItineraryPrograms!AQ19=\"y\",getScoreFactor(\"Program\",BM$2),\"\")","v":""},{"$f":"IF(ItineraryPrograms!AR19=\"y\",getScoreFactor(\"Program\",BN$2),\"\")","v":""},{"$f":"IF(ItineraryPrograms!AS19=\"y\",getScoreFactor(\"Program\",BO$2),\"\")","v":""},{"$f":"IF(ItineraryPrograms!AT19=\"y\",getScoreFactor(\"Program\",BP$2),\"\")","v":193.5},{"$f":"IF(ItineraryPrograms!AU19=\"y\",getScoreFactor(\"Program\",BQ$2),\"\")","v":""},{"$f":"IF(ItineraryPrograms!AV19=\"y\",getScoreFactor(\"Program\",BR$2),\"\")","v":""},{"$f":"IF(ItineraryPrograms!AW19=\"y\",getScoreFactor(\"Program\",BS$2),\"\")","v":""},{"$f":"IF(ItineraryPrograms!AX19=\"y\",getScoreFactor(\"Program\",BT$2),\"\")","v":""},{"$f":"IF(ItineraryPrograms!AY19=\"y\",getScoreFactor(\"Program\",BU$2),\"\")","v":207},{"$f":"IF(ItineraryPrograms!AZ19=\"y\",getScoreFactor(\"Program\",BV$2),\"\")","v":""},{"$f":"IF(ItineraryPrograms!BA19=\"y\",getScoreFactor(\"Program\",BW$2),\"\")","v":""},{"$f":"IF(ItineraryPrograms!BB19=\"y\",getScoreFactor(\"Program\",BX$2),\"\")","v":235.5},{"$f":"IF(ItineraryPrograms!BC19=\"y\",getScoreFactor(\"Program\",BY$2),\"\")","v":133.5},{"$f":"IF(ItineraryPrograms!BD19=\"y\",getScoreFactor(\"Program\",BZ$2),\"\")","v":""},{"$f":"IF(ItineraryPrograms!BE19=\"y\",getScoreFactor(\"Program\",CA$2),\"\")","v":114},{"$f":"IF(ItineraryPrograms!BF19=\"y\",getScoreFactor(\"Program\",CB$2),\"\")","v":""}]
[{"$f":"Itineraries!A20","v":"12-18"},14218.833333333332,{"$f":"getScoreFactor(C$2,itineraryCamps!C21)","v":2833.333333333333},{"$f":"getScoreFactor(D$2,\"Miles\") *itineraryCamps!D21","v":6400},{"$f":"getScoreFactor(E$2,Itineraries!B20)","v":20},{"$f":"getScoreFactor(F$2,Itineraries!C20)","v":80},{"$f":"getScoreFactor(G$2,Itineraries!E20)","v":100},{"$f":"getScoreFactor(H$2,Itineraries!H20)","v":225},{"$f":"getScoreFactor(I$2,Itineraries!G20)","v":60},{"$f":"getScoreFactor(J$2,Itineraries!J20)","v":60},{"$f":"getScoreFactor(K$2,Itineraries!K20)","v":70},{"$f":"getScoreFactor(L$2,Itineraries!L20)","v":300},{"$f":"IF(INDEX(startingTA,numericItinerary($A20))=$M$2,getScoreFactor(M$2,\"y\"),getScoreFactor(M$2,\"n\"))","v":0},{"$f":"IF(INDEX(endingTA,numericItinerary($A20))=$N$2,getScoreFactor(N$2,\"y\"),getScoreFactor(N$2,\"n\"))","v":0},{"$f":"IF(INDEX(baldyMountainHike,numericItinerary($A20))=\"\",\"\",getPeakScore(O$2))","v":351},{"$f":"IF(INDEX(mountPhillipsHike,numericItinerary($A20))=\"\",\"\",getPeakScore(P$2))","v":""},{"$f":"IF(INDEX(toothOfTimeHike,numericItinerary($A20))=\"\",\"\",getPeakScore(Q$2))","v":""},{"$f":"IF(INDEX(inspirationPointHike,numericItinerary($A20))=\"\",\"\",getPeakScore(Q$2))","v":""},{"$f":"IF(INDEX(trailPeakHike,numericItinerary($A20))=\"\",\"\",getPeakScore(S$2))","v":""},{"$f":"IF(INDEX(mountaineeringHike,numericItinerary($A20))=\"\",\"\",getPeakScore(T$2))","v":202.5},{"$f":"IF(areaImportant<>\"y\",\"\",IF(Itineraries!P20<>\"Y\",\"\",getareascore(U$2)))","v":""},{"$f":"IF(areaImportant<>\"y\",\"\",IF(Itineraries!Q20<>\"Y\",\"\",getareascore(V$2)))","v":150},{"$f":"IF(areaImportant<>\"y\",\"\",IF(Itineraries!R20<>\"Y\",\"\",getareascore(W$2)))","v":1000},{"$f":"IF(areaImportant<>\"y\",\"\",IF(Itineraries!S20<>\"Y\",\"\",getareascore(X$2)))","v":""},{"$f":"IF(ItineraryPrograms!C20=\"y\",getScoreFactor(\"Program\",Y$2),\"\")","v":""},{"$f":"IF(ItineraryPrograms!D20=\"y\",getScoreFactor(\"Program\",Z$2),\"\")","v":""},{"$f":"IF(ItineraryPrograms!E20=\"y\",getScoreFactor(\"Program\",AA$2),\"\")","v":""},{"$f":"IF(ItineraryPrograms!F20=\"y\",getScoreFactor(\"Program\",AB$2),\"\")","v":""},{"$f":"IF(ItineraryPrograms!G20=\"y\",getScoreFactor(\"Program\",AC$2),\"\")","v":""},{"$f":"IF(ItineraryPrograms!H20=\"y\",getScoreFactor(\"Program\",AD$2),\"\")","v":166.5},{"$f":"IF(ItineraryPrograms!I20=\"y\",getScoreFactor(\"Program\",AE$2),\"\")","v":166.5},{"$f":"IF(ItineraryPrograms!J20=\"y\",getScoreFactor(\"Program\",AF$2),\"\")","v":""},{"$f":"IF(ItineraryPrograms!K20=\"y\",getScoreFactor(\"Program\",AG$2),\"\")","v":""},{"$f":"IF(ItineraryPrograms!L20=\"y\",getScoreFactor(\"Program\",AH$2),\"\")","v":""},{"$f":"IF(ItineraryPrograms!M20=\"y\",getScoreFactor(\"Program\",AI$2),\"\")","v":109.5},{"$f":"IF(ItineraryPrograms!N20=\"y\",getScoreFactor(\"Program\",AJ$2),\"\")","v":109.5},{"$f":"IF(ItineraryPrograms!O20=\"y\",getScoreFactor(\"Program\",AK$2),\"\")","v":111},{"$f":"IF(ItineraryPrograms!P20=\"y\",getScoreFactor(\"Program\",AL$2),\"\")","v":""},{"$f":"IF(ItineraryPrograms!Q20=\"y\",getScoreFactor(\"Program\",AM$2),\"\")","v":123},{"$f":"IF(ItineraryPrograms!R20=\"y\",getScoreFactor(\"Program\",AN$2),\"\")","v":""},{"$f":"IF(ItineraryPrograms!S20=\"y\",getScoreFactor(\"Program\",AO$2),\"\")","v":""},{"$f":"IF(ItineraryPrograms!T20=\"y\",getScoreFactor(\"Program\",AP$2),\"\")","v":""},{"$f":"IF(ItineraryPrograms!U20=\"y\",getScoreFactor(\"Program\",AQ$2),\"\")","v":93},{"$f":"IF(ItineraryPrograms!V20=\"y\",getScoreFactor(\"Program\",AR$2),\"\")","v":""},{"$f":"IF(ItineraryPrograms!W20=\"y\",getScoreFactor(\"Program\",AS$2),\"\")","v":""},{"$f":"IF(ItineraryPrograms!X20=\"y\",getScoreFactor(\"Program\",AT$2),\"\")","v":129},{"$f":"IF(ItineraryPrograms!Y20=\"y\",getScoreFactor(\"Program\",AU$2),\"\")","v":""},{"$f":"IF(ItineraryPrograms!Z20=\"y\",getScoreFactor(\"Program\",AV$2),\"\")","v":""},{"$f":"IF(ItineraryPrograms!AA20=\"y\",getScoreFactor(\"Program\",AW$2),\"\")","v":""},{"$f":"IF(ItineraryPrograms!AB20=\"y\",getScoreFactor(\"Program\",AX$2),\"\")","v":""},{"$f":"IF(ItineraryPrograms!AC20=\"y\",getScoreFactor(\"Program\",AY$2),\"\")","v":150},{"$f":"IF(ItineraryPrograms!AD20=\"y\",getScoreFactor(\"Program\",AZ$2),\"\")","v":175.5},{"$f":"IF(ItineraryPrograms!AE20=\"y\",getScoreFactor(\"Program\",BA$2),\"\")","v":""},{"$f":"IF(ItineraryPrograms!AF20=\"y\",getScoreFactor(\"Program\",BB$2),\"\")","v":""},{"$f":"IF(ItineraryPrograms!AG20=\"y\",getScoreFactor(\"Program\",BC$2),\"\")","v":202.5},{"$f":"IF(ItineraryPrograms!AH20=\"y\",getScoreFactor(\"Program\",BD$2),\"\")","v":""},{"$f":"IF(ItineraryPrograms!AI20=\"y\",getScoreFactor(\"Program\",BE$2),\"\")","v":""},{"$f":"IF(ItineraryPrograms!AJ20=\"y\",getScoreFactor(\"Program\",BF$2),\"\")","v":""},{"$f":"IF(ItineraryPrograms!AK20=\"y\",getScoreFactor(\"Program\",BG$2),\"\")","v":""},{"$f":"IF(ItineraryPrograms!AL20=\"y\",getScoreFactor(\"Program\",BH$2),\"\")","v":""},{"$f":"IF(ItineraryPrograms!AM20=\"y\",getScoreFactor(\"Program\",BI$2),\"\")","v":""},{"$f":"IF(ItineraryPrograms!AN20=\"y\",getScoreFactor(\"Program\",BJ$2),\"\")","v":""},{"$f":"IF(ItineraryPrograms!AO20=\"y\",getScoreFactor(\"Program\",BK$2),\"\")","v":181.5},{"$f":"IF(ItineraryPrograms!AP20=\"y\",getScoreFactor(\"Program\",BL$2),\"\")","v":220.5},{"$f":"IF(ItineraryPrograms!AQ20=\"y\",getScoreFactor(\"Program\",BM$2),\"\")","v":""},{"$f":"IF(ItineraryPrograms!AR20=\"y\",getScoreFactor(\"Program\",BN$2),\"\")","v":""},{"$f":"IF(ItineraryPrograms!AS20=\"y\",getScoreFactor(\"Program\",BO$2),\"\")","v":235.5},{"$f":"IF(ItineraryPrograms!AT20=\"y\",getScoreFactor(\"Program\",BP$2),\"\")","v":193.5},{"$f":"IF(ItineraryPrograms!AU20=\"y\",getScoreFactor(\"Program\",BQ$2),\"\")","v":""},{"$f":"IF(ItineraryPrograms!AV20=\"y\",getScoreFactor(\"Program\",BR$2),\"\")","v":""},{"$f":"IF(ItineraryPrograms!AW20=\"y\",getScoreFactor(\"Program\",BS$2),\"\")","v":""},{"$f":"IF(ItineraryPrograms!AX20=\"y\",getScoreFactor(\"Program\",BT$2),\"\")","v":""},{"$f":"IF(ItineraryPrograms!AY20=\"y\",getScoreFactor(\"Program\",BU$2),\"\")","v":""},{"$f":"IF(ItineraryPrograms!AZ20=\"y\",getScoreFactor(\"Program\",BV$2),\"\")","v":""},{"$f":"IF(ItineraryPrograms!BA20=\"y\",getScoreFactor(\"Program\",BW$2),\"\")","v":""},{"$f":"IF(ItineraryPrograms!BB20=\"y\",getScoreFactor(\"Program\",BX$2),\"\")","v":235.5},{"$f":"IF(ItineraryPrograms!BC20=\"y\",getScoreFactor(\"Program\",BY$2),\"\")","v":133.5},{"$f":"IF(ItineraryPrograms!BD20=\"y\",getScoreFactor(\"Program\",BZ$2),\"\")","v":285},{"$f":"IF(ItineraryPrograms!BE20=\"y\",getScoreFactor(\"Program\",CA$2),\"\")","v":114},{"$f":"IF(ItineraryPrograms!BF20=\"y\",getScoreFactor(\"Program\",CB$2),\"\")","v":""}]
[{"$f":"Itineraries!A21","v":"12-19"},15945.833333333332,{"$f":"getScoreFactor(C$2,itineraryCamps!C22)","v":2833.333333333333},{"$f":"getScoreFactor(D$2,\"Miles\") *itineraryCamps!D22","v":6900},{"$f":"getScoreFactor(E$2,Itineraries!B21)","v":40},{"$f":"getScoreFactor(F$2,Itineraries!C21)","v":60},{"$f":"getScoreFactor(G$2,Itineraries!E21)","v":75},{"$f":"getScoreFactor(H$2,Itineraries!H21)","v":200},{"$f":"getScoreFactor(I$2,Itineraries!G21)","v":50},{"$f":"getScoreFactor(J$2,Itineraries!J21)","v":110},{"$f":"getScoreFactor(K$2,Itineraries!K21)","v":100},{"$f":"getScoreFactor(L$2,Itineraries!L21)","v":200},{"$f":"IF(INDEX(startingTA,numericItinerary($A21))=$M$2,getScoreFactor(M$2,\"y\"),getScoreFactor(M$2,\"n\"))","v":500},{"$f":"IF(INDEX(endingTA,numericItinerary($A21))=$N$2,getScoreFactor(N$2,\"y\"),getScoreFactor(N$2,\"n\"))","v":500},{"$f":"IF(INDEX(baldyMountainHike,numericItinerary($A21))=\"\",\"\",getPeakScore(O$2))","v":""},{"$f":"IF(INDEX(mountPhillipsHike,numericItinerary($A21))=\"\",\"\",getPeakScore(P$2))","v":283.5},{"$f":"IF(INDEX(toothOfTimeHike,numericItinerary($A21))=\"\",\"\",getPeakScore(Q$2))","v":137.25},{"$f":"IF(INDEX(inspirationPointHike,numericItinerary($A21))=\"\",\"\",getPeakScore(Q$2))","v":137.25},{"$f":"IF(INDEX(trailPeakHike,numericItinerary($A21))=\"\",\"\",getPeakScore(S$2))","v":""},{"$f":"IF(INDEX(mountaineeringHike,numericItinerary($A21))=\"\",\"\",getPeakScore(T$2))","v":202.5},{"$f":"IF(areaImportant<>\"y\",\"\",IF(Itineraries!P21<>\"Y\",\"\",getareascore(U$2)))","v":200},{"$f":"IF(areaImportant<>\"y\",\"\",IF(Itineraries!Q21<>\"Y\",\"\",getareascore(V$2)))","v":150},{"$f":"IF(areaImportant<>\"y\",\"\",IF(Itineraries!R21<>\"Y\",\"\",getareascore(W$2)))","v":""},{"$f":"IF(areaImportant<>\"y\",\"\",IF(Itineraries!S21<>\"Y\",\"\",getareascore(X$2)))","v":""},{"$f":"IF(ItineraryPrograms!C21=\"y\",getScoreFactor(\"Program\",Y$2),\"\")","v":228},{"$f":"IF(ItineraryPrograms!D21=\"y\",getScoreFactor(\"Program\",Z$2),\"\")","v":""},{"$f":"IF(ItineraryPrograms!E21=\"y\",getScoreFactor(\"Program\",AA$2),\"\")","v":""},{"$f":"IF(ItineraryPrograms!F21=\"y\",getScoreFactor(\"Program\",AB$2),\"\")","v":""},{"$f":"IF(ItineraryPrograms!G21=\"y\",getScoreFactor(\"Program\",AC$2),\"\")","v":""},{"$f":"IF(ItineraryPrograms!H21=\"y\",getScoreFactor(\"Program\",AD$2),\"\")","v":166.5},{"$f":"IF(ItineraryPrograms!I21=\"y\",getScoreFactor(\"Program\",AE$2),\"\")","v":166.5},{"$f":"IF(ItineraryPrograms!J21=\"y\",getScoreFactor(\"Program\",AF$2),\"\")","v":""},{"$f":"IF(ItineraryPrograms!K21=\"y\",getScoreFactor(\"Program\",AG$2),\"\")","v":""},{"$f":"IF(ItineraryPrograms!L21=\"y\",getScoreFactor(\"Program\",AH$2),\"\")","v":""},{"$f":"IF(ItineraryPrograms!M21=\"y\",getScoreFactor(\"Program\",AI$2),\"\")","v":109.5},{"$f":"IF(ItineraryPrograms!N21=\"y\",getScoreFactor(\"Program\",AJ$2),\"\")","v":109.5},{"$f":"IF(ItineraryPrograms!O21=\"y\",getScoreFactor(\"Program\",AK$2),\"\")","v":111},{"$f":"IF(ItineraryPrograms!P21=\"y\",getScoreFactor(\"Program\",AL$2),\"\")","v":""},{"$f":"IF(ItineraryPrograms!Q21=\"y\",getScoreFactor(\"Program\",AM$2),\"\")","v":""},{"$f":"IF(ItineraryPrograms!R21=\"y\",getScoreFactor(\"Program\",AN$2),\"\")","v":""},{"$f":"IF(ItineraryPrograms!S21=\"y\",getScoreFactor(\"Program\",AO$2),\"\")","v":106.5},{"$f":"IF(ItineraryPrograms!T21=\"y\",getScoreFactor(\"Program\",AP$2),\"\")","v":""},{"$f":"IF(ItineraryPrograms!U21=\"y\",getScoreFactor(\"Program\",AQ$2),\"\")","v":""},{"$f":"IF(ItineraryPrograms!V21=\"y\",getScoreFactor(\"Program\",AR$2),\"\")","v":156},{"$f":"IF(ItineraryPrograms!W21=\"y\",getScoreFactor(\"Program\",AS$2),\"\")","v":""},{"$f":"IF(ItineraryPrograms!X21=\"y\",getScoreFactor(\"Program\",AT$2),\"\")","v":""},{"$f":"IF(ItineraryPrograms!Y21=\"y\",getScoreFactor(\"Program\",AU$2),\"\")","v":""},{"$f":"IF(ItineraryPrograms!Z21=\"y\",getScoreFactor(\"Program\",AV$2),\"\")","v":""},{"$f":"IF(ItineraryPrograms!AA21=\"y\",getScoreFactor(\"Program\",AW$2),\"\")","v":""},{"$f":"IF(ItineraryPrograms!AB21=\"y\",getScoreFactor(\"Program\",AX$2),\"\")","v":""},{"$f":"IF(ItineraryPrograms!AC21=\"y\",getScoreFactor(\"Program\",AY$2),\"\")","v":""},{"$f":"IF(ItineraryPrograms!AD21=\"y\",getScoreFactor(\"Program\",AZ$2),\"\")","v":""},{"$f":"IF(ItineraryPrograms!AE21=\"y\",getScoreFactor(\"Program\",BA$2),\"\")","v":154.5},{"$f":"IF(ItineraryPrograms!AF21=\"y\",getScoreFactor(\"Program\",BB$2),\"\")","v":189},{"$f":"IF(ItineraryPrograms!AG21=\"y\",getScoreFactor(\"Program\",BC$2),\"\")","v":202.5},{"$f":"IF(ItineraryPrograms!AH21=\"y\",getScoreFactor(\"Program\",BD$2),\"\")","v":91.5},{"$f":"IF(ItineraryPrograms!AI21=\"y\",getScoreFactor(\"Program\",BE$2),\"\")","v":""},{"$f":"IF(ItineraryPrograms!AJ21=\"y\",getScoreFactor(\"Program\",BF$2),\"\")","v":220.5},{"$f":"IF(ItineraryPrograms!AK21=\"y\",getScoreFactor(\"Program\",BG$2),\"\")","v":""},{"$f":"IF(ItineraryPrograms!AL21=\"y\",getScoreFactor(\"Program\",BH$2),\"\")","v":255},{"$f":"IF(ItineraryPrograms!AM21=\"y\",getScoreFactor(\"Program\",BI$2),\"\")","v":""},{"$f":"IF(ItineraryPrograms!AN21=\"y\",getScoreFactor(\"Program\",BJ$2),\"\")","v":""},{"$f":"IF(ItineraryPrograms!AO21=\"y\",getScoreFactor(\"Program\",BK$2),\"\")","v":181.5},{"$f":"IF(ItineraryPrograms!AP21=\"y\",getScoreFactor(\"Program\",BL$2),\"\")","v":220.5},{"$f":"IF(ItineraryPrograms!AQ21=\"y\",getScoreFactor(\"Program\",BM$2),\"\")","v":""},{"$f":"IF(ItineraryPrograms!AR21=\"y\",getScoreFactor(\"Program\",BN$2),\"\")","v":255},{"$f":"IF(ItineraryPrograms!AS21=\"y\",getScoreFactor(\"Program\",BO$2),\"\")","v":""},{"$f":"IF(ItineraryPrograms!AT21=\"y\",getScoreFactor(\"Program\",BP$2),\"\")","v":""},{"$f":"IF(ItineraryPrograms!AU21=\"y\",getScoreFactor(\"Program\",BQ$2),\"\")","v":""},{"$f":"IF(ItineraryPrograms!AV21=\"y\",getScoreFactor(\"Program\",BR$2),\"\")","v":136.5},{"$f":"IF(ItineraryPrograms!AW21=\"y\",getScoreFactor(\"Program\",BS$2),\"\")","v":""},{"$f":"IF(ItineraryPrograms!AX21=\"y\",getScoreFactor(\"Program\",BT$2),\"\")","v":""},{"$f":"IF(ItineraryPrograms!AY21=\"y\",getScoreFactor(\"Program\",BU$2),\"\")","v":207},{"$f":"IF(ItineraryPrograms!AZ21=\"y\",getScoreFactor(\"Program\",BV$2),\"\")","v":""},{"$f":"IF(ItineraryPrograms!BA21=\"y\",getScoreFactor(\"Program\",BW$2),\"\")","v":""},{"$f":"IF(ItineraryPrograms!BB21=\"y\",getScoreFactor(\"Program\",BX$2),\"\")","v":""},{"$f":"IF(ItineraryPrograms!BC21=\"y\",getScoreFactor(\"Program\",BY$2),\"\")","v":133.5},{"$f":"IF(ItineraryPrograms!BD21=\"y\",getScoreFactor(\"Program\",BZ$2),\"\")","v":""},{"$f":"IF(ItineraryPrograms!BE21=\"y\",getScoreFactor(\"Program\",CA$2),\"\")","v":114},{"$f":"IF(ItineraryPrograms!BF21=\"y\",getScoreFactor(\"Program\",CB$2),\"\")","v":""}]
[{"$f":"Itineraries!A22","v":"12-20"},15650,{"$f":"getScoreFactor(C$2,itineraryCamps!C23)","v":3000},{"$f":"getScoreFactor(D$2,\"Miles\") *itineraryCamps!D23","v":7600},{"$f":"getScoreFactor(E$2,Itineraries!B22)","v":30},{"$f":"getScoreFactor(F$2,Itineraries!C22)","v":70},{"$f":"getScoreFactor(G$2,Itineraries!E22)","v":100},{"$f":"getScoreFactor(H$2,Itineraries!H22)","v":300},{"$f":"getScoreFactor(I$2,Itineraries!G22)","v":60},{"$f":"getScoreFactor(J$2,Itineraries!J22)","v":80},{"$f":"getScoreFactor(K$2,Itineraries!K22)","v":80},{"$f":"getScoreFactor(L$2,Itineraries!L22)","v":300},{"$f":"IF(INDEX(startingTA,numericItinerary($A22))=$M$2,getScoreFactor(M$2,\"y\"),getScoreFactor(M$2,\"n\"))","v":0},{"$f":"IF(INDEX(endingTA,numericItinerary($A22))=$N$2,getScoreFactor(N$2,\"y\"),getScoreFactor(N$2,\"n\"))","v":0},{"$f":"IF(INDEX(baldyMountainHike,numericItinerary($A22))=\"\",\"\",getPeakScore(O$2))","v":351},{"$f":"IF(INDEX(mountPhillipsHike,numericItinerary($A22))=\"\",\"\",getPeakScore(P$2))","v":""},{"$f":"IF(INDEX(toothOfTimeHike,numericItinerary($A22))=\"\",\"\",getPeakScore(Q$2))","v":""},{"$f":"IF(INDEX(inspirationPointHike,numericItinerary($A22))=\"\",\"\",getPeakScore(Q$2))","v":""},{"$f":"IF(INDEX(trailPeakHike,numericItinerary($A22))=\"\",\"\",getPeakScore(S$2))","v":""},{"$f":"IF(INDEX(mountaineeringHike,numericItinerary($A22))=\"\",\"\",getPeakScore(T$2))","v":""},{"$f":"IF(areaImportant<>\"y\",\"\",IF(Itineraries!P22<>\"Y\",\"\",getareascore(U$2)))","v":""},{"$f":"IF(areaImportant<>\"y\",\"\",IF(Itineraries!Q22<>\"Y\",\"\",getareascore(V$2)))","v":""},{"$f":"IF(areaImportant<>\"y\",\"\",IF(Itineraries!R22<>\"Y\",\"\",getareascore(W$2)))","v":1000},{"$f":"IF(areaImportant<>\"y\",\"\",IF(Itineraries!S22<>\"Y\",\"\",getareascore(X$2)))","v":600},{"$f":"IF(ItineraryPrograms!C22=\"y\",getScoreFactor(\"Program\",Y$2),\"\")","v":""},{"$f":"IF(ItineraryPrograms!D22=\"y\",getScoreFactor(\"Program\",Z$2),\"\")","v":""},{"$f":"IF(ItineraryPrograms!E22=\"y\",getScoreFactor(\"Program\",AA$2),\"\")","v":""},{"$f":"IF(ItineraryPrograms!F22=\"y\",getScoreFactor(\"Program\",AB$2),\"\")","v":""},{"$f":"IF(ItineraryPrograms!G22=\"y\",getScoreFactor(\"Program\",AC$2),\"\")","v":""},{"$f":"IF(ItineraryPrograms!H22=\"y\",getScoreFactor(\"Program\",AD$2),\"\")","v":166.5},{"$f":"IF(ItineraryPrograms!I22=\"y\",getScoreFactor(\"Program\",AE$2),\"\")","v":166.5},{"$f":"IF(ItineraryPrograms!J22=\"y\",getScoreFactor(\"Program\",AF$2),\"\")","v":""},{"$f":"IF(ItineraryPrograms!K22=\"y\",getScoreFactor(\"Program\",AG$2),\"\")","v":""},{"$f":"IF(ItineraryPrograms!L22=\"y\",getScoreFactor(\"Program\",AH$2),\"\")","v":""},{"$f":"IF(ItineraryPrograms!M22=\"y\",getScoreFactor(\"Program\",AI$2),\"\")","v":109.5},{"$f":"IF(ItineraryPrograms!N22=\"y\",getScoreFactor(\"Program\",AJ$2),\"\")","v":109.5},{"$f":"IF(ItineraryPrograms!O22=\"y\",getScoreFactor(\"Program\",AK$2),\"\")","v":111},{"$f":"IF(ItineraryPrograms!P22=\"y\",getScoreFactor(\"Program\",AL$2),\"\")","v":""},{"$f":"IF(ItineraryPrograms!Q22=\"y\",getScoreFactor(\"Program\",AM$2),\"\")","v":""},{"$f":"IF(ItineraryPrograms!R22=\"y\",getScoreFactor(\"Program\",AN$2),\"\")","v":""},{"$f":"IF(ItineraryPrograms!S22=\"y\",getScoreFactor(\"Program\",AO$2),\"\")","v":""},{"$f":"IF(ItineraryPrograms!T22=\"y\",getScoreFactor(\"Program\",AP$2),\"\")","v":""},{"$f":"IF(ItineraryPrograms!U22=\"y\",getScoreFactor(\"Program\",AQ$2),\"\")","v":""},{"$f":"IF(ItineraryPrograms!V22=\"y\",getScoreFactor(\"Program\",AR$2),\"\")","v":""},{"$f":"IF(ItineraryPrograms!W22=\"y\",getScoreFactor(\"Program\",AS$2),\"\")","v":114},{"$f":"IF(ItineraryPrograms!X22=\"y\",getScoreFactor(\"Program\",AT$2),\"\")","v":129},{"$f":"IF(ItineraryPrograms!Y22=\"y\",getScoreFactor(\"Program\",AU$2),\"\")","v":""},{"$f":"IF(ItineraryPrograms!Z22=\"y\",getScoreFactor(\"Program\",AV$2),\"\")","v":""},{"$f":"IF(ItineraryPrograms!AA22=\"y\",getScoreFactor(\"Program\",AW$2),\"\")","v":""},{"$f":"IF(ItineraryPrograms!AB22=\"y\",getScoreFactor(\"Program\",AX$2),\"\")","v":""},{"$f":"IF(ItineraryPrograms!AC22=\"y\",getScoreFactor(\"Program\",AY$2),\"\")","v":""},{"$f":"IF(ItineraryPrograms!AD22=\"y\",getScoreFactor(\"Program\",AZ$2),\"\")","v":175.5},{"$f":"IF(ItineraryPrograms!AE22=\"y\",getScoreFactor(\"Program\",BA$2),\"\")","v":""},{"$f":"IF(ItineraryPrograms!AF22=\"y\",getScoreFactor(\"Program\",BB$2),\"\")","v":""},{"$f":"IF(ItineraryPrograms!AG22=\"y\",getScoreFactor(\"Program\",BC$2),\"\")","v":""},{"$f":"IF(ItineraryPrograms!AH22=\"y\",getScoreFactor(\"Program\",BD$2),\"\")","v":""},{"$f":"IF(ItineraryPrograms!AI22=\"y\",getScoreFactor(\"Program\",BE$2),\"\")","v":""},{"$f":"IF(ItineraryPrograms!AJ22=\"y\",getScoreFactor(\"Program\",BF$2),\"\")","v":""},{"$f":"IF(ItineraryPrograms!AK22=\"y\",getScoreFactor(\"Program\",BG$2),\"\")","v":210},{"$f":"IF(ItineraryPrograms!AL22=\"y\",getScoreFactor(\"Program\",BH$2),\"\")","v":""},{"$f":"IF(ItineraryPrograms!AM22=\"y\",getScoreFactor(\"Program\",BI$2),\"\")","v":""},{"$f":"IF(ItineraryPrograms!AN22=\"y\",getScoreFactor(\"Program\",BJ$2),\"\")","v":193.5},{"$f":"IF(ItineraryPrograms!AO22=\"y\",getScoreFactor(\"Program\",BK$2),\"\")","v":""},{"$f":"IF(ItineraryPrograms!AP22=\"y\",getScoreFactor(\"Program\",BL$2),\"\")","v":""},{"$f":"IF(ItineraryPrograms!AQ22=\"y\",getScoreFactor(\"Program\",BM$2),\"\")","v":""},{"$f":"IF(ItineraryPrograms!AR22=\"y\",getScoreFactor(\"Program\",BN$2),\"\")","v":""},{"$f":"IF(ItineraryPrograms!AS22=\"y\",getScoreFactor(\"Program\",BO$2),\"\")","v":235.5},{"$f":"IF(ItineraryPrograms!AT22=\"y\",getScoreFactor(\"Program\",BP$2),\"\")","v":""},{"$f":"IF(ItineraryPrograms!AU22=\"y\",getScoreFactor(\"Program\",BQ$2),\"\")","v":151.5},{"$f":"IF(ItineraryPrograms!AV22=\"y\",getScoreFactor(\"Program\",BR$2),\"\")","v":""},{"$f":"IF(ItineraryPrograms!AW22=\"y\",getScoreFactor(\"Program\",BS$2),\"\")","v":""},{"$f":"IF(ItineraryPrograms!AX22=\"y\",getScoreFactor(\"Program\",BT$2),\"\")","v":""},{"$f":"IF(ItineraryPrograms!AY22=\"y\",getScoreFactor(\"Program\",BU$2),\"\")","v":207},{"$f":"IF(ItineraryPrograms!AZ22=\"y\",getScoreFactor(\"Program\",BV$2),\"\")","v":""},{"$f":"IF(ItineraryPrograms!BA22=\"y\",getScoreFactor(\"Program\",BW$2),\"\")","v":91.5},{"$f":"IF(ItineraryPrograms!BB22=\"y\",getScoreFactor(\"Program\",BX$2),\"\")","v":235.5},{"$f":"IF(ItineraryPrograms!BC22=\"y\",getScoreFactor(\"Program\",BY$2),\"\")","v":133.5},{"$f":"IF(ItineraryPrograms!BD22=\"y\",getScoreFactor(\"Program\",BZ$2),\"\")","v":285},{"$f":"IF(ItineraryPrograms!BE22=\"y\",getScoreFactor(\"Program\",CA$2),\"\")","v":114},{"$f":"IF(ItineraryPrograms!BF22=\"y\",getScoreFactor(\"Program\",CB$2),\"\")","v":139.5}]
[{"$f":"Itineraries!A23","v":"12-21"},16361.25,{"$f":"getScoreFactor(C$2,itineraryCamps!C24)","v":3000},{"$f":"getScoreFactor(D$2,\"Miles\") *itineraryCamps!D24","v":7000},{"$f":"getScoreFactor(E$2,Itineraries!B23)","v":50},{"$f":"getScoreFactor(F$2,Itineraries!C23)","v":70},{"$f":"getScoreFactor(G$2,Itineraries!E23)","v":150},{"$f":"getScoreFactor(H$2,Itineraries!H23)","v":200},{"$f":"getScoreFactor(I$2,Itineraries!G23)","v":60},{"$f":"getScoreFactor(J$2,Itineraries!J23)","v":110},{"$f":"getScoreFactor(K$2,Itineraries!K23)","v":100},{"$f":"getScoreFactor(L$2,Itineraries!L23)","v":200},{"$f":"IF(INDEX(startingTA,numericItinerary($A23))=$M$2,getScoreFactor(M$2,\"y\"),getScoreFactor(M$2,\"n\"))","v":0},{"$f":"IF(INDEX(endingTA,numericItinerary($A23))=$N$2,getScoreFactor(N$2,\"y\"),getScoreFactor(N$2,\"n\"))","v":500},{"$f":"IF(INDEX(baldyMountainHike,numericItinerary($A23))=\"\",\"\",getPeakScore(O$2))","v":""},{"$f":"IF(INDEX(mountPhillipsHike,numericItinerary($A23))=\"\",\"\",getPeakScore(P$2))","v":283.5},{"$f":"IF(INDEX(toothOfTimeHike,numericItinerary($A23))=\"\",\"\",getPeakScore(Q$2))","v":137.25},{"$f":"IF(INDEX(inspirationPointHike,numericItinerary($A23))=\"\",\"\",getPeakScore(Q$2))","v":""},{"$f":"IF(INDEX(trailPeakHike,numericItinerary($A23))=\"\",\"\",getPeakScore(S$2))","v":""},{"$f":"IF(INDEX(mountaineeringHike,numericItinerary($A23))=\"\",\"\",getPeakScore(T$2))","v":202.5},{"$f":"IF(areaImportant<>\"y\",\"\",IF(Itineraries!P23<>\"Y\",\"\",getareascore(U$2)))","v":200},{"$f":"IF(areaImportant<>\"y\",\"\",IF(Itineraries!Q23<>\"Y\",\"\",getareascore(V$2)))","v":150},{"$f":"IF(areaImportant<>\"y\",\"\",IF(Itineraries!R23<>\"Y\",\"\",getareascore(W$2)))","v":""},{"$f":"IF(areaImportant<>\"y\",\"\",IF(Itineraries!S23<>\"Y\",\"\",getareascore(X$2)))","v":""},{"$f":"IF(ItineraryPrograms!C23=\"y\",getScoreFactor(\"Program\",Y$2),\"\")","v":228},{"$f":"IF(ItineraryPrograms!D23=\"y\",getScoreFactor(\"Program\",Z$2),\"\")","v":337.5},{"$f":"IF(ItineraryPrograms!E23=\"y\",getScoreFactor(\"Program\",AA$2),\"\")","v":114},{"$f":"IF(ItineraryPrograms!F23=\"y\",getScoreFactor(\"Program\",AB$2),\"\")","v":282},{"$f":"IF(ItineraryPrograms!G23=\"y\",getScoreFactor(\"Program\",AC$2),\"\")","v":162},{"$f":"IF(ItineraryPrograms!H23=\"y\",getScoreFactor(\"Program\",AD$2),\"\")","v":""},{"$f":"IF(ItineraryPrograms!I23=\"y\",getScoreFactor(\"Program\",AE$2),\"\")","v":""},{"$f":"IF(ItineraryPrograms!J23=\"y\",getScoreFactor(\"Program\",AF$2),\"\")","v":126},{"$f":"IF(ItineraryPrograms!K23=\"y\",getScoreFactor(\"Program\",AG$2),\"\")","v":130.5},{"$f":"IF(ItineraryPrograms!L23=\"y\",getScoreFactor(\"Program\",AH$2),\"\")","v":91.5},{"$f":"IF(ItineraryPrograms!M23=\"y\",getScoreFactor(\"Program\",AI$2),\"\")","v":109.5},{"$f":"IF(ItineraryPrograms!N23=\"y\",getScoreFactor(\"Program\",AJ$2),\"\")","v":109.5},{"$f":"IF(ItineraryPrograms!O23=\"y\",getScoreFactor(\"Program\",AK$2),\"\")","v":""},{"$f":"IF(ItineraryPrograms!P23=\"y\",getScoreFactor(\"Program\",AL$2),\"\")","v":114},{"$f":"IF(ItineraryPrograms!Q23=\"y\",getScoreFactor(\"Program\",AM$2),\"\")","v":123},{"$f":"IF(ItineraryPrograms!R23=\"y\",getScoreFactor(\"Program\",AN$2),\"\")","v":126},{"$f":"IF(ItineraryPrograms!S23=\"y\",getScoreFactor(\"Program\",AO$2),\"\")","v":106.5},{"$f":"IF(ItineraryPrograms!T23=\"y\",getScoreFactor(\"Program\",AP$2),\"\")","v":145.5},{"$f":"IF(ItineraryPrograms!U23=\"y\",getScoreFactor(\"Program\",AQ$2),\"\")","v":93},{"$f":"IF(ItineraryPrograms!V23=\"y\",getScoreFactor(\"Program\",AR$2),\"\")","v":""},{"$f":"IF(ItineraryPrograms!W23=\"y\",getScoreFactor(\"Program\",AS$2),\"\")","v":""},{"$f":"IF(ItineraryPrograms!X23=\"y\",getScoreFactor(\"Program\",AT$2),\"\")","v":129},{"$f":"IF(ItineraryPrograms!Y23=\"y\",getScoreFactor(\"Program\",AU$2),\"\")","v":103.5},{"$f":"IF(ItineraryPrograms!Z23=\"y\",getScoreFactor(\"Program\",AV$2),\"\")","v":""},{"$f":"IF(ItineraryPrograms!AA23=\"y\",getScoreFactor(\"Program\",AW$2),\"\")","v":""},{"$f":"IF(ItineraryPrograms!AB23=\"y\",getScoreFactor(\"Program\",AX$2),\"\")","v":""},{"$f":"IF(ItineraryPrograms!AC23=\"y\",getScoreFactor(\"Program\",AY$2),\"\")","v":""},{"$f":"IF(ItineraryPrograms!AD23=\"y\",getScoreFactor(\"Program\",AZ$2),\"\")","v":""},{"$f":"IF(ItineraryPrograms!AE23=\"y\",getScoreFactor(\"Program\",BA$2),\"\")","v":""},{"$f":"IF(ItineraryPrograms!AF23=\"y\",getScoreFactor(\"Program\",BB$2),\"\")","v":189},{"$f":"IF(ItineraryPrograms!AG23=\"y\",getScoreFactor(\"Program\",BC$2),\"\")","v":202.5},{"$f":"IF(ItineraryPrograms!AH23=\"y\",getScoreFactor(\"Program\",BD$2),\"\")","v":91.5},{"$f":"IF(ItineraryPrograms!AI23=\"y\",getScoreFactor(\"Program\",BE$2),\"\")","v":""},{"$f":"IF(ItineraryPrograms!AJ23=\"y\",getScoreFactor(\"Program\",BF$2),\"\")","v":220.5},{"$f":"IF(ItineraryPrograms!AK23=\"y\",getScoreFactor(\"Program\",BG$2),\"\")","v":""},{"$f":"IF(ItineraryPrograms!AL23=\"y\",getScoreFactor(\"Program\",BH$2),\"\")","v":255},{"$f":"IF(ItineraryPrograms!AM23=\"y\",getScoreFactor(\"Program\",BI$2),\"\")","v":""},{"$f":"IF(ItineraryPrograms!AN23=\"y\",getScoreFactor(\"Program\",BJ$2),\"\")","v":""},{"$f":"IF(ItineraryPrograms!AO23=\"y\",getScoreFactor(\"Program\",BK$2),\"\")","v":""},{"$f":"IF(ItineraryPrograms!AP23=\"y\",getScoreFactor(\"Program\",BL$2),\"\")","v":""},{"$f":"IF(ItineraryPrograms!AQ23=\"y\",getScoreFactor(\"Program\",BM$2),\"\")","v":""},{"$f":"IF(ItineraryPrograms!AR23=\"y\",getScoreFactor(\"Program\",BN$2),\"\")","v":""},{"$f":"IF(ItineraryPrograms!AS23=\"y\",getScoreFactor(\"Program\",BO$2),\"\")","v":""},{"$f":"IF(ItineraryPrograms!AT23=\"y\",getScoreFactor(\"Program\",BP$2),\"\")","v":""},{"$f":"IF(ItineraryPrograms!AU23=\"y\",getScoreFactor(\"Program\",BQ$2),\"\")","v":151.5},{"$f":"IF(ItineraryPrograms!AV23=\"y\",getScoreFactor(\"Program\",BR$2),\"\")","v":""},{"$f":"IF(ItineraryPrograms!AW23=\"y\",getScoreFactor(\"Program\",BS$2),\"\")","v":""},{"$f":"IF(ItineraryPrograms!AX23=\"y\",getScoreFactor(\"Program\",BT$2),\"\")","v":""},{"$f":"IF(ItineraryPrograms!AY23=\"y\",getScoreFactor(\"Program\",BU$2),\"\")","v":207},{"$f":"IF(ItineraryPrograms!AZ23=\"y\",getScoreFactor(\"Program\",BV$2),\"\")","v":""},{"$f":"IF(ItineraryPrograms!BA23=\"y\",getScoreFactor(\"Program\",BW$2),\"\")","v":""},{"$f":"IF(ItineraryPrograms!BB23=\"y\",getScoreFactor(\"Program\",BX$2),\"\")","v":235.5},{"$f":"IF(ItineraryPrograms!BC23=\"y\",getScoreFactor(\"Program\",BY$2),\"\")","v":133.5},{"$f":"IF(ItineraryPrograms!BD23=\"y\",getScoreFactor(\"Program\",BZ$2),\"\")","v":285},{"$f":"IF(ItineraryPrograms!BE23=\"y\",getScoreFactor(\"Program\",CA$2),\"\")","v":114},{"$f":"IF(ItineraryPrograms!BF23=\"y\",getScoreFactor(\"Program\",CB$2),\"\")","v":""}]
[{"$f":"Itineraries!A24","v":"12-22"},15604.5,{"$f":"getScoreFactor(C$2,itineraryCamps!C25)","v":3000},{"$f":"getScoreFactor(D$2,\"Miles\") *itineraryCamps!D25","v":6800},{"$f":"getScoreFactor(E$2,Itineraries!B24)","v":40},{"$f":"getScoreFactor(F$2,Itineraries!C24)","v":80},{"$f":"getScoreFactor(G$2,Itineraries!E24)","v":125},{"$f":"getScoreFactor(H$2,Itineraries!H24)","v":200},{"$f":"getScoreFactor(I$2,Itineraries!G24)","v":60},{"$f":"getScoreFactor(J$2,Itineraries!J24)","v":90},{"$f":"getScoreFactor(K$2,Itineraries!K24)","v":80},{"$f":"getScoreFactor(L$2,Itineraries!L24)","v":300},{"$f":"IF(INDEX(startingTA,numericItinerary($A24))=$M$2,getScoreFactor(M$2,\"y\"),getScoreFactor(M$2,\"n\"))","v":0},{"$f":"IF(INDEX(endingTA,numericItinerary($A24))=$N$2,getScoreFactor(N$2,\"y\"),getScoreFactor(N$2,\"n\"))","v":0},{"$f":"IF(INDEX(baldyMountainHike,numericItinerary($A24))=\"\",\"\",getPeakScore(O$2))","v":351},{"$f":"IF(INDEX(mountPhillipsHike,numericItinerary($A24))=\"\",\"\",getPeakScore(P$2))","v":""},{"$f":"IF(INDEX(toothOfTimeHike,numericItinerary($A24))=\"\",\"\",getPeakScore(Q$2))","v":""},{"$f":"IF(INDEX(inspirationPointHike,numericItinerary($A24))=\"\",\"\",getPeakScore(Q$2))","v":""},{"$f":"IF(INDEX(trailPeakHike,numericItinerary($A24))=\"\",\"\",getPeakScore(S$2))","v":""},{"$f":"IF(INDEX(mountaineeringHike,numericItinerary($A24))=\"\",\"\",getPeakScore(T$2))","v":""},{"$f":"IF(areaImportant<>\"y\",\"\",IF(Itineraries!P24<>\"Y\",\"\",getareascore(U$2)))","v":""},{"$f":"IF(areaImportant<>\"y\",\"\",IF(Itineraries!Q24<>\"Y\",\"\",getareascore(V$2)))","v":150},{"$f":"IF(areaImportant<>\"y\",\"\",IF(Itineraries!R24<>\"Y\",\"\",getareascore(W$2)))","v":1000},{"$f":"IF(areaImportant<>\"y\",\"\",IF(Itineraries!S24<>\"Y\",\"\",getareascore(X$2)))","v":""},{"$f":"IF(ItineraryPrograms!C24=\"y\",getScoreFactor(\"Program\",Y$2),\"\")","v":""},{"$f":"IF(ItineraryPrograms!D24=\"y\",getScoreFactor(\"Program\",Z$2),\"\")","v":""},{"$f":"IF(ItineraryPrograms!E24=\"y\",getScoreFactor(\"Program\",AA$2),\"\")","v":""},{"$f":"IF(ItineraryPrograms!F24=\"y\",getScoreFactor(\"Program\",AB$2),\"\")","v":282},{"$f":"IF(ItineraryPrograms!G24=\"y\",getScoreFactor(\"Program\",AC$2),\"\")","v":""},{"$f":"IF(ItineraryPrograms!H24=\"y\",getScoreFactor(\"Program\",AD$2),\"\")","v":166.5},{"$f":"IF(ItineraryPrograms!I24=\"y\",getScoreFactor(\"Program\",AE$2),\"\")","v":166.5},{"$f":"IF(ItineraryPrograms!J24=\"y\",getScoreFactor(\"Program\",AF$2),\"\")","v":""},{"$f":"IF(ItineraryPrograms!K24=\"y\",getScoreFactor(\"Program\",AG$2),\"\")","v":""},{"$f":"IF(ItineraryPrograms!L24=\"y\",getScoreFactor(\"Program\",AH$2),\"\")","v":""},{"$f":"IF(ItineraryPrograms!M24=\"y\",getScoreFactor(\"Program\",AI$2),\"\")","v":109.5},{"$f":"IF(ItineraryPrograms!N24=\"y\",getScoreFactor(\"Program\",AJ$2),\"\")","v":109.5},{"$f":"IF(ItineraryPrograms!O24=\"y\",getScoreFactor(\"Program\",AK$2),\"\")","v":111},{"$f":"IF(ItineraryPrograms!P24=\"y\",getScoreFactor(\"Program\",AL$2),\"\")","v":""},{"$f":"IF(ItineraryPrograms!Q24=\"y\",getScoreFactor(\"Program\",AM$2),\"\")","v":123},{"$f":"IF(ItineraryPrograms!R24=\"y\",getScoreFactor(\"Program\",AN$2),\"\")","v":""},{"$f":"IF(ItineraryPrograms!S24=\"y\",getScoreFactor(\"Program\",AO$2),\"\")","v":""},{"$f":"IF(ItineraryPrograms!T24=\"y\",getScoreFactor(\"Program\",AP$2),\"\")","v":""},{"$f":"IF(ItineraryPrograms!U24=\"y\",getScoreFactor(\"Program\",AQ$2),\"\")","v":93},{"$f":"IF(ItineraryPrograms!V24=\"y\",getScoreFactor(\"Program\",AR$2),\"\")","v":""},{"$f":"IF(ItineraryPrograms!W24=\"y\",getScoreFactor(\"Program\",AS$2),\"\")","v":114},{"$f":"IF(ItineraryPrograms!X24=\"y\",getScoreFactor(\"Program\",AT$2),\"\")","v":129},{"$f":"IF(ItineraryPrograms!Y24=\"y\",getScoreFactor(\"Program\",AU$2),\"\")","v":""},{"$f":"IF(ItineraryPrograms!Z24=\"y\",getScoreFactor(\"Program\",AV$2),\"\")","v":""},{"$f":"IF(ItineraryPrograms!AA24=\"y\",getScoreFactor(\"Program\",AW$2),\"\")","v":""},{"$f":"IF(ItineraryPrograms!AB24=\"y\",getScoreFactor(\"Program\",AX$2),\"\")","v":""},{"$f":"IF(ItineraryPrograms!AC24=\"y\",getScoreFactor(\"Program\",AY$2),\"\")","v":150},{"$f":"IF(ItineraryPrograms!AD24=\"y\",getScoreFactor(\"Program\",AZ$2),\"\")","v":175.5},{"$f":"IF(ItineraryPrograms!AE24=\"y\",getScoreFactor(\"Program\",BA$2),\"\")","v":""},{"$f":"IF(ItineraryPrograms!AF24=\"y\",getScoreFactor(\"Program\",BB$2),\"\")","v":""},{"$f":"IF(ItineraryPrograms!AG24=\"y\",getScoreFactor(\"Program\",BC$2),\"\")","v":""},{"$f":"IF(ItineraryPrograms!AH24=\"y\",getScoreFactor(\"Program\",BD$2),\"\")","v":""},{"$f":"IF(ItineraryPrograms!AI24=\"y\",getScoreFactor(\"Program\",BE$2),\"\")","v":""},{"$f":"IF(ItineraryPrograms!AJ24=\"y\",getScoreFactor(\"Program\",BF$2),\"\")","v":""},{"$f":"IF(ItineraryPrograms!AK24=\"y\",getScoreFactor(\"Program\",BG$2),\"\")","v":""},{"$f":"IF(ItineraryPrograms!AL24=\"y\",getScoreFactor(\"Program\",BH$2),\"\")","v":""},{"$f":"IF(ItineraryPrograms!AM24=\"y\",getScoreFactor(\"Program\",BI$2),\"\")","v":""},{"$f":"IF(ItineraryPrograms!AN24=\"y\",getScoreFactor(\"Program\",BJ$2),\"\")","v":""},{"$f":"IF(ItineraryPrograms!AO24=\"y\",getScoreFactor(\"Program\",BK$2),\"\")","v":181.5},{"$f":"IF(ItineraryPrograms!AP24=\"y\",getScoreFactor(\"Program\",BL$2),\"\")","v":220.5},{"$f":"IF(ItineraryPrograms!AQ24=\"y\",getScoreFactor(\"Program\",BM$2),\"\")","v":""},{"$f":"IF(ItineraryPrograms!AR24=\"y\",getScoreFactor(\"Program\",BN$2),\"\")","v":""},{"$f":"IF(ItineraryPrograms!AS24=\"y\",getScoreFactor(\"Program\",BO$2),\"\")","v":235.5},{"$f":"IF(ItineraryPrograms!AT24=\"y\",getScoreFactor(\"Program\",BP$2),\"\")","v":193.5},{"$f":"IF(ItineraryPrograms!AU24=\"y\",getScoreFactor(\"Program\",BQ$2),\"\")","v":151.5},{"$f":"IF(ItineraryPrograms!AV24=\"y\",getScoreFactor(\"Program\",BR$2),\"\")","v":""},{"$f":"IF(ItineraryPrograms!AW24=\"y\",getScoreFactor(\"Program\",BS$2),\"\")","v":202.5},{"$f":"IF(ItineraryPrograms!AX24=\"y\",getScoreFactor(\"Program\",BT$2),\"\")","v":207},{"$f":"IF(ItineraryPrograms!AY24=\"y\",getScoreFactor(\"Program\",BU$2),\"\")","v":207},{"$f":"IF(ItineraryPrograms!AZ24=\"y\",getScoreFactor(\"Program\",BV$2),\"\")","v":""},{"$f":"IF(ItineraryPrograms!BA24=\"y\",getScoreFactor(\"Program\",BW$2),\"\")","v":""},{"$f":"IF(ItineraryPrograms!BB24=\"y\",getScoreFactor(\"Program\",BX$2),\"\")","v":235.5},{"$f":"IF(ItineraryPrograms!BC24=\"y\",getScoreFactor(\"Program\",BY$2),\"\")","v":133.5},{"$f":"IF(ItineraryPrograms!BD24=\"y\",getScoreFactor(\"Program\",BZ$2),\"\")","v":285},{"$f":"IF(ItineraryPrograms!BE24=\"y\",getScoreFactor(\"Program\",CA$2),\"\")","v":114},{"$f":"IF(ItineraryPrograms!BF24=\"y\",getScoreFactor(\"Program\",CB$2),\"\")","v":""}]
[{"$f":"Itineraries!A25","v":"12-23"},17079.75,{"$f":"getScoreFactor(C$2,itineraryCamps!C26)","v":3000},{"$f":"getScoreFactor(D$2,\"Miles\") *itineraryCamps!D26","v":7600},{"$f":"getScoreFactor(E$2,Itineraries!B25)","v":30},{"$f":"getScoreFactor(F$2,Itineraries!C25)","v":90},{"$f":"getScoreFactor(G$2,Itineraries!E25)","v":100},{"$f":"getScoreFactor(H$2,Itineraries!H25)","v":250},{"$f":"getScoreFactor(I$2,Itineraries!G25)","v":60},{"$f":"getScoreFactor(J$2,Itineraries!J25)","v":50},{"$f":"getScoreFactor(K$2,Itineraries!K25)","v":70},{"$f":"getScoreFactor(L$2,Itineraries!L25)","v":300},{"$f":"IF(INDEX(startingTA,numericItinerary($A25))=$M$2,getScoreFactor(M$2,\"y\"),getScoreFactor(M$2,\"n\"))","v":0},{"$f":"IF(INDEX(endingTA,numericItinerary($A25))=$N$2,getScoreFactor(N$2,\"y\"),getScoreFactor(N$2,\"n\"))","v":0},{"$f":"IF(INDEX(baldyMountainHike,numericItinerary($A25))=\"\",\"\",getPeakScore(O$2))","v":351},{"$f":"IF(INDEX(mountPhillipsHike,numericItinerary($A25))=\"\",\"\",getPeakScore(P$2))","v":""},{"$f":"IF(INDEX(toothOfTimeHike,numericItinerary($A25))=\"\",\"\",getPeakScore(Q$2))","v":137.25},{"$f":"IF(INDEX(inspirationPointHike,numericItinerary($A25))=\"\",\"\",getPeakScore(Q$2))","v":""},{"$f":"IF(INDEX(trailPeakHike,numericItinerary($A25))=\"\",\"\",getPeakScore(S$2))","v":""},{"$f":"IF(INDEX(mountaineeringHike,numericItinerary($A25))=\"\",\"\",getPeakScore(T$2))","v":202.5},{"$f":"IF(areaImportant<>\"y\",\"\",IF(Itineraries!P25<>\"Y\",\"\",getareascore(U$2)))","v":200},{"$f":"IF(areaImportant<>\"y\",\"\",IF(Itineraries!Q25<>\"Y\",\"\",getareascore(V$2)))","v":150},{"$f":"IF(areaImportant<>\"y\",\"\",IF(Itineraries!R25<>\"Y\",\"\",getareascore(W$2)))","v":1000},{"$f":"IF(areaImportant<>\"y\",\"\",IF(Itineraries!S25<>\"Y\",\"\",getareascore(X$2)))","v":""},{"$f":"IF(ItineraryPrograms!C25=\"y\",getScoreFactor(\"Program\",Y$2),\"\")","v":228},{"$f":"IF(ItineraryPrograms!D25=\"y\",getScoreFactor(\"Program\",Z$2),\"\")","v":337.5},{"$f":"IF(ItineraryPrograms!E25=\"y\",getScoreFactor(\"Program\",AA$2),\"\")","v":114},{"$f":"IF(ItineraryPrograms!F25=\"y\",getScoreFactor(\"Program\",AB$2),\"\")","v":282},{"$f":"IF(ItineraryPrograms!G25=\"y\",getScoreFactor(\"Program\",AC$2),\"\")","v":""},{"$f":"IF(ItineraryPrograms!H25=\"y\",getScoreFactor(\"Program\",AD$2),\"\")","v":166.5},{"$f":"IF(ItineraryPrograms!I25=\"y\",getScoreFactor(\"Program\",AE$2),\"\")","v":166.5},{"$f":"IF(ItineraryPrograms!J25=\"y\",getScoreFactor(\"Program\",AF$2),\"\")","v":""},{"$f":"IF(ItineraryPrograms!K25=\"y\",getScoreFactor(\"Program\",AG$2),\"\")","v":""},{"$f":"IF(ItineraryPrograms!L25=\"y\",getScoreFactor(\"Program\",AH$2),\"\")","v":""},{"$f":"IF(ItineraryPrograms!M25=\"y\",getScoreFactor(\"Program\",AI$2),\"\")","v":109.5},{"$f":"IF(ItineraryPrograms!N25=\"y\",getScoreFactor(\"Program\",AJ$2),\"\")","v":109.5},{"$f":"IF(ItineraryPrograms!O25=\"y\",getScoreFactor(\"Program\",AK$2),\"\")","v":111},{"$f":"IF(ItineraryPrograms!P25=\"y\",getScoreFactor(\"Program\",AL$2),\"\")","v":""},{"$f":"IF(ItineraryPrograms!Q25=\"y\",getScoreFactor(\"Program\",AM$2),\"\")","v":""},{"$f":"IF(ItineraryPrograms!R25=\"y\",getScoreFactor(\"Program\",AN$2),\"\")","v":""},{"$f":"IF(ItineraryPrograms!S25=\"y\",getScoreFactor(\"Program\",AO$2),\"\")","v":""},{"$f":"IF(ItineraryPrograms!T25=\"y\",getScoreFactor(\"Program\",AP$2),\"\")","v":""},{"$f":"IF(ItineraryPrograms!U25=\"y\",getScoreFactor(\"Program\",AQ$2),\"\")","v":93},{"$f":"IF(ItineraryPrograms!V25=\"y\",getScoreFactor(\"Program\",AR$2),\"\")","v":""},{"$f":"IF(ItineraryPrograms!W25=\"y\",getScoreFactor(\"Program\",AS$2),\"\")","v":114},{"$f":"IF(ItineraryPrograms!X25=\"y\",getScoreFactor(\"Program\",AT$2),\"\")","v":""},{"$f":"IF(ItineraryPrograms!Y25=\"y\",getScoreFactor(\"Program\",AU$2),\"\")","v":""},{"$f":"IF(ItineraryPrograms!Z25=\"y\",getScoreFactor(\"Program\",AV$2),\"\")","v":""},{"$f":"IF(ItineraryPrograms!AA25=\"y\",getScoreFactor(\"Program\",AW$2),\"\")","v":""},{"$f":"IF(ItineraryPrograms!AB25=\"y\",getScoreFactor(\"Program\",AX$2),\"\")","v":""},{"$f":"IF(ItineraryPrograms!AC25=\"y\",getScoreFactor(\"Program\",AY$2),\"\")","v":150},{"$f":"IF(ItineraryPrograms!AD25=\"y\",getScoreFactor(\"Program\",AZ$2),\"\")","v":175.5},{"$f":"IF(ItineraryPrograms!AE25=\"y\",getScoreFactor(\"Program\",BA$2),\"\")","v":""},{"$f":"IF(ItineraryPrograms!AF25=\"y\",getScoreFactor(\"Program\",BB$2),\"\")","v":""},{"$f":"IF(ItineraryPrograms!AG25=\"y\",getScoreFactor(\"Program\",BC$2),\"\")","v":202.5},{"$f":"IF(ItineraryPrograms!AH25=\"y\",getScoreFactor(\"Program\",BD$2),\"\")","v":91.5},{"$f":"IF(ItineraryPrograms!AI25=\"y\",getScoreFactor(\"Program\",BE$2),\"\")","v":""},{"$f":"IF(ItineraryPrograms!AJ25=\"y\",getScoreFactor(\"Program\",BF$2),\"\")","v":""},{"$f":"IF(ItineraryPrograms!AK25=\"y\",getScoreFactor(\"Program\",BG$2),\"\")","v":""},{"$f":"IF(ItineraryPrograms!AL25=\"y\",getScoreFactor(\"Program\",BH$2),\"\")","v":""},{"$f":"IF(ItineraryPrograms!AM25=\"y\",getScoreFactor(\"Program\",BI$2),\"\")","v":235.5},{"$f":"IF(ItineraryPrograms!AN25=\"y\",getScoreFactor(\"Program\",BJ$2),\"\")","v":""},{"$f":"IF(ItineraryPrograms!AO25=\"y\",getScoreFactor(\"Program\",BK$2),\"\")","v":181.5},{"$f":"IF(ItineraryPrograms!AP25=\"y\",getScoreFactor(\"Program\",BL$2),\"\")","v":220.5},{"$f":"IF(ItineraryPrograms!AQ25=\"y\",getScoreFactor(\"Program\",BM$2),\"\")","v":""},{"$f":"IF(ItineraryPrograms!AR25=\"y\",getScoreFactor(\"Program\",BN$2),\"\")","v":""},{"$f":"IF(ItineraryPrograms!AS25=\"y\",getScoreFactor(\"Program\",BO$2),\"\")","v":""},{"$f":"IF(ItineraryPrograms!AT25=\"y\",getScoreFactor(\"Program\",BP$2),\"\")","v":193.5},{"$f":"IF(ItineraryPrograms!AU25=\"y\",getScoreFactor(\"Program\",BQ$2),\"\")","v":""},{"$f":"IF(ItineraryPrograms!AV25=\"y\",getScoreFactor(\"Program\",BR$2),\"\")","v":""},{"$f":"IF(ItineraryPrograms!AW25=\"y\",getScoreFactor(\"Program\",BS$2),\"\")","v":""},{"$f":"IF(ItineraryPrograms!AX25=\"y\",getScoreFactor(\"Program\",BT$2),\"\")","v":""},{"$f":"IF(ItineraryPrograms!AY25=\"y\",getScoreFactor(\"Program\",BU$2),\"\")","v":207},{"$f":"IF(ItineraryPrograms!AZ25=\"y\",getScoreFactor(\"Program\",BV$2),\"\")","v":""},{"$f":"IF(ItineraryPrograms!BA25=\"y\",getScoreFactor(\"Program\",BW$2),\"\")","v":""},{"$f":"IF(ItineraryPrograms!BB25=\"y\",getScoreFactor(\"Program\",BX$2),\"\")","v":""},{"$f":"IF(ItineraryPrograms!BC25=\"y\",getScoreFactor(\"Program\",BY$2),\"\")","v":133.5},{"$f":"IF(ItineraryPrograms!BD25=\"y\",getScoreFactor(\"Program\",BZ$2),\"\")","v":""},{"$f":"IF(ItineraryPrograms!BE25=\"y\",getScoreFactor(\"Program\",CA$2),\"\")","v":114},{"$f":"IF(ItineraryPrograms!BF25=\"y\",getScoreFactor(\"Program\",CB$2),\"\")","v":""}]
[{"$f":"Itineraries!A26","v":"12-24"},16854.25,{"$f":"getScoreFactor(C$2,itineraryCamps!C27)","v":3000},{"$f":"getScoreFactor(D$2,\"Miles\") *itineraryCamps!D27","v":7700},{"$f":"getScoreFactor(E$2,Itineraries!B26)","v":40},{"$f":"getScoreFactor(F$2,Itineraries!C26)","v":60},{"$f":"getScoreFactor(G$2,Itineraries!E26)","v":75},{"$f":"getScoreFactor(H$2,Itineraries!H26)","v":200},{"$f":"getScoreFactor(I$2,Itineraries!G26)","v":60},{"$f":"getScoreFactor(J$2,Itineraries!J26)","v":50},{"$f":"getScoreFactor(K$2,Itineraries!K26)","v":60},{"$f":"getScoreFactor(L$2,Itineraries!L26)","v":300},{"$f":"IF(INDEX(startingTA,numericItinerary($A26))=$M$2,getScoreFactor(M$2,\"y\"),getScoreFactor(M$2,\"n\"))","v":0},{"$f":"IF(INDEX(endingTA,numericItinerary($A26))=$N$2,getScoreFactor(N$2,\"y\"),getScoreFactor(N$2,\"n\"))","v":500},{"$f":"IF(INDEX(baldyMountainHike,numericItinerary($A26))=\"\",\"\",getPeakScore(O$2))","v":351},{"$f":"IF(INDEX(mountPhillipsHike,numericItinerary($A26))=\"\",\"\",getPeakScore(P$2))","v":""},{"$f":"IF(INDEX(toothOfTimeHike,numericItinerary($A26))=\"\",\"\",getPeakScore(Q$2))","v":137.25},{"$f":"IF(INDEX(inspirationPointHike,numericItinerary($A26))=\"\",\"\",getPeakScore(Q$2))","v":""},{"$f":"IF(INDEX(trailPeakHike,numericItinerary($A26))=\"\",\"\",getPeakScore(S$2))","v":""},{"$f":"IF(INDEX(mountaineeringHike,numericItinerary($A26))=\"\",\"\",getPeakScore(T$2))","v":202.5},{"$f":"IF(areaImportant<>\"y\",\"\",IF(Itineraries!P26<>\"Y\",\"\",getareascore(U$2)))","v":""},{"$f":"IF(areaImportant<>\"y\",\"\",IF(Itineraries!Q26<>\"Y\",\"\",getareascore(V$2)))","v":150},{"$f":"IF(areaImportant<>\"y\",\"\",IF(Itineraries!R26<>\"Y\",\"\",getareascore(W$2)))","v":1000},{"$f":"IF(areaImportant<>\"y\",\"\",IF(Itineraries!S26<>\"Y\",\"\",getareascore(X$2)))","v":""},{"$f":"IF(ItineraryPrograms!C26=\"y\",getScoreFactor(\"Program\",Y$2),\"\")","v":228},{"$f":"IF(ItineraryPrograms!D26=\"y\",getScoreFactor(\"Program\",Z$2),\"\")","v":""},{"$f":"IF(ItineraryPrograms!E26=\"y\",getScoreFactor(\"Program\",AA$2),\"\")","v":""},{"$f":"IF(ItineraryPrograms!F26=\"y\",getScoreFactor(\"Program\",AB$2),\"\")","v":282},{"$f":"IF(ItineraryPrograms!G26=\"y\",getScoreFactor(\"Program\",AC$2),\"\")","v":""},{"$f":"IF(ItineraryPrograms!H26=\"y\",getScoreFactor(\"Program\",AD$2),\"\")","v":166.5},{"$f":"IF(ItineraryPrograms!I26=\"y\",getScoreFactor(\"Program\",AE$2),\"\")","v":166.5},{"$f":"IF(ItineraryPrograms!J26=\"y\",getScoreFactor(\"Program\",AF$2),\"\")","v":126},{"$f":"IF(ItineraryPrograms!K26=\"y\",getScoreFactor(\"Program\",AG$2),\"\")","v":""},{"$f":"IF(ItineraryPrograms!L26=\"y\",getScoreFactor(\"Program\",AH$2),\"\")","v":""},{"$f":"IF(ItineraryPrograms!M26=\"y\",getScoreFactor(\"Program\",AI$2),\"\")","v":109.5},{"$f":"IF(ItineraryPrograms!N26=\"y\",getScoreFactor(\"Program\",AJ$2),\"\")","v":109.5},{"$f":"IF(ItineraryPrograms!O26=\"y\",getScoreFactor(\"Program\",AK$2),\"\")","v":""},{"$f":"IF(ItineraryPrograms!P26=\"y\",getScoreFactor(\"Program\",AL$2),\"\")","v":""},{"$f":"IF(ItineraryPrograms!Q26=\"y\",getScoreFactor(\"Program\",AM$2),\"\")","v":123},{"$f":"IF(ItineraryPrograms!R26=\"y\",getScoreFactor(\"Program\",AN$2),\"\")","v":""},{"$f":"IF(ItineraryPrograms!S26=\"y\",getScoreFactor(\"Program\",AO$2),\"\")","v":""},{"$f":"IF(ItineraryPrograms!T26=\"y\",getScoreFactor(\"Program\",AP$2),\"\")","v":""},{"$f":"IF(ItineraryPrograms!U26=\"y\",getScoreFactor(\"Program\",AQ$2),\"\")","v":93},{"$f":"IF(ItineraryPrograms!V26=\"y\",getScoreFactor(\"Program\",AR$2),\"\")","v":""},{"$f":"IF(ItineraryPrograms!W26=\"y\",getScoreFactor(\"Program\",AS$2),\"\")","v":114},{"$f":"IF(ItineraryPrograms!X26=\"y\",getScoreFactor(\"Program\",AT$2),\"\")","v":129},{"$f":"IF(ItineraryPrograms!Y26=\"y\",getScoreFactor(\"Program\",AU$2),\"\")","v":103.5},{"$f":"IF(ItineraryPrograms!Z26=\"y\",getScoreFactor(\"Program\",AV$2),\"\")","v":""},{"$f":"IF(ItineraryPrograms!AA26=\"y\",getScoreFactor(\"Program\",AW$2),\"\")","v":""},{"$f":"IF(ItineraryPrograms!AB26=\"y\",getScoreFactor(\"Program\",AX$2),\"\")","v":""},{"$f":"IF(ItineraryPrograms!AC26=\"y\",getScoreFactor(\"Program\",AY$2),\"\")","v":150},{"$f":"IF(ItineraryPrograms!AD26=\"y\",getScoreFactor(\"Program\",AZ$2),\"\")","v":175.5},{"$f":"IF(ItineraryPrograms!AE26=\"y\",getScoreFactor(\"Program\",BA$2),\"\")","v":""},{"$f":"IF(ItineraryPrograms!AF26=\"y\",getScoreFactor(\"Program\",BB$2),\"\")","v":""},{"$f":"IF(ItineraryPrograms!AG26=\"y\",getScoreFactor(\"Program\",BC$2),\"\")","v":202.5},{"$f":"IF(ItineraryPrograms!AH26=\"y\",getScoreFactor(\"Program\",BD$2),\"\")","v":91.5},{"$f":"IF(ItineraryPrograms!AI26=\"y\",getScoreFactor(\"Program\",BE$2),\"\")","v":""},{"$f":"IF(ItineraryPrograms!AJ26=\"y\",getScoreFactor(\"Program\",BF$2),\"\")","v":""},{"$f":"IF(ItineraryPrograms!AK26=\"y\",getScoreFactor(\"Program\",BG$2),\"\")","v":""},{"$f":"IF(ItineraryPrograms!AL26=\"y\",getScoreFactor(\"Program\",BH$2),\"\")","v":""},{"$f":"IF(ItineraryPrograms!AM26=\"y\",getScoreFactor(\"Program\",BI$2),\"\")","v":""},{"$f":"IF(ItineraryPrograms!AN26=\"y\",getScoreFactor(\"Program\",BJ$2),\"\")","v":""},{"$f":"IF(ItineraryPrograms!AO26=\"y\",getScoreFactor(\"Program\",BK$2),\"\")","v":""},{"$f":"IF(ItineraryPrograms!AP26=\"y\",getScoreFactor(\"Program\",BL$2),\"\")","v":""},{"$f":"IF(ItineraryPrograms!AQ26=\"y\",getScoreFactor(\"Program\",BM$2),\"\")","v":""},{"$f":"IF(ItineraryPrograms!AR26=\"y\",getScoreFactor(\"Program\",BN$2),\"\")","v":255},{"$f":"IF(ItineraryPrograms!AS26=\"y\",getScoreFactor(\"Program\",BO$2),\"\")","v":""},{"$f":"IF(ItineraryPrograms!AT26=\"y\",getScoreFactor(\"Program\",BP$2),\"\")","v":""},{"$f":"IF(ItineraryPrograms!AU26=\"y\",getScoreFactor(\"Program\",BQ$2),\"\")","v":""},{"$f":"IF(ItineraryPrograms!AV26=\"y\",getScoreFactor(\"Program\",BR$2),\"\")","v":136.5},{"$f":"IF(ItineraryPrograms!AW26=\"y\",getScoreFactor(\"Program\",BS$2),\"\")","v":""},{"$f":"IF(ItineraryPrograms!AX26=\"y\",getScoreFactor(\"Program\",BT$2),\"\")","v":""},{"$f":"IF(ItineraryPrograms!AY26=\"y\",getScoreFactor(\"Program\",BU$2),\"\")","v":207},{"$f":"IF(ItineraryPrograms!AZ26=\"y\",getScoreFactor(\"Program\",BV$2),\"\")","v":""},{"$f":"IF(ItineraryPrograms!BA26=\"y\",getScoreFactor(\"Program\",BW$2),\"\")","v":""},{"$f":"IF(ItineraryPrograms!BB26=\"y\",getScoreFactor(\"Program\",BX$2),\"\")","v":235.5},{"$f":"IF(ItineraryPrograms!BC26=\"y\",getScoreFactor(\"Program\",BY$2),\"\")","v":133.5},{"$f":"IF(ItineraryPrograms!BD26=\"y\",getScoreFactor(\"Program\",BZ$2),\"\")","v":285},{"$f":"IF(ItineraryPrograms!BE26=\"y\",getScoreFactor(\"Program\",CA$2),\"\")","v":114},{"$f":"IF(ItineraryPrograms!BF26=\"y\",getScoreFactor(\"Program\",CB$2),\"\")","v":""}]
[]
[null,null,{"$f":"\"Distances \"  & MAX(D3:D26)/mileageFactor & \" to \" & MIN(D3:D26)/mileageFactor& \" miles\"","v":"Distances 78 to 46 miles"}]
[]
["Custom Properties"]
["revision","2025_1-0"]
["trekYear","2025"]
["nDays",12]
["nItineraries",24]
["itineraryNoPrefix","12-"]

{"sheet":"Itineraries","index":14,"n_rows":29,"n_cols":19,"rows_kept":29,"cut":false,"hidden":true,"merged":[[0,12,0,14],[0,15,0,18],[27,0,28,0]]}
[null,null,null,null,null,null,null,null,null,null,null,null,"Maps",null,null,"Region"]
["Itinerary","Days Food from Base","Max Days Food","Staffed Camps","Trail Camps","Layovers","Total Camps","Dry Camps","Min Altitude","Max Altitude","Total Gain","Average Daily Change","South","North","Valle Vidal","South","Central","North","Valle Vidal"]
[{"$f":"itineraryCamps!A4","v":"12-1"},{"$f":"itineraryCamps!DL4","v":3},{"$f":"itineraryCamps!DM4","v":3},{"$f":"countcamps(itineraryStaff,numericItinerary($A3))","v":5},{"$f":"countcamps(itineraryTrail,numericItinerary($A3))","v":5},{"$f":"countcamps(itineraryLayover,numericItinerary($A3))","v":1},{"$f":"D3+E3-F3","v":9},{"$f":"countcamps(itineraryDry,numericItinerary($A3))","v":1},{"$f":"MIN(itineraryCamps!AK4:AT4)","v":7217},{"$f":"MAX(itineraryCamps!AK4:AT4)","v":9409},{"$f":"J3-I3","v":2192},{"$f":"AVERAGE(itineraryCamps!AU4:BC4)","v":547.88888888888891},{"$f":"contains(M$2,numericItinerary($A3),itineraryMaps)","v":"Y"},{"$f":"contains(N$2,numericItinerary($A3),itineraryMaps)","v":""},{"$f":"contains(O$2,numericItinerary($A3),itineraryMaps)","v":""},{"$f":"contains(P$2,numericItinerary($A3),itineraryCountry)","v":"Y"},{"$f":"contains(Q$2,numericItinerary($A3),itineraryCountry)","v":""},{"$f":"contains(R$2,numericItinerary($A3),itineraryCountry)","v":""},{"$f":"contains(S$2,numericItinerary($A3),itineraryCountry)","v":""}]
[{"$f":"itineraryCamps!A5","v":"12-2"},{"$f":"itineraryCamps!DL5","v":3},{"$f":"itineraryCamps!DM5","v":3},{"$f":"countcamps(itineraryStaff,numericItinerary($A4))","v":3},{"$f":"countcamps(itineraryTrail,numericItinerary($A4))","v":7},{"$f":"countcamps(itineraryLayover,numericItinerary($A4))","v":1},{"$f":"D4+E4-F4","v":9},{"$f":"countcamps(itineraryDry,numericItinerary($A4))","v":2},{"$f":"MIN(itineraryCamps!AK5:AT5)","v":7070},{"$f":"MAX(itineraryCamps!AK5:AT5)","v":9373},{"$f":"J4-I4","v":2303},{"$f":"AVERAGE(itineraryCamps!AU5:BC5)","v":426.55555555555554},{"$f":"contains(M$2,numericItinerary($A4),itineraryMaps)","v":"Y"},{"$f":"contains(N$2,numericItinerary($A4),itineraryMaps)","v":"Y"},{"$f":"contains(O$2,numericItinerary($A4),itineraryMaps)","v":""},{"$f":"contains(P$2,numericItinerary($A4),itineraryCountry)","v":""},{"$f":"contains(Q$2,numericItinerary($A4),itineraryCountry)","v":"Y"},{"$f":"contains(R$2,numericItinerary($A4),itineraryCountry)","v":"Y"},{"$f":"contains(S$2,numericItinerary($A4),itineraryCountry)","v":""}]
[{"$f":"itineraryCamps!A6","v":"12-3"},{"$f":"itineraryCamps!DL6","v":3},{"$f":"itineraryCamps!DM6","v":3},{"$f":"countcamps(itineraryStaff,numericItinerary($A5))","v":5},{"$f":"countcamps(itineraryTrail,numericItinerary($A5))","v":5},{"$f":"countcamps(itineraryLayover,numericItinerary($A5))","v":0},10,{"$f":"countcamps(itineraryDry,numericItinerary($A5))","v":0},{"$f":"MIN(itineraryCamps!AK6:AT6)","v":7070},{"$f":"MAX(itineraryCamps!AK6:AT6)","v":9118},2048,{"$f":"AVERAGE(itineraryCamps!AU6:BC6)","v":673.44444444444446},{"$f":"contains(M$2,numericItinerary($A5),itineraryMaps)","v":""},{"$f":"contains(N$2,numericItinerary($A5),itineraryMaps)","v":"Y"},{"$f":"contains(O$2,numericItinerary($A5),itineraryMaps)","v":""},{"$f":"contains(P$2,numericItinerary($A5),itineraryCountry)","v":""},{"$f":"contains(Q$2,numericItinerary($A5),itineraryCountry)","v":""},{"$f":"contains(R$2,numericItinerary($A5),itineraryCountry)","v":"Y"},{"$f":"contains(S$2,numericItinerary($A5),itineraryCountry)","v":"Y"}]
[{"$f":"itineraryCamps!A7","v":"12-4"},{"$f":"itineraryCamps!DL7","v":2},{"$f":"itineraryCamps!DM7","v":4},{"$f":"countcamps(itineraryStaff,numericItinerary($A6))","v":5},{"$f":"countcamps(itineraryTrail,numericItinerary($A6))","v":5},{"$f":"countcamps(itineraryLayover,numericItinerary($A6))","v":1},9,{"$f":"countcamps(itineraryDry,numericItinerary($A6))","v":0},{"$f":"MIN(itineraryCamps!AK7:AT7)","v":7150},{"$f":"MAX(itineraryCamps!AK7:AT7)","v":9851},2701,{"$f":"AVERAGE(itineraryCamps!AU7:BC7)","v":643.11111111111109},{"$f":"contains(M$2,numericItinerary($A6),itineraryMaps)","v":""},{"$f":"contains(N$2,numericItinerary($A6),itineraryMaps)","v":"Y"},{"$f":"contains(O$2,numericItinerary($A6),itineraryMaps)","v":""},{"$f":"contains(P$2,numericItinerary($A6),itineraryCountry)","v":""},{"$f":"contains(Q$2,numericItinerary($A6),itineraryCountry)","v":""},{"$f":"contains(R$2,numericItinerary($A6),itineraryCountry)","v":"Y"},{"$f":"contains(S$2,numericItinerary($A6),itineraryCountry)","v":""}]
[{"$f":"itineraryCamps!A8","v":"12-5"},{"$f":"itineraryCamps!DL8","v":4},{"$f":"itineraryCamps!DM8","v":4},{"$f":"countcamps(itineraryStaff,numericItinerary($A7))","v":4},{"$f":"countcamps(itineraryTrail,numericItinerary($A7))","v":6},{"$f":"countcamps(itineraryLayover,numericItinerary($A7))","v":0},10,{"$f":"countcamps(itineraryDry,numericItinerary($A7))","v":1},{"$f":"MIN(itineraryCamps!AK8:AT8)","v":7217},{"$f":"MAX(itineraryCamps!AK8:AT8)","v":10509},3292,{"$f":"AVERAGE(itineraryCamps!AU8:BC8)","v":708.22222222222217},{"$f":"contains(M$2,numericItinerary($A7),itineraryMaps)","v":"Y"},{"$f":"contains(N$2,numericItinerary($A7),itineraryMaps)","v":""},{"$f":"contains(O$2,numericItinerary($A7),itineraryMaps)","v":""},{"$f":"contains(P$2,numericItinerary($A7),itineraryCountry)","v":"Y"},{"$f":"contains(Q$2,numericItinerary($A7),itineraryCountry)","v":"Y"},{"$f":"contains(R$2,numericItinerary($A7),itineraryCountry)","v":""},{"$f":"contains(S$2,numericItinerary($A7),itineraryCountry)","v":""}]
[{"$f":"itineraryCamps!A9","v":"12-6"},{"$f":"itineraryCamps!DL9","v":1},{"$f":"itineraryCamps!DM9","v":3},{"$f":"countcamps(itineraryStaff,numericItinerary($A8))","v":5},{"$f":"countcamps(itineraryTrail,numericItinerary($A8))","v":5},{"$f":"countcamps(itineraryLayover,numericItinerary($A8))","v":2},8,{"$f":"countcamps(itineraryDry,numericItinerary($A8))","v":2},{"$f":"MIN(itineraryCamps!AK9:AT9)","v":7373},{"$f":"MAX(itineraryCamps!AK9:AT9)","v":9373},2000,{"$f":"AVERAGE(itineraryCamps!AU9:BC9)","v":434.55555555555554},{"$f":"contains(M$2,numericItinerary($A8),itineraryMaps)","v":"Y"},{"$f":"contains(N$2,numericItinerary($A8),itineraryMaps)","v":"Y"},{"$f":"contains(O$2,numericItinerary($A8),itineraryMaps)","v":""},{"$f":"contains(P$2,numericItinerary($A8),itineraryCountry)","v":"Y"},{"$f":"contains(Q$2,numericItinerary($A8),itineraryCountry)","v":"Y"},{"$f":"contains(R$2,numericItinerary($A8),itineraryCountry)","v":"Y"},{"$f":"contains(S$2,numericItinerary($A8),itineraryCountry)","v":""}]
[{"$f":"itineraryCamps!A10","v":"12-7"},{"$f":"itineraryCamps!DL10","v":1},{"$f":"itineraryCamps!DM10","v":3},{"$f":"countcamps(itineraryStaff,numericItinerary($A9))","v":4},{"$f":"countcamps(itineraryTrail,numericItinerary($A9))","v":6},{"$f":"countcamps(itineraryLayover,numericItinerary($A9))","v":1},9,{"$f":"countcamps(itineraryDry,numericItinerary($A9))","v":1},{"$f":"MIN(itineraryCamps!AK10:AT10)","v":7382},{"$f":"MAX(itineraryCamps!AK10:AT10)","v":10530},3148,{"$f":"AVERAGE(itineraryCamps!AU10:BC10)","v":617.47955555555563},{"$f":"contains(M$2,numericItinerary($A9),itineraryMaps)","v":""},{"$f":"contains(N$2,numericItinerary($A9),itineraryMaps)","v":"Y"},{"$f":"contains(O$2,numericItinerary($A9),itineraryMaps)","v":""},{"$f":"contains(P$2,numericItinerary($A9),itineraryCountry)","v":""},{"$f":"contains(Q$2,numericItinerary($A9),itineraryCountry)","v":""},{"$f":"contains(R$2,numericItinerary($A9),itineraryCountry)","v":"Y"},{"$f":"contains(S$2,numericItinerary($A9),itineraryCountry)","v":"Y"}]
[{"$f":"itineraryCamps!A11","v":"12-8"},{"$f":"itineraryCamps!DL11","v":3},{"$f":"itineraryCamps!DM11","v":3},{"$f":"countcamps(itineraryStaff,numericItinerary($A10))","v":3},{"$f":"countcamps(itineraryTrail,numericItinerary($A10))","v":7},{"$f":"countcamps(itineraryLayover,numericItinerary($A10))","v":1},9,{"$f":"countcamps(itineraryDry,numericItinerary($A10))","v":1},{"$f":"MIN(itineraryCamps!AK11:AT11)","v":6979},{"$f":"MAX(itineraryCamps!AK11:AT11)","v":9483.43},2504.4300000000003,{"$f":"AVERAGE(itineraryCamps!AU11:BC11)","v":578.42888888888899},{"$f":"contains(M$2,numericItinerary($A10),itineraryMaps)","v":"Y"},{"$f":"contains(N$2,numericItinerary($A10),itineraryMaps)","v":"Y"},{"$f":"contains(O$2,numericItinerary($A10),itineraryMaps)","v":""},{"$f":"contains(P$2,numericItinerary($A10),itineraryCountry)","v":""},{"$f":"contains(Q$2,numericItinerary($A10),itineraryCountry)","v":"Y"},{"$f":"contains(R$2,numericItinerary($A10),itineraryCountry)","v":"Y"},{"$f":"contains(S$2,numericItinerary($A10),itineraryCountry)","v":""}]
[{"$f":"itineraryCamps!A12","v":"12-9"},{"$f":"itineraryCamps!DL12","v":2},{"$f":"itineraryCamps!DM12","v":5},{"$f":"countcamps(itineraryStaff,numericItinerary($A11))","v":6},{"$f":"countcamps(itineraryTrail,numericItinerary($A11))","v":4},{"$f":"countcamps(itineraryLayover,numericItinerary($A11))","v":0},10,{"$f":"countcamps(itineraryDry,numericItinerary($A11))","v":1},{"$f":"MIN(itineraryCamps!AK12:AT12)","v":7150},{"$f":"MAX(itineraryCamps!AK12:AT12)","v":8898},1748,{"$f":"AVERAGE(itineraryCamps!AU12:BC12)","v":712.44444444444446},{"$f":"contains(M$2,numericItinerary($A11),itineraryMaps)","v":"Y"},{"$f":"contains(N$2,numericItinerary($A11),itineraryMaps)","v":"Y"},{"$f":"contains(O$2,numericItinerary($A11),itineraryMaps)","v":""},{"$f":"contains(P$2,numericItinerary($A11),itineraryCountry)","v":""},{"$f":"contains(Q$2,numericItinerary($A11),itineraryCountry)","v":"Y"},{"$f":"contains(R$2,numericItinerary($A11),itineraryCountry)","v":"Y"},{"$f":"contains(S$2,numericItinerary($A11),itineraryCountry)","v":""}]
[{"$f":"itineraryCamps!A13","v":"12-10"},{"$f":"itineraryCamps!DL13","v":3},{"$f":"itineraryCamps!DM13","v":3},{"$f":"countcamps(itineraryStaff,numericItinerary($A12))","v":4},{"$f":"countcamps(itineraryTrail,numericItinerary($A12))","v":6},{"$f":"countcamps(itineraryLayover,numericItinerary($A12))","v":1},9,{"$f":"countcamps(itineraryDry,numericItinerary($A12))","v":0},{"$f":"MIN(itineraryCamps!AK13:AT13)","v":7150},{"$f":"MAX(itineraryCamps!AK13:AT13)","v":9373},2223,{"$f":"AVERAGE(itineraryCamps!AU13:BC13)","v":584.22222222222217},{"$f":"contains(M$2,numericItinerary($A12),itineraryMaps)","v":"Y"},{"$f":"contains(N$2,numericItinerary($A12),itineraryMaps)","v":"Y"},{"$f":"contains(O$2,numericItinerary($A12),itineraryMaps)","v":""},{"$f":"contains(P$2,numericItinerary($A12),itineraryCountry)","v":""},{"$f":"contains(Q$2,numericItinerary($A12),itineraryCountry)","v":""},{"$f":"contains(R$2,numericItinerary($A12),itineraryCountry)","v":"Y"},{"$f":"contains(S$2,numericItinerary($A12),itineraryCountry)","v":""}]
[{"$f":"itineraryCamps!A14","v":"12-11"},{"$f":"itineraryCamps!DL14","v":4},{"$f":"itineraryCamps!DM14","v":4},{"$f":"countcamps(itineraryStaff,numericItinerary($A13))","v":6},{"$f":"countcamps(itineraryTrail,numericItinerary($A13))","v":4},{"$f":"countcamps(itineraryLayover,numericItinerary($A13))","v":1},9,{"$f":"countcamps(itineraryDry,numericItinerary($A13))","v":2},{"$f":"MIN(itineraryCamps!AK14:AT14)","v":7217},{"$f":"MAX(itineraryCamps!AK14:AT14)","v":10509},3292,{"$f":"AVERAGE(itineraryCamps!AU14:BC14)","v":788.33333333333337},{"$f":"contains(M$2,numericItinerary($A13),itineraryMaps)","v":"Y"},{"$f":"contains(N$2,numericItinerary($A13),itineraryMaps)","v":""},{"$f":"contains(O$2,numericItinerary($A13),itineraryMaps)","v":""},{"$f":"contains(P$2,numericItinerary($A13),itineraryCountry)","v":"Y"},{"$f":"contains(Q$2,numericItinerary($A13),itineraryCountry)","v":"Y"},{"$f":"contains(R$2,numericItinerary($A13),itineraryCountry)","v":""},{"$f":"contains(S$2,numericItinerary($A13),itineraryCountry)","v":""}]
[{"$f":"itineraryCamps!A15","v":"12-12"},{"$f":"itineraryCamps!DL15","v":3},{"$f":"itineraryCamps!DM15","v":3},{"$f":"countcamps(itineraryStaff,numericItinerary($A14))","v":4},{"$f":"countcamps(itineraryTrail,numericItinerary($A14))","v":6},{"$f":"countcamps(itineraryLayover,numericItinerary($A14))","v":1},9,{"$f":"countcamps(itineraryDry,numericItinerary($A14))","v":3},{"$f":"MIN(itineraryCamps!AK15:AT15)","v":7359},{"$f":"MAX(itineraryCamps!AK15:AT15)","v":11070},3711,{"$f":"AVERAGE(itineraryCamps!AU15:BC15)","v":839},{"$f":"contains(M$2,numericItinerary($A14),itineraryMaps)","v":"Y"},{"$f":"contains(N$2,numericItinerary($A14),itineraryMaps)","v":""},{"$f":"contains(O$2,numericItinerary($A14),itineraryMaps)","v":""},{"$f":"contains(P$2,numericItinerary($A14),itineraryCountry)","v":"Y"},{"$f":"contains(Q$2,numericItinerary($A14),itineraryCountry)","v":"Y"},{"$f":"contains(R$2,numericItinerary($A14),itineraryCountry)","v":""},{"$f":"contains(S$2,numericItinerary($A14),itineraryCountry)","v":""}]
[{"$f":"itineraryCamps!A16","v":"12-13"},{"$f":"itineraryCamps!DL16","v":2},{"$f":"itineraryCamps!DM16","v":5},{"$f":"countcamps(itineraryStaff,numericItinerary($A15))","v":5},{"$f":"countcamps(itineraryTrail,numericItinerary($A15))","v":5},{"$f":"countcamps(itineraryLayover,numericItinerary($A15))","v":1},9,{"$f":"countcamps(itineraryDry,numericItinerary($A15))","v":3},{"$f":"MIN(itineraryCamps!AK16:AT16)","v":7385},{"$f":"MAX(itineraryCamps!AK16:AT16)","v":10509},3124,{"$f":"AVERAGE(itineraryCamps!AU16:BC16)","v":814.22222222222217},{"$f":"contains(M$2,numericItinerary($A15),itineraryMaps)","v":"Y"},{"$f":"contains(N$2,numericItinerary($A15),itineraryMaps)","v":""},{"$f":"contains(O$2,numericItinerary($A15),itineraryMaps)","v":""},{"$f":"contains(P$2,numericItinerary($A15),itineraryCountry)","v":"Y"},{"$f":"contains(Q$2,numericItinerary($A15),itineraryCountry)","v":"Y"},{"$f":"contains(R$2,numericItinerary($A15),itineraryCountry)","v":""},{"$f":"contains(S$2,numericItinerary($A15),itineraryCountry)","v":""}]
[{"$f":"itineraryCamps!A17","v":"12-14"},{"$f":"itineraryCamps!DL17","v":2},{"$f":"itineraryCamps!DM17","v":4},{"$f":"countcamps(itineraryStaff,numericItinerary($A16))","v":6},{"$f":"countcamps(itineraryTrail,numericItinerary($A16))","v":4},{"$f":"countcamps(itineraryLayover,numericItinerary($A16))","v":0},10,{"$f":"countcamps(itineraryDry,numericItinerary($A16))","v":1},{"$f":"MIN(itineraryCamps!AK17:AT17)","v":7232},{"$f":"MAX(itineraryCamps!AK17:AT17)","v":8571},1339,{"$f":"AVERAGE(itineraryCamps!AU17:BC17)","v":408.44444444444446},{"$f":"contains(M$2,numericItinerary($A16),itineraryMaps)","v":"Y"},{"$f":"contains(N$2,numericItinerary($A16),itineraryMaps)","v":"Y"},{"$f":"contains(O$2,numericItinerary($A16),itineraryMaps)","v":""},{"$f":"contains(P$2,numericItinerary($A16),itineraryCountry)","v":""},{"$f":"contains(Q$2,numericItinerary($A16),itineraryCountry)","v":"Y"},{"$f":"contains(R$2,numericItinerary($A16),itineraryCountry)","v":"Y"},{"$f":"contains(S$2,numericItinerary($A16),itineraryCountry)","v":"Y"}]
[{"$f":"itineraryCamps!A18","v":"12-15"},{"$f":"itineraryCamps!DL18","v":1},{"$f":"itineraryCamps!DM18","v":3},{"$f":"countcamps(itineraryStaff,numericItinerary($A17))","v":6},{"$f":"countcamps(itineraryTrail,numericItinerary($A17))","v":4},{"$f":"countcamps(itineraryLayover,numericItinerary($A17))","v":1},9,{"$f":"countcamps(itineraryDry,numericItinerary($A17))","v":2},{"$f":"MIN(itineraryCamps!AK18:AT18)","v":7469},{"$f":"MAX(itineraryCamps!AK18:AT18)","v":11070},3601,{"$f":"AVERAGE(itineraryCamps!AU18:BC18)","v":815.44444444444446},{"$f":"contains(M$2,numericItinerary($A17),itineraryMaps)","v":"Y"},{"$f":"contains(N$2,numericItinerary($A17),itineraryMaps)","v":""},{"$f":"contains(O$2,numericItinerary($A17),itineraryMaps)","v":""},{"$f":"contains(P$2,numericItinerary($A17),itineraryCountry)","v":"Y"},{"$f":"contains(Q$2,numericItinerary($A17),itineraryCountry)","v":"Y"},{"$f":"contains(R$2,numericItinerary($A17),itineraryCountry)","v":""},{"$f":"contains(S$2,numericItinerary($A17),itineraryCountry)","v":""}]
[{"$f":"itineraryCamps!A19","v":"12-16"},{"$f":"itineraryCamps!DL19","v":3},{"$f":"itineraryCamps!DM19","v":3},{"$f":"countcamps(itineraryStaff,numericItinerary($A18))","v":4},{"$f":"countcamps(itineraryTrail,numericItinerary($A18))","v":6},{"$f":"countcamps(itineraryLayover,numericItinerary($A18))","v":1},9,{"$f":"countcamps(itineraryDry,numericItinerary($A18))","v":1},{"$f":"MIN(itineraryCamps!AK19:AT19)","v":7758},{"$f":"MAX(itineraryCamps!AK19:AT19)","v":10280},2522,{"$f":"AVERAGE(itineraryCamps!AU19:BC19)","v":653.77777777777783},{"$f":"contains(M$2,numericItinerary($A18),itineraryMaps)","v":"Y"},{"$f":"contains(N$2,numericItinerary($A18),itineraryMaps)","v":""},{"$f":"contains(O$2,numericItinerary($A18),itineraryMaps)","v":""},{"$f":"contains(P$2,numericItinerary($A18),itineraryCountry)","v":"Y"},{"$f":"contains(Q$2,numericItinerary($A18),itineraryCountry)","v":"Y"},{"$f":"contains(R$2,numericItinerary($A18),itineraryCountry)","v":""},{"$f":"contains(S$2,numericItinerary($A18),itineraryCountry)","v":""}]
[{"$f":"itineraryCamps!A20","v":"12-17"},{"$f":"itineraryCamps!DL20","v":1},{"$f":"itineraryCamps!DM20","v":4},{"$f":"countcamps(itineraryStaff,numericItinerary($A19))","v":6},{"$f":"countcamps(itineraryTrail,numericItinerary($A19))","v":4},{"$f":"countcamps(itineraryLayover,numericItinerary($A19))","v":0},10,{"$f":"countcamps(itineraryDry,numericItinerary($A19))","v":3},{"$f":"MIN(itineraryCamps!AK20:AT20)","v":7703},{"$f":"MAX(itineraryCamps!AK20:AT20)","v":11650},3947,{"$f":"AVERAGE(itineraryCamps!AU20:BC20)","v":875.88888888888891},{"$f":"contains(M$2,numericItinerary($A19),itineraryMaps)","v":"Y"},{"$f":"contains(N$2,numericItinerary($A19),itineraryMaps)","v":""},{"$f":"contains(O$2,numericItinerary($A19),itineraryMaps)","v":""},{"$f":"contains(P$2,numericItinerary($A19),itineraryCountry)","v":"Y"},{"$f":"contains(Q$2,numericItinerary($A19),itineraryCountry)","v":"Y"},{"$f":"contains(R$2,numericItinerary($A19),itineraryCountry)","v":""},{"$f":"contains(S$2,numericItinerary($A19),itineraryCountry)","v":""}]
[{"$f":"itineraryCamps!A21","v":"12-18"},{"$f":"itineraryCamps!DL21","v":1},{"$f":"itineraryCamps!DM21","v":3},{"$f":"countcamps(itineraryStaff,numericItinerary($A20))","v":5},{"$f":"countcamps(itineraryTrail,numericItinerary($A20))","v":5},{"$f":"countcamps(itineraryLayover,numericItinerary($A20))","v":1},9,{"$f":"countcamps(itineraryDry,numericItinerary($A20))","v":2},{"$f":"MIN(itineraryCamps!AK21:AT21)","v":7150},{"$f":"MAX(itineraryCamps!AK21:AT21)","v":9851},2701,{"$f":"AVERAGE(itineraryCamps!AU21:BC21)","v":743.39111111111117},{"$f":"contains(M$2,numericItinerary($A20),itineraryMaps)","v":"Y"},{"$f":"contains(N$2,numericItinerary($A20),itineraryMaps)","v":"Y"},{"$f":"contains(O$2,numericItinerary($A20),itineraryMaps)","v":""},{"$f":"contains(P$2,numericItinerary($A20),itineraryCountry)","v":""},{"$f":"contains(Q$2,numericItinerary($A20),itineraryCountry)","v":"Y"},{"$f":"contains(R$2,numericItinerary($A20),itineraryCountry)","v":"Y"},{"$f":"contains(S$2,numericItinerary($A20),itineraryCountry)","v":""}]
[{"$f":"itineraryCamps!A22","v":"12-19"},{"$f":"itineraryCamps!DL22","v":3},{"$f":"itineraryCamps!DM22","v":5},{"$f":"countcamps(itineraryStaff,numericItinerary($A21))","v":4},{"$f":"countcamps(itineraryTrail,numericItinerary($A21))","v":6},{"$f":"countcamps(itineraryLayover,numericItinerary($A21))","v":0},10,{"$f":"countcamps(itineraryDry,numericItinerary($A21))","v":3},{"$f":"MIN(itineraryCamps!AK22:AT22)","v":7385},{"$f":"MAX(itineraryCamps!AK22:AT22)","v":11650},4265,{"$f":"AVERAGE(itineraryCamps!AU22:BC22)","v":1013.8888888888889},{"$f":"contains(M$2,numericItinerary($A21),itineraryMaps)","v":"Y"},{"$f":"contains(N$2,numericItinerary($A21),itineraryMaps)","v":""},{"$f":"contains(O$2,numericItinerary($A21),itineraryMaps)","v":""},{"$f":"contains(P$2,numericItinerary($A21),itineraryCountry)","v":"Y"},{"$f":"contains(Q$2,numericItinerary($A21),itineraryCountry)","v":"Y"},{"$f":"contains(R$2,numericItinerary($A21),itineraryCountry)","v":""},{"$f":"contains(S$2,numericItinerary($A21),itineraryCountry)","v":""}]
[{"$f":"itineraryCamps!A23","v":"12-20"},{"$f":"itineraryCamps!DL23","v":2},{"$f":"itineraryCamps!DM23","v":4},{"$f":"countcamps(itineraryStaff,numericItinerary($A22))","v":5},{"$f":"countcamps(itineraryTrail,numericItinerary($A22))","v":5},{"$f":"countcamps(itineraryLayover,numericItinerary($A22))","v":1},9,{"$f":"countcamps(itineraryDry,numericItinerary($A22))","v":0},{"$f":"MIN(itineraryCamps!AK23:AT23)","v":7150},{"$f":"MAX(itineraryCamps!AK23:AT23)","v":10530},3380,{"$f":"AVERAGE(itineraryCamps!AU23:BC23)","v":761.77777777777783},{"$f":"contains(M$2,numericItinerary($A22),itineraryMaps)","v":""},{"$f":"contains(N$2,numericItinerary($A22),itineraryMaps)","v":"Y"},{"$f":"contains(O$2,numericItinerary($A22),itineraryMaps)","v":""},{"$f":"contains(P$2,numericItinerary($A22),itineraryCountry)","v":""},{"$f":"contains(Q$2,numericItinerary($A22),itineraryCountry)","v":""},{"$f":"contains(R$2,numericItinerary($A22),itineraryCountry)","v":"Y"},{"$f":"contains(S$2,numericItinerary($A22),itineraryCountry)","v":"Y"}]
[{"$f":"itineraryCamps!A24","v":"12-21"},{"$f":"itineraryCamps!DL24","v":4},{"$f":"itineraryCamps!DM24","v":4},{"$f":"countcamps(itineraryStaff,numericItinerary($A23))","v":7},{"$f":"countcamps(itineraryTrail,numericItinerary($A23))","v":3},{"$f":"countcamps(itineraryLayover,numericItinerary($A23))","v":1},9,{"$f":"countcamps(itineraryDry,numericItinerary($A23))","v":3},{"$f":"MIN(itineraryCamps!AK24:AT24)","v":7217},{"$f":"MAX(itineraryCamps!AK24:AT24)","v":11650},4433,{"$f":"AVERAGE(itineraryCamps!AU24:BC24)","v":916.33333333333337},{"$f":"contains(M$2,numericItinerary($A23),itineraryMaps)","v":"Y"},{"$f":"contains(N$2,numericItinerary($A23),itineraryMaps)","v":""},{"$f":"contains(O$2,numericItinerary($A23),itineraryMaps)","v":""},{"$f":"contains(P$2,numericItinerary($A23),itineraryCountry)","v":"Y"},{"$f":"contains(Q$2,numericItinerary($A23),itineraryCountry)","v":"Y"},{"$f":"contains(R$2,numericItinerary($A23),itineraryCountry)","v":""},{"$f":"contains(S$2,numericItinerary($A23),itineraryCountry)","v":""}]
[{"$f":"itineraryCamps!A25","v":"12-22"},{"$f":"itineraryCamps!DL25","v":3},{"$f":"itineraryCamps!DM25","v":3},{"$f":"countcamps(itineraryStaff,numericItinerary($A24))","v":6},{"$f":"countcamps(itineraryTrail,numericItinerary($A24))","v":4},{"$f":"countcamps(itineraryLayover,numericItinerary($A24))","v":1},9,{"$f":"countcamps(itineraryDry,numericItinerary($A24))","v":3},{"$f":"MIN(itineraryCamps!AK25:AT25)","v":7150},{"$f":"MAX(itineraryCamps!AK25:AT25)","v":10640},3490,{"$f":"AVERAGE(itineraryCamps!AU25:BC25)","v":773.88888888888891},{"$f":"contains(M$2,numericItinerary($A24),itineraryMaps)","v":"Y"},{"$f":"contains(N$2,numericItinerary($A24),itineraryMaps)","v":"Y"},{"$f":"contains(O$2,numericItinerary($A24),itineraryMaps)","v":""},{"$f":"contains(P$2,numericItinerary($A24),itineraryCountry)","v":""},{"$f":"contains(Q$2,numericItinerary($A24),itineraryCountry)","v":"Y"},{"$f":"contains(R$2,numericItinerary($A24),itineraryCountry)","v":"Y"},{"$f":"contains(S$2,numericItinerary($A24),itineraryCountry)","v":""}]
[{"$f":"itineraryCamps!A26","v":"12-23"},{"$f":"itineraryCamps!DL26","v":2},{"$f":"itineraryCamps!DM26","v":2},{"$f":"countcamps(itineraryStaff,numericItinerary($A25))","v":5},{"$f":"countcamps(itineraryTrail,numericItinerary($A25))","v":5},{"$f":"countcamps(itineraryLayover,numericItinerary($A25))","v":1},9,{"$f":"countcamps(itineraryDry,numericItinerary($A25))","v":1},{"$f":"MIN(itineraryCamps!AK26:AT26)","v":7070},{"$f":"MAX(itineraryCamps!AK26:AT26)","v":9619},2549,{"$f":"AVERAGE(itineraryCamps!AU26:BC26)","v":656.77777777777783},{"$f":"contains(M$2,numericItinerary($A25),itineraryMaps)","v":"Y"},{"$f":"contains(N$2,numericItinerary($A25),itineraryMaps)","v":"Y"},{"$f":"contains(O$2,numericItinerary($A25),itineraryMaps)","v":""},{"$f":"contains(P$2,numericItinerary($A25),itineraryCountry)","v":"Y"},{"$f":"contains(Q$2,numericItinerary($A25),itineraryCountry)","v":"Y"},{"$f":"contains(R$2,numericItinerary($A25),itineraryCountry)","v":"Y"},{"$f":"contains(S$2,numericItinerary($A25),itineraryCountry)","v":""}]
[{"$f":"itineraryCamps!A27","v":"12-24"},{"$f":"itineraryCamps!DL27","v":3},{"$f":"itineraryCamps!DM27","v":5},{"$f":"countcamps(itineraryStaff,numericItinerary($A26))","v":4},{"$f":"countcamps(itineraryTrail,numericItinerary($A26))","v":6},{"$f":"countcamps(itineraryLayover,numericItinerary($A26))","v":1},9,{"$f":"countcamps(itineraryDry,numericItinerary($A26))","v":3},{"$f":"MIN(itineraryCamps!AK27:AT27)","v":7282},{"$f":"MAX(itineraryCamps!AK27:AT27)","v":9483.43},2201.4300000000003,{"$f":"AVERAGE(itineraryCamps!AU27:BC27)","v":884.65111111111116},{"$f":"contains(M$2,numericItinerary($A26),itineraryMaps)","v":"Y"},{"$f":"contains(N$2,numericItinerary($A26),itineraryMaps)","v":"Y"},{"$f":"contains(O$2,numericItinerary($A26),itineraryMaps)","v":""},{"$f":"contains(P$2,numericItinerary($A26),itineraryCountry)","v":""},{"$f":"contains(Q$2,numericItinerary($A26),itineraryCountry)","v":"Y"},{"$f":"contains(R$2,numericItinerary($A26),itineraryCountry)","v":"Y"},{"$f":"contains(S$2,numericItinerary($A26),itineraryCountry)","v":""}]
[]
["Min/Max nCamps",{"$f":"MIN(B3:B26)","v":1},2,3,3,0,8,0]
[null,{"$f":"MAX(B3:B26)","v":4},5,7,7,2,10,3]

{"sheet":"Programs","index":15,"n_rows":66,"n_cols":6,"rows_kept":66,"cut":false,"hidden":true,"merged":[[1,2,56,2]]}
["#",{"$f":"\"Programs (\" & MAX(A:A) & \")\"","v":"Programs (56)"},null,"Old Program Name/Comments",null,{"$f":"MAX(A:A)","v":56}]
[{"$f":"ROW()-1","v":1},"Climbing: Bouldering Gym",null,"Part of Rock Climbing & Rappelling"]
[{"$f":"ROW()-1","v":2},"Climbing: Climbing Wall/Tower",null,"Part of Rock Climbing & Rappelling"]
[3,"Climbing: Crate Stacking",null,"Part of Rock Climbing & Rappelling (Miners Park only)"]
[4,"Climbing: Rock Climbing",null,"Rock Climbing & Rappelling"]
[5,"COPE: High Challenge Course",null,"High Ropes & Climbing Tower"]
[6,"COPE: Initiative Games",null,"Challenge Events"]
[7,"COPE: Low Challenge Course",null,"Challenge Events"]
[8,"Ecology: Demonstration Forest",null,"Demonstration Forest"]
[9,"Ecology: Self-Guided Fishing",null,"Fishing (used to include Fly Tying @ Fish Camp but not available in 2025 due to Fish Camp restoration"]
[10,"Evening: Abreu Family Dinner",null,"Mexican Dinner"]
[11,"Evening: Advisor Coffee",null,"Was not listed as a program"]
[12,"Evening: Campfire Show",null,"Campfire (evening)"]
[13,"Evening: Chuckwagon Dinner",null,"Chuckwagon Dinner"]
[14,"Historical: Adobe Brick-Making",null,"New Mexican Homestead"]
[15,"Historical: Blacksmithing",null,"Blacksmithing"]
[16,"Historical: Cabin Restoration",null,"Was not a program prior to 2025"]
[17,"Historical: Cabin/House Tour",null,"Lodge/Cabin Tours"]
[18,"Historical: Crafting",null,"Was not a program prior to 2025"]
[19,"Historical: Crosscut & Tie Making",null,"Tie Making & Crosscut Saws"]
[20,"Historical: Flint Knapping",null,"Jacarilla Apache Life"]
[21,"Historical: Fur Trapper Rendezvous",null,"Mountain Man Rendezvous / Fur Trapper Rendezvous (@ Miranda)"]
[22,"Historical: Gold Panning",null,"Gold Mining & Panning"]
[23,"Historical: Mine Tour",null,"Mine Tour"]
[24,"Historical: Petroglyph Tour",null,"Petroglyph Tour"]
[25,"Historical: Pump Car Rides",null,"Not listed as separate program - was included in Railroading"]
[26,"Historical: Railroad Construction",null,"Railroading"]
[27,"Historical: Spar Pole Climbing",null,"Spar Pole Climbing"]
[28,"Landmarks: Baldy Mountain",null,"Baldy Mountain Hike"]
[29,"Landmarks: Inspiration Point",null,"Inspiration Point Hike; In 2025 TREKS book as \"Landmarks: Viewpoint Hike\""]
[30,"Landmarks: Mount Phillips",null,"Was not listed as a program - was included in itinerary descriptions"]
[31,"Landmarks: Mountaineering",null,"Big Red, Black Mountain, Comanche Peak, Hart Peak, Lookout Peak, Little Costilla"]
[32,"Landmarks: Tooth of Time",null,"Tooth of Time"]
[33,"Landmarks: Trail Peak",null,"Was not listed as a program - was included in itinerary descriptions"]
[34,"Livestock: Animal Husbandry",null,"Included in Homesteading"]
[35,"Livestock: Burro Packing",null,"Burro Packing"]
[36,"Livestock: Chicken Tending",null,"Included in Homesteading"]
[37,"Livestock: Horse Rides",null,"Horse Rides"]
[38,"Low Impact Camping",null,"Low Impact Camping"]
[39,"Range Sports: 3D Archery",null,"Archery - 3 Dimensional"]
[40,"Range Sports: Aerial Archery",null,"Also known as \"Sporting Arrows\".  Available 2025 at Apache Springs & Cimarroncita"]
[41,"Range Sports: Atlatl Throwing",null,"Atlatl (Dart-Throwing)"]
[42,"Range Sports: Cartridge Reloading",null,"Not listed as separate program - was included in Shooting/Reloading - .30-06"]
[43,"Range Sports: Cowboy Action Shooting",null,"Cowboy Action Shooting"]
[44,"Range Sports: Field Archery",null,"Also known as \"3D Archery\".  Available 2025 at Apache Springs & Cimarroncita"]
[45,"Range Sports: Muzzleloader Shooting",null,"Muzzle Loading Rifle"]
[46,"Range Sports: Rifle Shooting",null,"Shooting/Reloading - .30-06"]
[47,"Range Sports: Shotgun Shooting",null,"Shotgun Shooting/Reloaing - 12 Gauge"]
[48,"Range Sports: Shotshell Reloading",null,"Not listed as separate program - was included in Shotgun Shooting/Reloaing - 12 Gauge"]
[49,"Range Sports: Tomahawk Throwing",null,"Tomahawk Throwing"]
[50,"STEM: Archeology",null,"Archaeology"]
[51,"STEM: Astronomy",null,"Astronomy"]
[52,"STEM: Geology",null,"Typically was part of Gold Mining & Panning"]
[53,"Western Lore: Branding",null,"Western Lore/Branding"]
[54,"Western Lore: Cantina",null,"Cantina"]
[55,"Western Lore: Roping",null,"Included in Western Lore/Branding"]
[56,"Wheeled: Mountain Biking",null,"Mountain Biking"]
[null,null,null,"Programs available in prior years not listed and/or not available in 2025"]
[null,null,null,"Post Civil War Encampment (Black Mountain Camp)"]
[null,null,null,"Rocky Mountain Fur Company (Clear Creek Camp)"]
[null,null,null,"Search & Rescue/Wilderness Medicine (Carson Meadows & various Valle Vidal camps in priors years) — no longer offered"]
[null,null,null,"Bouldering — was at Chase Cow Camp, no longer offered"]
[null,null,null,"Historic Chase Ranch — no longer offered"]
[null,null,null,"Hunter Safety — was at Cimarroncita, no longer offered"]
[null,null,null,"Kit Carson/Rayado Rancho — offered as separate visit outside of trek"]
[null,null,null,"Laser Shot Shooting Range — was at Cimarroncita, no longer offered"]

{"sheet":"Camp Programs","index":16,"n_rows":53,"n_cols":58,"rows_kept":53,"cut":false,"hidden":true,"merged":[[0,0,1,0],[0,1,1,1]]}
["These are the programs available at camps.  Used to create the default programs for itineraries in itineraryPrograms worksheet.\n\n\nStaffed Camp","# Programs",1,{"$f":"C1+1","v":2},{"$f":"D1+1","v":3},4,5,6,7,8,9,10,11,12,13,14,15,16,17,18,19,20,21,22,23,24,25,26,27,28,29,30,31,32,33,{"$f":"AI1+1","v":34},35,36,37,38,39,40,41,42,43,{"$f":"AS1+1","v":44},45,{"$f":"AU1+1","v":46},{"$f":"AV1+1","v":47},{"$f":"AW1+1","v":48},{"$f":"AX1+1","v":49},{"$f":"AY1+1","v":50},{"$f":"AZ1+1","v":51},{"$f":"BA1+1","v":52},{"$f":"BB1+1","v":53},{"$f":"BC1+1","v":54},{"$f":"BD1+1","v":55},{"$f":"BE1+1","v":56}]
[null,null,{"$f":"INDEX(program_table,C1)","v":"Climbing: Bouldering Gym"},{"$f":"INDEX(program_table,D1)","v":"Climbing: Climbing Wall/Tower"},{"$f":"INDEX(program_table,E1)","v":"Climbing: Crate Stacking"},{"$f":"INDEX(program_table,F1)","v":"Climbing: Rock Climbing"},{"$f":"INDEX(program_table,G1)","v":"COPE: High Challenge Course"},{"$f":"INDEX(program_table,H1)","v":"COPE: Initiative Games"},{"$f":"INDEX(program_table,I1)","v":"COPE: Low Challenge Course"},{"$f":"INDEX(program_table,J1)","v":"Ecology: Demonstration Forest"},{"$f":"INDEX(program_table,K1)","v":"Ecology: Self-Guided Fishing"},{"$f":"INDEX(program_table,L1)","v":"Evening: Abreu Family Dinner"},{"$f":"INDEX(program_table,M1)","v":"Evening: Advisor Coffee"},{"$f":"INDEX(program_table,N1)","v":"Evening: Campfire Show"},{"$f":"INDEX(program_table,O1)","v":"Evening: Chuckwagon Dinner"},{"$f":"INDEX(program_table,P1)","v":"Historical: Adobe Brick-Making"},{"$f":"INDEX(program_table,Q1)","v":"Historical: Blacksmithing"},{"$f":"INDEX(program_table,R1)","v":"Historical: Cabin Restoration"},{"$f":"INDEX(program_table,S1)","v":"Historical: Cabin/House Tour"},{"$f":"INDEX(program_table,T1)","v":"Historical: Crafting"},{"$f":"INDEX(program_table,U1)","v":"Historical: Crosscut & Tie Making"},{"$f":"INDEX(program_table,V1)","v":"Historical: Flint Knapping"},{"$f":"INDEX(program_table,W1)","v":"Historical: Fur Trapper Rendezvous"},{"$f":"INDEX(program_table,X1)","v":"Historical: Gold Panning"},{"$f":"INDEX(program_table,Y1)","v":"Historical: Mine Tour"},{"$f":"INDEX(program_table,Z1)","v":"Historical: Petroglyph Tour"},{"$f":"INDEX(program_table,AA1)","v":"Historical: Pump Car Rides"},{"$f":"INDEX(program_table,AB1)","v":"Historical: Railroad Construction"},{"$f":"INDEX(program_table,AC1)","v":"Historical: Spar Pole Climbing"},{"$f":"INDEX(program_table,AD1)","v":"Landmarks: Baldy Mountain"},{"$f":"INDEX(program_table,AE1)","v":"Landmarks: Inspiration Point"},{"$f":"INDEX(program_table,AF1)","v":"Landmarks: Mount Phillips"},{"$f":"INDEX(program_table,AG1)","v":"Landmarks: Mountaineering"},{"$f":"INDEX(program_table,AH1)","v":"Landmarks: Tooth of Time"},{"$f":"INDEX(program_table,AI1)","v":"Landmarks: Trail Peak"},{"$f":"INDEX(program_table,AJ1)","v":"Livestock: Animal Husbandry"},{"$f":"INDEX(program_table,AK1)","v":"Livestock: Burro Packing"},{"$f":"INDEX(program_table,AL1)","v":"Livestock: Chicken Tending"},{"$f":"INDEX(program_table,AM1)","v":"Livestock: Horse Rides"},{"$f":"INDEX(program_table,AN1)","v":"Low Impact Camping"},{"$f":"INDEX(program_table,AO1)","v":"Range Sports: 3D Archery"},{"$f":"INDEX(program_table,AP1)","v":"Range Sports: Aerial Archery"},{"$f":"INDEX(program_table,AQ1)","v":"Range Sports: Atlatl Throwing"},{"$f":"INDEX(program_table,AR1)","v":"Range Sports: Cartridge Reloading"},{"$f":"INDEX(program_table,AS1)","v":"Range Sports: Cowboy Action Shooting"},{"$f":"INDEX(program_table,AT1)","v":"Range Sports: Field Archery"},{"$f":"INDEX(program_table,AU1)","v":"Range Sports: Muzzleloader Shooting"},{"$f":"INDEX(program_table,AV1)","v":"Range Sports: Rifle Shooting"},{"$f":"INDEX(program_table,AW1)","v":"Range Sports: Shotgun Shooting"},{"$f":"INDEX(program_table,AX1)","v":"Range Sports: Shotshell Reloading"},{"$f":"INDEX(program_table,AY1)","v":"Range Sports: Tomahawk Throwing"},{"$f":"INDEX(program_table,AZ1)","v":"STEM: Archeology"},{"$f":"INDEX(program_table,BA1)","v":"STEM: Astronomy"},{"$f":"INDEX(program_table,BB1)","v":"STEM: Geology"},{"$f":"INDEX(program_table,BC1)","v":"Western Lore: Branding"},{"$f":"INDEX(program_table,BD1)","v":"Western Lore: Cantina"},{"$f":"INDEX(program_table,BE1)","v":"Western Lore: Roping"},{"$f":"INDEX(program_table,BF1)","v":"Wheeled: Mountain Biking"}]
["Abreu",{"$f":"COUNTIF(C3:BF3,\"y\")","v":9},null,null,null,null,null,null,null,null,"y","y","y",null,null,"y",null,null,"y","y",null,null,null,null,null,null,null,null,null,null,null,null,null,null,null,"y",null,"y",null,null,null,null,null,null,null,null,null,null,null,null,null,null,null,null,null,"y"]
["Anasazi",0]
["Apache Springs",4,null,null,null,null,null,null,null,null,null,null,"y",null,null,null,null,null,null,null,null,"y",null,null,null,null,null,null,null,null,null,null,null,null,null,null,null,null,null,null,"y","y"]
["Baldy Town",3,null,null,null,null,null,null,null,null,null,null,"y",null,null,null,null,null,null,null,null,null,null,"y",null,null,null,null,null,null,null,null,null,null,null,null,null,null,null,null,null,null,null,null,null,null,null,null,null,null,null,null,null,"y"]
["Beatty Lakes",1,null,null,null,null,null,null,null,null,null,null,null,null,null,null,null,null,null,null,null,null,null,null,null,null,null,null,null,null,null,null,null,null,null,null,null,null,null,"y"]
["Beaubien",6,null,null,null,null,null,null,null,null,null,null,"y","y","y",null,null,null,null,null,null,null,null,null,null,null,null,null,null,null,null,null,null,null,null,null,null,null,"y",null,null,null,null,null,null,null,null,null,null,null,null,null,null,null,"y",null,"y"]
["Black Mountain",4,null,null,null,null,null,null,null,null,null,null,"y",null,null,null,"y",null,null,null,null,null,null,null,null,null,null,null,null,null,null,null,null,null,null,"y",null,null,null,null,null,null,null,null,null,null,"y"]
["Carson Meadows",0]
["Chase Cow",0]
["Chase Ranch",0]
["Cimarroncita",4,null,null,null,null,null,null,null,null,null,null,"y",null,null,null,null,null,null,null,null,null,null,null,null,null,null,null,null,null,null,null,null,null,null,null,null,null,null,null,"y","y",null,null,null,"y"]
["Cimarroncito",3,"y",null,null,"y",null,null,null,null,null,null,"y"]
["Clarks Fork",6,null,null,null,null,null,null,null,null,null,null,"y","y","y",null,null,null,null,null,null,null,null,null,null,null,null,null,null,null,null,null,null,null,null,null,null,null,"y",null,null,null,null,null,null,null,null,null,null,null,null,null,null,null,"y",null,"y"]
["Clear Creek",4,null,null,null,null,null,null,null,null,null,null,"y",null,null,null,null,null,"y",null,null,null,null,null,null,null,null,null,null,null,null,null,null,null,null,null,null,null,null,null,null,null,null,null,null,null,"y",null,null,null,"y"]
["COPE Course",2,null,"y",null,null,"y"]
["Crater Lake",4,null,null,null,null,null,null,null,null,null,null,"y","y",null,null,null,null,null,null,"y",null,null,null,null,null,null,null,"y"]
["Crooked Creek",5,null,null,null,null,null,null,null,null,null,null,"y",null,null,null,null,"y","y",null,null,null,null,null,null,null,null,null,null,null,null,null,null,null,null,"y",null,"y"]
["Cyphers Mine",6,null,null,null,null,null,null,null,null,null,null,"y","y",null,null,"y",null,null,null,null,null,null,"y","y",null,null,null,null,null,null,null,null,null,null,null,null,null,null,null,null,null,null,null,null,null,null,null,null,null,null,null,null,"y"]
["Dan Beard",3,null,null,null,null,null,"y","y",null,null,null,"y"]
["Dean Cow",2,null,null,null,"y",null,null,null,null,null,null,"y"]
["Demonstration Forest",1,null,null,null,null,null,null,null,"y"]
["Fish Camp",1,null,null,null,null,null,null,null,null,"y"]
["French Henry",3,null,null,null,null,null,null,null,null,null,null,null,null,null,null,"y",null,null,null,null,null,null,"y",null,null,null,null,null,null,null,null,null,null,null,null,null,null,null,null,null,null,null,null,null,null,null,null,null,null,null,null,null,"y"]
["Garcia Cow",0]
["Greenwood Canyon",1,null,null,null,null,null,null,null,null,null,null,null,null,null,null,null,null,null,null,null,null,null,null,null,null,null,null,null,null,null,null,null,null,null,null,null,null,null,"y"]
["Harlan",3,null,null,null,null,null,null,null,null,null,null,"y",null,null,null,null,null,null,null,null,null,null,null,null,null,null,null,null,null,null,null,null,null,null,null,null,null,null,null,null,null,null,null,null,null,null,null,"y","y"]
["Head of Dean",3,null,null,null,null,null,"y","y",null,null,null,"y"]
["Hunting Lodge",1,null,null,null,null,null,null,null,null,"y"]
["Indian Writings",4,null,null,null,null,null,null,null,null,null,null,"y",null,null,null,null,null,null,null,null,null,null,null,null,"y",null,null,null,null,null,null,null,null,null,null,null,null,null,null,null,null,"y",null,null,null,null,null,null,null,null,"y"]
["Iris Park",1,null,null,null,null,null,null,null,null,null,null,null,null,null,null,null,null,null,null,null,null,null,null,null,null,null,null,null,null,null,null,null,null,null,null,null,null,null,"y"]
["Kit Carson",0]
["Little Costilla",0]
["Metcalf Station",{"$f":"COUNTIF(C35:BF35,\"y\")","v":5},null,null,null,null,null,null,null,null,null,null,"y","y",null,null,"y",null,null,null,null,null,null,null,null,null,"y","y"]
["Middle Ponil",1,null,null,null,null,null,null,null,null,null,null,null,null,null,null,null,null,null,null,null,null,null,null,null,null,null,null,null,null,null,null,null,null,null,null,null,null,null,"y"]
["Miners Park",5,"y","y","y","y",null,null,null,null,null,null,"y"]
["Miranda",5,null,null,null,null,null,null,null,null,null,null,"y",null,null,null,null,null,null,null,null,null,"y",null,null,null,null,null,null,null,null,null,null,null,null,null,"y",null,null,null,null,null,null,null,null,null,"y",null,null,null,"y"]
["Phillips Junction",3,null,null,null,null,null,null,null,null,"y",null,"y",null,null,null,null,null,null,null,null,null,null,null,null,null,null,null,null,null,null,null,null,null,null,null,null,null,null,"y"]
["Ponil",9,null,null,null,null,null,null,null,null,null,null,"y","y","y",null,null,null,null,null,null,null,null,null,null,null,null,null,null,null,null,null,null,null,null,null,"y",null,"y",null,null,null,null,null,"y",null,null,null,null,null,null,null,null,null,"y","y","y"]
["Pueblano",4,null,null,null,null,null,null,null,null,null,null,"y","y",null,null,null,null,null,null,"y",null,null,null,null,null,null,null,"y"]
["Rayado",0]
["Rich Cabins",6,null,null,null,null,null,null,null,null,null,null,"y","y",null,null,null,null,"y",null,null,null,null,null,null,null,null,null,null,null,null,null,null,null,null,"y",null,"y",null,"y"]
["Ring Place",4,null,null,null,null,null,null,null,null,null,null,"y",null,null,null,null,null,null,null,null,null,null,null,null,null,null,null,null,null,null,null,null,null,null,null,null,null,null,"y",null,null,null,null,null,null,null,null,null,null,null,null,"y",null,null,null,null,"y"]
["Santa Claus",0]
["Sawmill",3,null,null,null,null,null,null,null,null,null,null,"y",null,null,null,null,null,null,null,null,null,null,null,null,null,null,null,null,null,null,null,null,null,null,null,null,null,null,null,null,null,null,"y",null,null,null,"y"]
["Seally Canyon",0]
["Upper Greenwood",0]
["Urraca",5,null,null,null,null,null,"y","y",null,null,null,"y","y",null,null,null,null,null,null,null,null,null,null,null,null,null,null,null,null,"y"]
["Ute Gulch",0]
["Whiteman Vega",3,null,null,null,null,null,null,null,null,null,null,"y",null,null,null,null,null,null,null,null,null,null,null,null,null,null,null,null,null,null,null,null,null,null,null,null,null,null,"y",null,null,null,null,null,null,null,null,null,null,null,null,null,null,null,null,null,"y"]
["Zastrow",0]
[null,null,{"$f":"COUNTIF(C3:C52,\"y\")","v":2},{"$f":"COUNTIF(D3:D52,\"y\")","v":2},1,3,1,3,3,1,4,1,28,9,3,1,4,1,4,1,2,1,1,3,1,1,1,1,2,0,1,0,0,0,0,4,2,3,3,8,2,2,1,1,1,1,3,1,1,1,2,1,1,3,3,2,3,2]

{"sheet":"Camp Elevations","index":17,"n_rows":171,"n_cols":14,"rows_kept":171,"cut":false,"hidden":true,"merged":[[170,3,170,12],[103,13,104,13]]}
["Added","CAMP NAME","Country","Easting","Northing","ELEVATION ","Commissary","Trading Post","Staffed","Trail Camp","Dry Camp","Showers","campMap"]
[null,"Abreu","South",498586,4025999,7217,"","","Y","","","Y","South"]
[null,"Agua Fria","South",488935,4026589,8726,"","","","Y","","","South"]
[null,"Aguila","South",497862,4028279,8282,"","","","Y","","","South"]
[2019,"American Creek","South",481557.83,4035889.24,9815,null,null,"","Y","",null,"South"]
[null,"Anasazi","North",501736,4051171,6911,"","","","Y","","","North"]
[null,"Apache Springs","South",487072,4026937,9409,"Y","","Y","","","","South"]
[2019,"Arrowhead","South",496899.66,4035172.06,7644,null,null,"","Y","Y",null,"South"]
[null,"Aspen Springs","Central",494588,4039845,7912,"","","","Y","","","South"]
[2021,"Azurite","North",482386.37579999998,4054351.6874000002,10640,null,null,"","Y","Y",null,"North"]
[null,"Backache Springs","South",502047,4027556,7688,"","","","Y","","","South"]
[null,"Baldy Skyline","North",487283.46,4052136.12,9140,"","","","Y","","","North"]
[null,"Baldy Town","North",482894,4053456,9851,"Y","Y","Y","","","Y","North"]
[null,"Base","Central",503848,4034364,6696,"","","","Y","","","South"]
[null,"Bear Canyon","South",487881,4028169,9288,"","","","Y","","","South"]
[null,"Bear Caves","South",496976,4028855,8423,"","","","Y","","","South"]
[2021,"Bear Creek",{"$f":"C15","v":"South"},{"$f":"D15","v":487881},4028169,9288,"","","","Y","","","South","Renamed from Bear Canyon"]
[null,"Beatty Lakes","Valle Vidal",489314.61,4064668.2415999998,8178.6580000000004,"","","","Y","Y","","North"]
[null,"Beaubien","South",490738,4030941,9330,"","","Y","","","Y","South"]
[null,"Bent","North",494100,4054501,7319,"","","","Y","","","North"]
[null,"Black Horse","North",483104,4051686,9619,"","","","Y","","","North"]
[2021,"Black Horse Creek",{"$f":"C21","v":"North"},{"$f":"D21","v":483104},4051686,9619,"","","","Y","","","North","Renamed from Black Horse"]
[2021,"Black Horse Mine","North",482367.65720000002,4052309.574,10750,null,null,"","Y","Y",null,"North"]
[null,"Black Jacks","North",496177,4047265,8211,"","","","Y","","","North"]
[null,"Black Mountain","South",491634,4033045,8991,"","","Y","","","","South"]
[2022,"Bluestem","North",495101.6764,4051329.0962,7495,null,null,"","Y","Y",null,"North"]
[null,"Bonita Cow","South",null,null,9120,"","","","Y","","","South"]
[null,"Buck Creek","South",488296,4029577,9131,"","","","Y","","","South"]
[null,"Camping HQ",{"$f":"C14","v":"Central"},{"$f":"D14","v":503848},4034364,6696,"","","","Y","","","South","Same as BASE"]
[null,"Campos Heck","North",502454,4047467,7081,"","","","Y","","","North"]
[null,"Carson Meadows","South",497851,4024826,7758,"","","N","","","","South","Not used 2024, trail 2025"]
[null,"Cathedral Rock","Central",495619,4037883,7550,"","","","Y","","","South"]
[null,"Chase Canyon","North",503643,4053267,7192,"","","","Y","","","North"]
[2019,"Chase Cow","North",504488.58,4052426.91,7177,null,null,"Y","","",null,"North"]
[null,"Chase Ranch","North",506771,4045397,6552,"","","Y","","Y","","North"]
[null,"Cimarron River","Central",494007,4046488,7282,"","","","Y","","","South"]
[2021,"Cimarroncita","Central",492337.15110000002,4045746.6666999999,7373,null,null,"Y","","",null,"North & South"]
[null,"Cimarroncito","Central",494139,4039271,8137,"","","Y","","","Y","South"]
[null,"Clarks Fork","Central",495699,4035985.55,7515,"","","Y","","","Y","South"]
[null,"Clear Creek","Central",483477,4036332,10240,"","","Y","","","","South"]
[null,"Comanche Creek","South",485656.75,4033365.26,9600,"","","","Y","","","South"]
[null,"Comanche Peak","Central",487608,4037237,11070,"","","","Y","Y","","South"]
[null,"Cook Canyon","North",494194,4058460,7731,"","","","Y","","","North"]
[null,"Copper Park","North",481903,4055101,10530,"","","","Y","","","North"]
[null,"Cottonwood","North",500105,4056884,7373,"","","","Y","","","North"]
[2023,"Coyote Howl","North",500561.82,4054185.0869999998,7560.52,"","","","Y","","","North"]
[null,"Crags","South",494334,4024631,8058,"","","","Y","","","South"]
[null,"Crater Lake","South",495609,4028935,8398,"","","Y","","","","South"]
[null,"Crooked Creek","South",486794,4031067,9360,"","","Y","","","","South"]
[null,"Cyphers Mine","Central",489568,4037662,9302,"","","Y","","","Y","South"]
[null,"Dan Beard","North",492056,4059215,7896,"","","Y","","","","North"]
[2019,"Daves Lake","South",491347.09,4025665.43,9453,null,null,"","Y","",null,"South"]
[null,"Dean Cow","North",500102,4046769,7232,"","","Y","","","Y","North"]
[null,"Dean Cutoff","North",495546.39,4052340.91,7320,"","","","Y","","","North"]
[null,"Dean Heck","North",504413,4044305,6758,"","","","Y","","","North"]
[2019,"Dean Skyline","North",495667.97,4051680.85,7967,null,null,"","Y","Y",null,"North"]
[null,"Deer Lake","Central",497685,4040333,8280,"","","","Y","","","South"]
[null,"Deer Lake Mesa","Central",495433,4042810,8324,"","","","Y","","","South"]
[null,"Demonstration Forest","South",494670,4037285,7720,"","","","Y","Y","","South"]
[null,"Devil's Wash Basin","Central",494932,4042281,8515,"","","","Y","Y","","South"]
[2020,"Divide","South",488258.43,4036088.88,10509,null,null,"","Y","Y",null,"South"]
[null,"Elkhorn","North",492424,4051874,8496,"","","","Y","","","North"]
[null,"Ewells Park","North",484643,4053169,9373,"","","","Y","","","North"]
[null,"Fish Camp","South",490787,4026964,8564,"","","N","","","","South","Not staffed 2025"]
[null,"Flume Canyon","North",492186,4053281,7715,"","","","Y","","","North"]
[null,"French Henry","North",483471,4054519,9635,"","","Y","","","","North"]
[2019,"Garcia Cow","South",483495.8,4027944.67,9855,null,null,"Y","","",null,"South"]
[null,"Greenwood Canyon","Valle Vidal",483891.64,4061375.92,8300,"","","","Y","","","North"]
[null,"Harlan","Central",498402,4041184,7550,"","","Y","","","","South"]
[null,"Hawkeye","Central",494791,4046280,7586,"","","","Y","Y","","South"]
[null,"Head of Dean","North",489268,4051641,8754,"","","Y","","","","North"]
[2021,"Heck Meadow","South",498379.26270000002,4035918.4079,7085,null,null,"","Y","Y",null,"South"]
[null,"Hells Fire Canyon","North",506048,4049722,6837,"","","","Y","","","North"]
[2020,"Herradura","South",498970.27,4030120,7465,"","","","Y","Y","","South"]
[null,"Horse Canyon","North",494604,4057016,8128,"","","","Y","","","North"]
[null,"House Canyon","North",502969,4051149,7157,"","","","Y","","","North"]
[null,"Hunting Lodge","Central",494338,4037841,7776,"","","N","y","","","South","Not used 2024, trail 2025"]
[null,"Indian Writings","North",500421,4053139,6979,"","","Y","","","Y","North"]
[null,"Iris Park","Valle Vidal",486124,4064630,8571,"","","","Y","","","North"]
[null,"Kit Carson","South",506169.3798,4024627.3322999999,6466,"","","Y","","","","South"]
[null,"Lamberts Mine","Central",490260,4037034,8957,"","","","Y","","","South"]
[2021,"Line",{"$f":"C83","v":"South"},{"$f":"D83","v":498199.67},4023525.53,8125,"","","","Y","","","South","Renamed from Line Camp"]
[null,"Line Camp","South",498199.67,4023525.53,8125,"","","","Y","","","South"]
[null,"Little Costilla","Valle Vidal",480285.29,4072995.57,10200.69,"","","","Y","","","North"]
[2019,"Little Twin","North",505391.65330000001,4049985.7826999999,7258.9650430000002,null,null,"","Y","Y",null,"North"]
[null,"Lookout Meadow","South",493728,4026401,9419,"","","","Y","","","South"]
[null,"Lost Cabins","South",487827,4026491,9205,"","","","Y","","","South"]
[null,"Lost Gap","Central",496635,4040475,8413,"","","","Y","Y","","South"]
[2019,"Lovato","South",487595.97,4023654.22,9523,null,null,"","Y","",null,"South"]
[null,"Lovers Leap","South",498474,4030533,7469,"","","","Y","","","South"]
[null,"Lower Bonito","South",493583,4027520,8962,"","","","Y","","","South"]
[null,"Lower Sawmill","Central",493143,4041628,8308,"","","","Y","","","South"]
[2021,"Magpie","South",501032.30530000001,4031514.3975,7385,null,null,"","Y","Y",null,"South"]
[null,"Martinez Springs","Central",496880,4043340,7494,"","","","Y","","","South"]
[null,"Maxwell","North",486238,4050954,8498,"","","","Y","","","North"]
[null,"McBride Canyon","North",500499,4050410,7105,"","","","Y","Y","","North"]
[null,"McCrystal Creek","Valle Vidal",486857.99619999999,4073297.6935000001,8538,"","","","Y","","","North"]
[null,"Metcalf Station","North",497635,4057295,7220,"","","Y","","","","North"]
[null,"Middle Ponil","Valle Vidal",482410,4068284,9118,"","","","Y","","","North"]
[null,"Miners Park","South",496250,4030958,7977,"Y","","Y","","","Y","South"]
[null,"Minnette Meadows","Central",492417.2,4044351,7703,"","","","Y","Y","","South"]
[null,"Miranda","North",484666,4051561,8898,"","","Y","","","","North"]
[2021,"Mistletoe","Central",493459.07990000001,4048688.4183999998,8295,null,null,"","Y","Y",null,"North & South"]
[null,"Mount Phillips","Central",486031.29960000003,4036786.3292,11650,"","","","Y","Y","","South","2023 Different spellings for same camp"]
[null,"Mt Phillips","Central",486031.29960000003,4036786.3292,11650,"","","","Y","Y","","South"]
[null,"New Dean","North",495733,4049734,7724,"","","","Y","","","North"]
[null,"North Fork Urraca","South",496228,4032333,7961,"","","","Y","","","South"]
[2019,"North Ponil","North",495945.07,4058676.11,7706,null,null,"","Y","",null,"North"]
[null,"Old Abreu","South",497636,4025768,7375,"","","","Y","","","South"]
[null,"Old Camp","Valle Vidal",null,null,null,"","","","Y","","","North"]
[null,"Olympia","South",502788,4025183,6731,"","","","Y","","","South"]
[null,"Phillips Junction","South",489389,4030051,8921,"Y","Y","Y","","","Y","South"]
[null,"Pinyon Flats","South",501236,4024353,6924,"","","","Y","","","South"]
[2023,"Placer","North",4836526.0779999997,4052601.3470000001,9483.43,"","","","Y","","","North"]
[null,"Ponderosa Park","Central",495827,4034966,8004,"","","","Y","Y","","South"]
[null,"Ponil","North",496696.54700000002,4053001.2755,7150,"Y","Y","Y","","","Y","North"]
[null,"Porcupine","South",488353,4030881,9152,"","","","Y","","","South"]
[null,"Pueblano","North",489738,4053274,8069,"","","Y","","","","North"]
[null,"Pueblano Ruins","North",487758,4053694,8359,"","","","Y","","","North"]
[2020,"Rabbit Ear","North",492496.72,4059396.86,8115,null,null,"","Y","Y",null,"North"]
[null,"Rayado","South",506169.3798,4024627.3322999999,6518,"","","","Y","","","South"]
[null,"Rayado Ridge","South",505371,4024604,6655,"","","","Y","","Y","South"]
[null,"Rayado River","South",499286,4025697,7079,"","","","Y","","","South"]
[null,"Red Hills","South",487476,4035642,10280,"","","","Y","","","South"]
[null,"Rich Cabins","Valle Vidal",489694,4058261,7728,"Y","","Y","","","","North"]
[null,"Rimrock Park","South",498366,4025625,7359,"","","","Y","Y","","South"]
[null,"Ring Place","Valle Vidal",489152,4069608,8124,"Y","","Y","","","","North"]
[2021,"Ringtail","North",487012.16409999999,4051328.0446000001,8600,null,null,"","Y","Y",null,"North"]
[null,"RMSC","South",500770,4032043,7080,"","","","Y","","","South"]
[null,"Rock Springs","Central",496880,4043340,7491,"","","","Y","","","South"]
[2019,"Saladon","South",482203.13,4032785.4142999998,9874.788998,null,null,"","Y","",null,"South"]
[null,"Santa Claus","North",491849,4049566,8438,"","","Y","","","","North"]
[null,"Sawmill","Central",490259,4041146,9193,"","","Y","","","Y","South"]
[null,"Seally Canyon","Valle Vidal",490997,4067420,8037,"","","","Y","Y","","North"]
[null,"Shaefers Pass","Central",495940,4033735,8724,"","","","Y","Y","","South"]
[null,"Shuree Cabin","Valle Vidal",480498,4070514,9647,"","","","Y","","","North"]
[null,"Shuree Lodge","Valle Vidal",482669,4069480,9277,"","","","Y","","","North"]
[null,"Sioux","North",495001,4053225,7382,"","","","Y","","","North"]
[null,"Six Mile Gate","North",503191.76,4049062.91,6710,"","","","Y","","","North"]
[null,"Slate Hill Heck","North",502409,4043124,7722,"","","","Y","Y","","North"]
[null,"Stockade","South",500015,4032275,7254,"","","","Y","","","South"]
[null,"Stockade Ridge","South",499296,4032487,7519,"","","","Y","Y","","South"]
[null,"Thunder Ridge","Central",488492.89939999999,4038824.1444999999,10490,"","","","Y","Y","","South"]
[2019,"Tolby Headwaters","South",480146.81,4038306.99,9219,null,null,"","Y","",null,"South"]
[null,"Tooth Ridge","Central",500029.67,4033924.75,8240,"","","","Y","Y","","South"]
[null,"Toothache Springs","South",500750,4028216,7870,"","","","Y","","","South"]
[2021,"Touch-Me-Not Creek","North",484936.67660000001,4050860.9983999999,8855,null,null,"","Y","",null,"North"]
[null,"Trail Canyon","North",499226,4049865,7070,"","","","Y","","","North"]
[null,"Turkey Creek","North",498097,4046582,7569,"","","","Y","","","North"]
[null,"Upper Bench","Central",494832,4043955,8161,"","","","Y","Y","","South"]
[null,"Upper Clarks Fork","Central",495583,4034947,7902,"","","","Y","Y","","South"]
[null,"Upper Dean Cow","North",492036,4050785,8254,"","","","Y","","","North"]
[null,"Upper Greenwood","Valle Vidal",479874.12530000001,4056510.7667999999,10262.665999999999,"","","","Y","","","North"]
[null,"Upper Sawmill","Central",491866.71,4041590,8611,"","","","Y","","","South"]
[2022,"Upper Webster Park","Central",492935.53470000002,4039576.3048999999,8764,null,null,"","Y","",null,"South","2023 Combined Upper & Lower Webster Parks"]
[null,"Urraca","South",500851,4029314,7968,"","","Y","","","","South"]
[null,"Ute Gulch","Central",494653,4041249,7866,"Y","Y","Y","","","","South"]
[null,"Ute Meadows","North",483892,4052643,9164,"","","","Y","","","North"]
[null,"Ute Park Pass","Central",493784,4042291,8258,"","","","Y","","","South"]
[null,"Ute Springs","Central",495177,4040114,7689,"","","","Y","","","South"]
[null,"Vaca","Central",499148,4041252,7415,"","","","Y","","","South"]
[null,"Visto Grande","Central",493983,4045668,7782,"","","","Y","","","South"]
[null,"Webster Lake","Central",497835,4037406,7122,"","","","Y","","","South"]
[null,"Webster Parks","Central",492939.82,4039509.952,8611.1200000000008,"","","","Y","Y","","South","2023 Combined Upper & Lower Webster Parks"]
[null,"Whistle Punk","Central",489586.4,4039243.3,10052,"","","","Y","","","South"]
[null,"Whiteman Vega","Valle Vidal",490820,4072011,8061,"","","Y","","","","North"]
[null,"Wild Horse","South",484174,4032864,10420,"","","","Y","","","South"]
[2019,"Wild Horse Park","South",481273.93,4030849.05,9883,null,null,"","Y","",null,"North"]
[null,"Window Rock","Central",null,null,8312,"","","","Y","Y","","South"]
[null,"Zastrow","South",500378,4025857,6946,"Y","","Y","","","Y","South"]
[null,null,null,"NOTE:  Coordinates/elevations  from 2017 Philmont's 2017 UTM.xlsm file.  These do not agree with Philmont's .kmz Google Earth file."]